16,0.005,1,120,8,0.005
0.13967816091954022,0.06516049109451041
0.19291954022988506,0.09250271697601681
0.2430344827586207,0.11838271371929612
0.28220689655172415,0.13999046876470447
0.311816091954023,0.15666775205927072
0.34041379310344827,0.1712120068782494
0.3629425287356322,0.18251003153597953
0.3798620689655172,0.19162574266141302
0.39291954022988507,0.197992374580247
0.4034942528735632,0.2036934672550702
0.4146206896551724,0.20850146312319
0.4242758620689655,0.21388213336991885
0.43144827586206896,0.21825012843341174
0.4381609195402299,0.22233238204169162
0.4439540229885057,0.22568290002842603
0.4496551724137931,0.2296522618958689
0.45471264367816094,0.23297263177668243
0.4590344827586207,0.23495028088042888
0.4609655172413793,0.23687351655704308
0.46427586206896554,0.23946565699415404
0.46648275862068966,0.2414283628407811
0.4703448275862069,0.24392384576614193
0.4732873563218391,0.24599991348708697
0.47558620689655173,0.2471336820612455
0.47770114942528735,0.24863749234455232
0.480367816091954,0.2504491700964263
0.4825747126436782,0.2519588465321981
0.4848735632183908,0.253628802267149
0.4862528735632184,0.254594078224319
0.4884597701149425,0.25678307708996867
0.4902068965517241,0.2586765984313677
0.49167816091954025,0.25949902964849486
0.4939770114942529,0.26062480079706896
0.49554022988505747,0.261871685073552
0.4959080459770115,0.26203648364269433
0.49701149425287355,0.2627310116745186
0.4982988505747126,0.2643964707775298
0.4976551724137931,0.26471721050792324
0.49903448275862067,0.26666627739456217
0.4998620689655172,0.26700896648724637
0.5021609195402299,0.2682285713699758
0.5027126436781609,0.2693853796656511
0.503816091954023,0.2698870916099483
0.5040919540229885,0.27007488851235845
0.5054712643678161,0.2710197841803427
0.5053793103448276,0.2714515024794712
0.5061149425287357,0.2722288409989807
0.5066666666666667,0.27301737249309554
0.5074942528735632,0.2733384038248938
0.5069425287356322,0.2728642484874792
0.5069425287356322,0.2741482545534123
0.5075862068965518,0.27550209302571416
0.5080459770114942,0.2759595989631433
0.5080459770114942,0.2760462665127953
0.5078620689655172,0.27664678575431856
0.5090574712643678,0.27740571087301474
0.5094252873563219,0.27751344242819526
0.5097011494252873,0.27777756642779705
0.5109885057471264,0.27875236240476425
0.5106206896551724,0.27888634365206044
0.5108045977011494,0.27912351365421395
0.511632183908046,0.27972786630357094
0.5120919540229885,0.2795816436923564
0.5128275862068965,0.28013319285054045
0.5131034482758621,0.28021701334384014
0.511816091954023,0.27973000496708816
0.5135632183908045,0.28097876385697707
0.5145747126436782,0.2817189339129103
0.5154942528735632,0.2817860637075677
0.5160459770114942,0.28345970892761296
0.5149425287356322,0.2830895567928083
0.5163218390804598,0.28435709026601896
0.5160459770114942,0.2840302769935597
0.5170574712643679,0.28458777505239435
0.5157701149425288,0.2849343880525223
0.5164137931034483,0.28449727005464204
0.5165977011494253,0.2846514148918369
0.5180689655172414,0.2852737808127016
0.5178850574712643,0.28601585934375245
0.5165057471264368,0.2860853618967163
0.5182528735632184,0.28649418940297616
0.5188045977011494,0.28681162492365025
0.5189885057471264,0.28777940946971287
0.5199080459770115,0.2884143687321643
0.5209195402298851,0.2889295103864733
0.5213793103448275,0.2887725331082992
0.5210114942528735,0.2895943752576624
0.520367816091954,0.2888780383242461
0.5208275862068965,0.2890735295849299
0.5209195402298851,0.28917479407576707
0.5212873563218391,0.28903790260424245
0.520367816091954,0.2892246217703917
0.5219310344827586,0.2897765439098168
0.5222988505747126,0.29007624769362683
0.5222988505747126,0.2906126855766896
0.5230344827586207,0.29086874143592695
0.5237701149425288,0.29224420885032265
0.5235862068965518,0.2921457945614477
0.5229425287356322,0.29188789497557394
0.5230344827586207,0.2921311835083849
0.5234022988505748,0.2925603548718162
0.5221149425287356,0.2917548635454395
0.5231264367816092,0.29172617965037256
0.5230344827586207,0.2920780949784086
0.5238620689655172,0.29248125543404585
0.5236781609195402,0.2922787008421849
0.5231264367816092,0.2923120583074557
0.5233103448275862,0.29187371257840855
0.5234022988505748,0.29242705254184376
0.5234942528735632,0.292489139488415
0.5240459770114942,0.2930143794734325
0.5241379310344828,0.29332861856166215
0.5239540229885058,0.2931086961699888
0.5233103448275862,0.2929040712321317
0.5251494252873563,0.2941648844280029
0.5251494252873563,0.29413379348840557
0.5255172413793103,0.29461640228417485
0.5254252873563219,0.29448331739069367
0.5258850574712643,0.29475228912047463
0.5254252873563219,0.29501994653198377
