16,0.1,120,8,0.1,"[0,0]","[32,16]",sgd,32,10
0.5411494252873563,0.3046587843247303,0.25149481967513476
0.5592643678160919,0.3180800266956488,0.2625888868263868
0.5610114942528736,0.31912433717929206,0.2634168065451718
0.5614712643678161,0.3210923323724962,0.26592250640648757
0.5550344827586207,0.3162240068256477,0.26235085016732373
0.551632183908046,0.3139915224797547,0.26052753380791105
0.5555862068965517,0.3119344461273339,0.25639610310381994
