16,0.005,0.1,120,8,0.005
0.5475862068965517,0.3110026272692558
0.5496091954022988,0.311750078988807
0.5485977011494253,0.3113898315218314
0.5484137931034483,0.3114016649771723
0.5485057471264367,0.3113326339855679
0.5481379310344827,0.3112386322120773
0.5486896551724137,0.3112272234967941
0.5489655172413793,0.3114866172828735
0.5493333333333333,0.31167108656513015
0.5491494252873563,0.3117649685896186
0.5492413793103448,0.3114606579645786
0.5489655172413793,0.31127453535883365
0.5496091954022988,0.311617615754061
0.5489655172413793,0.3112195903655315
0.5494252873563218,0.3111576715007172
0.5488735632183908,0.3109194912106472
0.5479540229885057,0.3106229917636692
0.5482298850574713,0.3110159554471053
0.5488735632183908,0.31109270565159935
0.5500689655172414,0.3117569983937368
0.5489655172413793,0.3113864428026554
0.5489655172413793,0.31123770501430015
0.5492413793103448,0.31098646710234007
0.5483218390804597,0.3108422048126967
0.5485977011494253,0.31144666260503245
0.5495172413793104,0.31194146651345916
0.5490574712643678,0.31215934944468293
0.5495172413793104,0.3124152490525841
0.5493333333333333,0.3119813847905579
0.5500689655172414,0.31219133996269205
0.5489655172413793,0.31203540002301833
0.5486896551724137,0.3116914355579347
0.5493333333333333,0.31235664036924127
0.5485977011494253,0.31161815658036635
0.5491494252873563,0.31198840063496047
0.5485057471264367,0.31200287303594204
0.5492413793103448,0.31144582013097444
0.5493333333333333,0.31147086421172665
0.5497931034482758,0.31206886580975096
0.5497011494252874,0.3119827650388488
0.5496091954022988,0.3116874577368391
0.5498850574712644,0.3116046765137785
0.5495172413793104,0.31258209666164527
0.5489655172413793,0.31154884856413295
0.5497931034482758,0.3122282731808548
0.5493333333333333,0.311568460530083
0.5487816091954023,0.3115213720258634
0.5482298850574713,0.3112497287065642
0.5481379310344827,0.31115603802071407
0.5481379310344827,0.31139783254268727
0.5475862068965517,0.3112072823579185
0.5492413793103448,0.31147510277147145
0.5488735632183908,0.3108869631641804
0.5490574712643678,0.31122751444327595
0.5492413793103448,0.31127282675153584
0.5499770114942528,0.31149329391645786
0.5504367816091954,0.3120783430200034
0.550528735632184,0.3118945822796728
0.5503448275862068,0.3120357791753973
0.550896551724138,0.3125472341539457
0.5520919540229885,0.3129116187776129
0.5520919540229885,0.31357675115835376
0.5523678160919541,0.31375017987510156
0.5525517241379311,0.3135340887241682
0.5519080459770115,0.31397982435931404
0.5532873563218391,0.3146671005428566
0.5524597701149425,0.3149823661164762
0.5527356321839081,0.3152216209356264
0.5527356321839081,0.3152832838306775
0.5531034482758621,0.3157578908578393
0.5540229885057472,0.31571423080933525
0.5540229885057472,0.3162282116274088
0.5554022988505747,0.3168943981881246
0.5554942528735632,0.3173401897924094
0.5576091954022988,0.31824785694576735
0.5566896551724138,0.31841264442227474
0.5567816091954023,0.31780442469010134
0.5574252873563218,0.3185580277257758
0.5577931034482758,0.3192014696731921
0.5572413793103448,0.318851955413449
0.5578850574712644,0.3194989022479086
0.5568735632183908,0.3187791907777307
0.5558620689655173,0.31878912914707885
0.5584367816091954,0.3195781862483503
0.5577011494252874,0.3194047232523324
0.5580689655172414,0.31909574985145844
0.5585287356321839,0.31987872425862235
0.5588965517241379,0.32019583478333685
0.559816091954023,0.3207306809420569
0.5600919540229885,0.3208071449673856
0.5604597701149425,0.32153423287116806
0.5594482758620689,0.3214918277505879
0.5600919540229885,0.3222439610184961
0.5601839080459771,0.32266303245750855
0.5604597701149425,0.32295016695257994
0.5607356321839081,0.3231716644118966
0.5612873563218391,0.3238290753983624
0.5622068965517242,0.32462682411409305
0.5625747126436782,0.324694760700806
0.5628505747126437,0.32474708972275923
0.5634942528735633,0.32502102605358507
0.5644137931034483,0.325202094440882
0.5645977011494253,0.3257363265442558
0.5648735632183908,0.32546924269966226
0.5657011494252874,0.3265105192347722
0.5656091954022988,0.326291629826299
0.5663448275862069,0.326587459436324
0.5650574712643678,0.32705419684430365
0.5651494252873563,0.3272669345219884
0.5656091954022988,0.3270962978025216
0.5663448275862069,0.3270947621635665
0.5668045977011494,0.3280763529749412
0.5669885057471264,0.3271653947410956
0.5672643678160919,0.32795142087755735
0.5678160919540229,0.3281682445624316
0.5676321839080459,0.3284986934171071
0.568735632183908,0.328890671275158
0.5679080459770115,0.3285180813376811
0.5666206896551724,0.3277415498498724
0.5672643678160919,0.32838364521986446
