16,0.005,0.5,120,8,0.005
0.29342528735632184,0.1681798185053507
0.399264367816092,0.23237560376011912
0.4492873563218391,0.26006112968873707
0.4766896551724138,0.27292779087596114
0.49370114942528737,0.2810666348571707
0.5046436781609196,0.28604347932854235
0.5117241379310344,0.2891553374678141
0.5164137931034483,0.29156814378270246
0.5227586206896552,0.2937759812693103
0.5252413793103449,0.2948904545505356
0.527448275862069,0.2956872873579832
0.5289195402298851,0.2968779388817189
0.5293793103448275,0.2971791119389355
0.5306666666666666,0.29756179344386563
0.5303908045977012,0.2982026218064972
0.5302988505747126,0.2987158285210752
0.5309425287356322,0.29827153022421593
0.5309425287356322,0.29903454890375114
0.5323218390804598,0.29968884469276874
0.5321379310344828,0.29863681732383723
0.5328735632183909,0.29970643398913344
0.5328735632183909,0.2996301571961899
0.5340689655172414,0.30025483716564644
0.5329655172413793,0.29986016240438773
0.5337011494252873,0.30121347922340924
0.5337931034482759,0.3020853138648998
0.5342528735632184,0.30240359643235326
0.5351724137931034,0.3026490297726181
0.5357241379310345,0.30276466949588104
0.536183908045977,0.30308135271055203
0.5357241379310345,0.3023839926171445
0.5341609195402299,0.30206721096364125
0.535080459770115,0.3025228497225176
0.5355402298850575,0.3015293615630663
0.535264367816092,0.3025795951211192
0.5355402298850575,0.30240297383801734
0.5366436781609195,0.30370857208644547
0.536183908045977,0.30343326153184563
0.5366436781609195,0.30408785482448336
0.5370114942528735,0.303530983146235
0.5381149425287356,0.30360661825676516
0.5385747126436782,0.3032440304411132
0.5378390804597701,0.3026862155410295
0.5379310344827586,0.30339382487725025
0.5375632183908046,0.30365182761286436
0.5388505747126436,0.30327505766558294
0.5375632183908046,0.30397700030481173
0.5365517241379311,0.30310113965769037
0.5360919540229885,0.3032660135374249
0.536367816091954,0.3038419418561912
0.5376551724137931,0.3047829805483468
0.5374712643678161,0.3042483542660588
0.5376551724137931,0.3047315956551084
0.5386666666666666,0.30345666660155773
0.5385747126436782,0.3036460691874659
0.5390344827586206,0.30404639182537957
0.5381149425287356,0.30490296783903265
0.5380229885057471,0.30470751163900034
0.5379310344827586,0.30528289609792897
0.5383908045977012,0.30527260223993224
0.5379310344827586,0.3047210680915917
0.5367356321839081,0.3035977524590288
0.5357241379310345,0.3036286201667032
0.5357241379310345,0.30400517029858515
0.5375632183908046,0.30402504683798764
0.5378390804597701,0.304942588631954
0.5381149425287356,0.30577977384354743
0.5383908045977012,0.30581502852993375
0.5389425287356322,0.30679861781825357
0.5379310344827586,0.306259432285926
0.5380229885057471,0.30632946553558327
0.5382068965517242,0.3064030752231751
0.5389425287356322,0.306987699605223
0.5397701149425287,0.3082357887942841
0.5388505747126436,0.3071518978593732
0.5385747126436782,0.3073394053212891
0.5384827586206896,0.3071424159331546
0.5388505747126436,0.30710673148430584
0.5393103448275862,0.30810963022006643
0.5392183908045977,0.30863421899793064
0.5397701149425287,0.3096740956243342
0.5397701149425287,0.3091963737821825
0.5404137931034483,0.30932319295411415
0.5397701149425287,0.30907865410521657
0.5405057471264367,0.3087663945822865
0.5406896551724137,0.3092612557184044
0.5405977011494253,0.30903020517923563
0.5404137931034483,0.3100724989446561
0.5414252873563219,0.3093590956501672
0.5412413793103448,0.3103059528019635
0.5412413793103448,0.31026704812437506
0.5418850574712644,0.31045265210441975
0.5419770114942529,0.310952252844885
0.5420689655172414,0.3111138816781499
0.5417011494252874,0.31097876644206035
0.5426206896551724,0.3108061210276729
0.5422528735632184,0.3112081680392987
0.543264367816092,0.31136501592034244
0.542712643678161,0.3109163932713682
0.543632183908046,0.3108942516045148
0.5431724137931034,0.3116981425377642
0.5429885057471264,0.31168077056916016
0.5447356321839081,0.31222108912624097
0.544,0.3114491136052863
0.543816091954023,0.31196929064081885
0.5440919540229885,0.3123404610764565
0.5447356321839081,0.313264495909453
0.5449195402298851,0.3125952439033436
0.5454712643678161,0.31270296365875316
0.5448275862068965,0.31189106804638894
0.5450114942528735,0.31217518850980963
0.5448275862068965,0.3116640861365508
0.5451034482758621,0.31163303853753094
0.5459310344827586,0.31175477915689725
0.5459310344827586,0.31241033323302964
0.5465747126436782,0.31290437455733616
0.5466666666666666,0.31285004441233033
0.5463908045977012,0.3130764859921718
0.5467586206896552,0.3135193378589872
0.5463908045977012,0.3136588326894664
