16,0.1,120,8,0.001,"[0,0]","[32,16]",sgd,32,10
0.23144827586206895,0.10767498451000039,0.09152461714642486
0.4929655172413793,0.292863269706159,0.2475931355512415
0.5480459770114943,0.3127598962315851,0.2588336365838889
0.550712643678161,0.31188453783332776,0.2571357203882044
0.5475862068965517,0.3112416067207106,0.25741252106820567
0.5479540229885057,0.31059319134061186,0.25659918283042793
0.5474022988505747,0.3107209367172374,0.25688949302435915
