16,0.005,0.05,120,8,0.005
0.5487816091954023,0.3115464927820137
0.5484137931034483,0.31130621460905644
0.5482298850574713,0.31129677559398566
0.5478620689655173,0.3110576457447412
0.5480459770114943,0.3110517405610881
0.5482298850574713,0.31101422768694315
0.5477701149425287,0.3109223591637579
0.5472183908045977,0.3109601170968497
0.5473103448275862,0.31052408843473667
0.5480459770114943,0.310647747807276
0.5474942528735632,0.3102074544560129
0.5479540229885057,0.3100220155427822
0.5474022988505747,0.3103268855791385
0.5474022988505747,0.31004153416973546
0.5468505747126436,0.30998347161323725
0.5466666666666666,0.3099621906322797
0.5463908045977012,0.30982436562727694
0.5468505747126436,0.3101488709805225
0.5471264367816092,0.3102852291003646
0.5472183908045977,0.3095749238799802
0.5481379310344827,0.31020007648534753
0.5476781609195402,0.3104196302681935
0.5485057471264367,0.31041331749224593
0.5484137931034483,0.3103936639867907
0.5487816091954023,0.31034950716621845
0.5489655172413793,0.310627218266172
0.5472183908045977,0.3098494766553237
0.5479540229885057,0.3102974848480805
0.5483218390804597,0.3106514743941173
0.5482298850574713,0.3108245848628949
0.5468505747126436,0.3101132391250276
0.5478620689655173,0.3104350055938319
0.5472183908045977,0.3102788890910178
0.5483218390804597,0.3108348527933258
0.5485057471264367,0.3110206781385393
0.5486896551724137,0.3109561250652439
0.5491494252873563,0.31014683124778136
0.5492413793103448,0.3104754612282926
0.5497011494252874,0.3110220242216766
0.5501609195402298,0.31134300366635365
0.5499770114942528,0.3113181616223394
0.5503448275862068,0.3110710108269181
0.5498850574712644,0.3111579703073983
0.5496091954022988,0.31138499531873554
0.5489655172413793,0.3110336710649322
0.5491494252873563,0.31120711205850193
0.5497931034482758,0.3109960604145742
0.5494252873563218,0.3103767260630894
0.5485977011494253,0.31049703083126223
0.5485057471264367,0.3108112577273149
0.5491494252873563,0.31087744442886706
0.5492413793103448,0.3108707412453665
0.5494252873563218,0.31081018766548785
0.5500689655172414,0.31096799811392345
0.5499770114942528,0.3112902713442282
0.5488735632183908,0.31070963739111357
0.5497931034482758,0.3107806455078363
0.5476781609195402,0.3102218086906743
0.5482298850574713,0.310368111345981
0.5482298850574713,0.3103017008678601
0.5483218390804597,0.31073214391781256
0.5487816091954023,0.3105739091569247
0.5485977011494253,0.3106464388413524
0.5497011494252874,0.31099188618698986
0.5503448275862068,0.31123045392234727
0.551448275862069,0.31147039534590437
0.551080459770115,0.31131878626533377
0.5508045977011494,0.31161761068113525
0.5515402298850575,0.31185007581669066
0.5519080459770115,0.3118475855770716
0.551264367816092,0.3118889393025107
0.5524597701149425,0.3122123543261782
0.5532873563218391,0.31240519441911846
0.5526436781609195,0.3127191870408775
0.5533793103448276,0.3138771542871292
0.5535632183908046,0.31377287288749744
0.5527356321839081,0.3136549789525152
0.5537471264367816,0.3136690872101899
0.5546666666666666,0.31417307465750854
0.5550344827586207,0.31482629394350725
0.5553103448275862,0.3158048504074266
0.5551264367816092,0.31632165734280726
0.5548505747126437,0.31499578078734175
0.5556781609195403,0.31625167285207406
0.5553103448275862,0.3157614416289969
0.5552183908045977,0.3160421411491549
0.5557701149425287,0.3164152314689489
0.5554022988505747,0.31745739283552404
0.5547586206896552,0.3171115323195084
0.5575172413793104,0.31757275657236667
0.5572413793103448,0.31766781190026616
0.5586206896551724,0.31804037095776766
0.5584367816091954,0.31834826761289325
0.559816091954023,0.3189045190550735
0.5599080459770115,0.31935927288489546
0.5610114942528736,0.31957127810560415
0.5599080459770115,0.31949818928883367
0.5611034482758621,0.32066820114118416
0.5609195402298851,0.32018620300445116
0.5633103448275862,0.320841333937175
0.5639540229885057,0.32021837911020934
0.5636781609195403,0.3209965747278855
0.5641379310344827,0.3217541631094412
0.5645977011494253,0.32195179596837625
0.5647816091954023,0.32245333926195885
0.5663448275862069,0.3231687846488308
0.5662528735632184,0.3236555809189319
0.5671724137931035,0.3245123758477767
0.5682758620689655,0.3246609774258575
0.5693793103448276,0.32488070767051047
0.568551724137931,0.3250279339101385
0.5693793103448276,0.3254383780854346
0.5686436781609195,0.3249246911969925
0.5694712643678161,0.3258552662561982
0.5689195402298851,0.32570901969078475
0.5700229885057472,0.32684890960444585
0.5703908045977012,0.3274320935272034
0.5710344827586207,0.3275441085973975
0.5721379310344827,0.32787068808424474
0.5715862068965517,0.32773525484927607
