64,0.005,0.1,120,8,0.005
0.5339770114942529,0.30716368819710954
0.5450114942528735,0.3104504103799669
0.5462988505747126,0.31095469154829347
0.5472183908045977,0.3112046456531924
0.5469425287356322,0.31134703192606483
0.5481379310344827,0.31158631890143146
0.5486896551724137,0.3116503660957633
0.5485057471264367,0.31118551442612696
0.5475862068965517,0.31087702487787433
0.5478620689655173,0.3108614948510903
0.5476781609195402,0.3111010988822581
0.5482298850574713,0.31170260201794525
0.5480459770114943,0.31121988950801033
0.5485057471264367,0.31106607532357816
0.5481379310344827,0.31078733301071554
0.5474942528735632,0.3109909942761609
0.5488735632183908,0.3113510896153476
0.5487816091954023,0.3119223949480591
0.5488735632183908,0.31228049517260625
0.5490574712643678,0.312077922831436
0.5485057471264367,0.31158291128308924
0.5479540229885057,0.31161233712669384
0.5485057471264367,0.31170966650378074
0.5481379310344827,0.3117119808719423
0.5487816091954023,0.3119419840814032
0.5492413793103448,0.31139574830472116
0.5496091954022988,0.3114858634259504
0.5500689655172414,0.3112946932625666
0.5502528735632184,0.3116260158548294
0.5492413793103448,0.31130522600099564
0.5494252873563218,0.31154781282102917
0.5494252873563218,0.3119371309660355
0.5495172413793104,0.3125407706185208
0.5484137931034483,0.3118976088462801
0.5487816091954023,0.31212597310302476
0.5493333333333333,0.3126695377028961
0.5490574712643678,0.3119989113771953
0.5493333333333333,0.3121918595747814
0.5497931034482758,0.31251972348372575
0.5501609195402298,0.31307084987824124
0.5504367816091954,0.3131136449207627
0.5509885057471264,0.3136125095565214
0.5503448275862068,0.3135589950759315
0.5511724137931034,0.31325953832989306
0.551080459770115,0.3133402391183303
0.5519080459770115,0.31405662247349436
0.551632183908046,0.31352488139749296
0.5526436781609195,0.3140511865177855
0.551080459770115,0.3133409505175501
0.5525517241379311,0.313429506115832
0.5520919540229885,0.3134997329385844
0.5534712643678161,0.31410077515802226
0.5548505747126437,0.314936405260268
0.5544827586206896,0.31519507498136873
0.5549425287356322,0.31495811359857223
0.5549425287356322,0.31518542520441345
0.5539310344827586,0.31505340013436983
0.5549425287356322,0.31662588622845766
0.5549425287356322,0.3169564345820002
0.5554942528735632,0.3173379586346993
0.5568735632183908,0.3176594512305453
0.5568735632183908,0.3178769598098837
0.5579770114942528,0.31797582561219184
0.5586206896551724,0.31837319576396783
0.5588045977011494,0.3188379645428387
0.5579770114942528,0.3194197275376382
0.5589885057471264,0.3198934217920261
0.5596321839080459,0.3207144311010171
0.56,0.32096678393483136
0.5606436781609195,0.32118293995666536
0.5611954022988506,0.32130132825488467
0.5610114942528736,0.3208651026725153
0.5613793103448276,0.32146915213373833
0.5625747126436782,0.3222218483642435
0.5625747126436782,0.3223153741888738
0.5633103448275862,0.3231297443167508
0.5649655172413793,0.3233081717899604
0.5647816091954023,0.3234120448053926
0.5653333333333334,0.3233722108787632
0.5654252873563218,0.3235931836879951
0.5675402298850575,0.3248816093247889
0.5680919540229885,0.3256263852641378
0.568183908045977,0.3257405861725463
0.5676321839080459,0.32590991923778106
0.5684597701149425,0.3255055868158389
0.5691034482758621,0.32555887755160623
0.568183908045977,0.32609072183862803
0.568735632183908,0.3268519163834357
0.5688275862068966,0.3269549561705104
0.5708505747126437,0.3271089617062348
0.5713103448275862,0.3279252888721774
0.5717701149425287,0.3279292339989323
0.5724137931034483,0.3288038801320252
0.5719540229885057,0.3285200927356741
0.5717701149425287,0.32840682573141844
0.5723218390804597,0.32853088818381626
0.5731494252873564,0.328739305075411
0.5732413793103448,0.3288735628005512
0.5736091954022988,0.3295256679524192
0.5735172413793104,0.3294966750113874
0.5733333333333334,0.3295693417268221
0.5747126436781609,0.3303944032336588
0.5741609195402299,0.33017662617515725
0.5754482758620689,0.3305643873432303
0.5752643678160919,0.330819241164823
0.5748045977011494,0.3304711392265616
0.5746206896551724,0.33058424184099094
0.5743448275862069,0.3308396461267151
0.5755402298850575,0.33135789147512845
0.5753563218390805,0.3309996388769859
0.5746206896551724,0.33052671804748185
0.5752643678160919,0.3301883757718106
0.5748045977011494,0.3305999926385671
0.5750804597701149,0.33098938626881896
0.5752643678160919,0.33080383738360186
0.5764597701149425,0.33110459443847756
0.5756321839080459,0.330435942814724
0.5757241379310345,0.3305676425542374
0.5753563218390805,0.3308355510746412
0.5753563218390805,0.3310139438240334
