{
	"JSON": {
		"ID": "1ee82412-f308-6b61-9485-c682467ffa8c",
		"label": "",
		"comment": "UUID6 is used"
	},
	"part": {
		"name": "touch-down_bearing_testrig_2",
		"distance to motor bearing": {
			"value": 250,
			"unit": "millimeter"
		}
	}
}