rtds2gpu: expose status register

4 jobs for feature/hls-rtds2gpu in 3 minutes and 25 seconds (queued for 1 second)
Status Job ID Name Coverage
  Prepare
passed #179098
linux shell
docker-dev

00:00:28

 
  Build
failed #179099
docker
build:source

00:02:57

 
  Test
skipped #179101
villas-fpga
test:unit-hardware
skipped #179100
docker
test:unit-software
 
Name Stage Failure
failed
build:source Build
/builds/acs/public/villas/VILLASfpga/tests/rtds2gpu.cpp:37:10: fatal error: villas/gpu.hpp: No such file or directory
#include <villas/gpu.hpp>
^~~~~~~~~~~~~~~~
compilation terminated.
make[2]: *** [tests/CMakeFiles/unit-tests.dir/build.make:207: tests/CMakeFiles/unit-tests.dir/rtds2gpu.cpp.o] Error 1
make[2]: *** Waiting for unfinished jobs....
make[1]: *** [CMakeFiles/Makefile2:199: tests/CMakeFiles/unit-tests.dir/all] Error 2
make: *** [Makefile:152: all] Error 2
ERROR: Job failed: exit code 1