fix code-style

4 jobs for fix-codestyle in 33 seconds (queued for 1 second)
Name Stage Failure
failed
build:source Build

3 errors detected in the compilation of "/tmp/tmpxft_000002b8_00000000-6_kernels.cpp1.ii".
make[2]: *** [gpu/CMakeFiles/villas-gpu.dir/build.make:96: gpu/CMakeFiles/villas-gpu.dir/src/kernels.cu.o] Error 1
make[2]: *** Waiting for unfinished jobs....
15 errors detected in the compilation of "/tmp/tmpxft_000002b7_00000000-6_gpu.cpp1.ii".
make[2]: *** [gpu/CMakeFiles/villas-gpu.dir/build.make:83: gpu/CMakeFiles/villas-gpu.dir/src/gpu.cpp.o] Error 1
make[1]: *** [CMakeFiles/Makefile2:245: gpu/CMakeFiles/villas-gpu.dir/all] Error 2
make: *** [Makefile:172: all] Error 2
ERROR: Job failed: exit code 1