<?xml version="1.0" encoding="UTF-8" standalone="no"?>
<!-- Created with Inkscape (http://www.inkscape.org/) -->

<svg
   xmlns:osb="http://www.openswatchbook.org/uri/2009/osb"
   xmlns:dc="http://purl.org/dc/elements/1.1/"
   xmlns:cc="http://creativecommons.org/ns#"
   xmlns:rdf="http://www.w3.org/1999/02/22-rdf-syntax-ns#"
   xmlns:svg="http://www.w3.org/2000/svg"
   xmlns="http://www.w3.org/2000/svg"
   xmlns:sodipodi="http://sodipodi.sourceforge.net/DTD/sodipodi-0.dtd"
   xmlns:inkscape="http://www.inkscape.org/namespaces/inkscape"
   width="203.54483mm"
   height="82.177002mm"
   viewBox="0 0 203.54483 82.177002"
   version="1.1"
   id="svg4757"
   sodipodi:docname="VS_CS_R4_HC.svg"
   inkscape:version="0.92.2 (5c3e80d, 2017-08-06)">
  <defs
     id="defs4751">
    <linearGradient
       osb:paint="solid"
       id="linearGradient5333">
      <stop
         id="stop5335"
         offset="0"
         style="stop-color:#c50000;stop-opacity:1;" />
    </linearGradient>
    <linearGradient
       osb:paint="solid"
       id="linearGradient5327">
      <stop
         id="stop5329"
         offset="0"
         style="stop-color:#d70000;stop-opacity:1;" />
    </linearGradient>
    <marker
       inkscape:isstock="true"
       style="overflow:visible"
       id="marker6768"
       refX="0"
       refY="0"
       orient="auto"
       inkscape:stockid="Arrow1Mend">
      <path
         inkscape:connector-curvature="0"
         transform="matrix(-0.4,0,0,-0.4,-4,0)"
         style="fill:#ff0000;fill-opacity:0.94117647;fill-rule:evenodd;stroke:#ff0000;stroke-width:1.00000003pt;stroke-opacity:0.94117647"
         d="M 0,0 5,-5 -12.5,0 5,5 Z"
         id="path6770" />
    </marker>
    <marker
       inkscape:stockid="Arrow1Mend"
       orient="auto"
       refY="0"
       refX="0"
       id="marker6542"
       style="overflow:visible"
       inkscape:isstock="true">
      <path
         id="path6544"
         d="M 0,0 5,-5 -12.5,0 5,5 Z"
         style="fill:#000000;fill-opacity:1;fill-rule:evenodd;stroke:#000000;stroke-width:1.00000003pt;stroke-opacity:1"
         transform="matrix(-0.4,0,0,-0.4,-4,0)"
         inkscape:connector-curvature="0" />
    </marker>
    <marker
       inkscape:isstock="true"
       style="overflow:visible"
       id="marker7065"
       refX="0"
       refY="0"
       orient="auto"
       inkscape:stockid="Arrow1Mend">
      <path
         inkscape:connector-curvature="0"
         transform="matrix(-0.4,0,0,-0.4,-4,0)"
         style="fill:#000000;fill-opacity:1;fill-rule:evenodd;stroke:#000000;stroke-width:1.00000003pt;stroke-opacity:1"
         d="M 0,0 5,-5 -12.5,0 5,5 Z"
         id="path7067" />
    </marker>
    <marker
       inkscape:stockid="Arrow1Mstart"
       orient="auto"
       refY="0"
       refX="0"
       id="marker6833"
       style="overflow:visible"
       inkscape:isstock="true">
      <path
         inkscape:connector-curvature="0"
         id="path6835"
         d="M 0,0 5,-5 -12.5,0 5,5 Z"
         style="fill:#000000;fill-opacity:1;fill-rule:evenodd;stroke:#000000;stroke-width:1.00000003pt;stroke-opacity:1"
         transform="matrix(0.4,0,0,0.4,4,0)" />
    </marker>
    <marker
       inkscape:isstock="true"
       style="overflow:visible"
       id="marker5585"
       refX="0"
       refY="0"
       orient="auto"
       inkscape:stockid="Arrow1Lend">
      <path
         inkscape:connector-curvature="0"
         transform="matrix(-0.8,0,0,-0.8,-10,0)"
         style="fill:#000000;fill-opacity:1;fill-rule:evenodd;stroke:#000000;stroke-width:1.00000003pt;stroke-opacity:1"
         d="M 0,0 5,-5 -12.5,0 5,5 Z"
         id="path5587" />
    </marker>
    <marker
       inkscape:isstock="true"
       style="overflow:visible"
       id="TriangleOutL"
       refX="0"
       refY="0"
       orient="auto"
       inkscape:stockid="TriangleOutL">
      <path
         inkscape:connector-curvature="0"
         transform="scale(0.8)"
         style="fill:#000000;fill-opacity:1;fill-rule:evenodd;stroke:#000000;stroke-width:1.00000003pt;stroke-opacity:1"
         d="M 5.77,0 -2.88,5 V -5 Z"
         id="path5355" />
    </marker>
    <marker
       inkscape:isstock="true"
       style="overflow:visible"
       id="Arrow2Lend"
       refX="0"
       refY="0"
       orient="auto"
       inkscape:stockid="Arrow2Lend">
      <path
         inkscape:connector-curvature="0"
         transform="matrix(-1.1,0,0,-1.1,-1.1,0)"
         d="M 8.7185878,4.0337352 -2.2072895,0.01601326 8.7185884,-4.0017078 c -1.7454984,2.3720609 -1.7354408,5.6174519 -6e-7,8.035443 z"
         style="fill:#000000;fill-opacity:1;fill-rule:evenodd;stroke:#000000;stroke-width:0.625;stroke-linejoin:round;stroke-opacity:1"
         id="path5234" />
    </marker>
    <marker
       inkscape:isstock="true"
       style="overflow:visible"
       id="Arrow1Send"
       refX="0"
       refY="0"
       orient="auto"
       inkscape:stockid="Arrow1Send">
      <path
         inkscape:connector-curvature="0"
         transform="matrix(-0.2,0,0,-0.2,-1.2,0)"
         style="fill:#000000;fill-opacity:1;fill-rule:evenodd;stroke:#000000;stroke-width:1.00000003pt;stroke-opacity:1"
         d="M 0,0 5,-5 -12.5,0 5,5 Z"
         id="path5228" />
    </marker>
    <marker
       inkscape:isstock="true"
       style="overflow:visible"
       id="Arrow1Lend"
       refX="0"
       refY="0"
       orient="auto"
       inkscape:stockid="Arrow1Lend">
      <path
         inkscape:connector-curvature="0"
         transform="matrix(-0.8,0,0,-0.8,-10,0)"
         style="fill:#000000;fill-opacity:1;fill-rule:evenodd;stroke:#000000;stroke-width:1.00000003pt;stroke-opacity:1"
         d="M 0,0 5,-5 -12.5,0 5,5 Z"
         id="path5216" />
    </marker>
    <pattern
       id="EMFhbasepattern"
       patternUnits="userSpaceOnUse"
       width="6"
       height="6"
       x="0"
       y="0" />
    <pattern
       id="EMFhbasepattern-7"
       patternUnits="userSpaceOnUse"
       width="6"
       height="6"
       x="0"
       y="0" />
    <pattern
       id="EMFhbasepattern-9"
       patternUnits="userSpaceOnUse"
       width="6"
       height="6"
       x="0"
       y="0" />
    <pattern
       id="EMFhbasepattern-94"
       patternUnits="userSpaceOnUse"
       width="6"
       height="6"
       x="0"
       y="0" />
    <marker
       style="overflow:visible"
       id="Arrow1Mend"
       refX="0"
       refY="0"
       orient="auto"
       inkscape:stockid="Arrow1Mend">
      <path
         transform="matrix(-0.4,0,0,-0.4,-4,0)"
         style="fill-rule:evenodd;stroke:#000000;stroke-width:1.00000003pt"
         d="M 0,0 5,-5 -12.5,0 5,5 Z"
         id="path3774"
         inkscape:connector-curvature="0" />
    </marker>
    <marker
       style="overflow:visible"
       id="Arrow1Mend-7"
       refX="0"
       refY="0"
       orient="auto"
       inkscape:stockid="Arrow1Mend">
      <path
         transform="matrix(-0.4,0,0,-0.4,-4,0)"
         style="fill-rule:evenodd;stroke:#000000;stroke-width:1.00000003pt"
         d="M 0,0 5,-5 -12.5,0 5,5 Z"
         id="path3774-6"
         inkscape:connector-curvature="0" />
    </marker>
    <marker
       style="overflow:visible"
       id="Arrow1Mend-78"
       refX="0"
       refY="0"
       orient="auto"
       inkscape:stockid="Arrow1Mend">
      <path
         transform="matrix(-0.4,0,0,-0.4,-4,0)"
         style="fill-rule:evenodd;stroke:#000000;stroke-width:1.00000003pt"
         d="M 0,0 5,-5 -12.5,0 5,5 Z"
         id="path3774-3"
         inkscape:connector-curvature="0" />
    </marker>
    <marker
       style="overflow:visible"
       id="Arrow1Mend-4"
       refX="0"
       refY="0"
       orient="auto"
       inkscape:stockid="Arrow1Mend">
      <path
         transform="matrix(-0.4,0,0,-0.4,-4,0)"
         style="fill-rule:evenodd;stroke:#000000;stroke-width:1.00000003pt"
         d="M 0,0 5,-5 -12.5,0 5,5 Z"
         id="path3774-9"
         inkscape:connector-curvature="0" />
    </marker>
    <marker
       style="overflow:visible"
       id="Arrow1Mend-5"
       refX="0"
       refY="0"
       orient="auto"
       inkscape:stockid="Arrow1Mend">
      <path
         transform="matrix(-0.4,0,0,-0.4,-4,0)"
         style="fill-rule:evenodd;stroke:#000000;stroke-width:1.00000003pt"
         d="M 0,0 5,-5 -12.5,0 5,5 Z"
         id="path3774-60"
         inkscape:connector-curvature="0" />
    </marker>
    <marker
       inkscape:isstock="true"
       style="overflow:visible"
       id="Arrow2Send"
       refX="0"
       refY="0"
       orient="auto"
       inkscape:stockid="Arrow2Send">
      <path
         transform="matrix(-0.3,0,0,-0.3,0.69,0)"
         d="M 8.7185878,4.0337352 -2.2072895,0.01601326 8.7185884,-4.0017078 c -1.7454984,2.3720609 -1.7354408,5.6174519 -6e-7,8.035443 z"
         style="fill:#ff0000;fill-opacity:1;fill-rule:evenodd;stroke:#ff0000;stroke-width:0.625;stroke-linejoin:round;stroke-opacity:1"
         id="path945"
         inkscape:connector-curvature="0" />
    </marker>
    <marker
       inkscape:isstock="true"
       style="overflow:visible"
       id="Arrow2Send-5"
       refX="0"
       refY="0"
       orient="auto"
       inkscape:stockid="Arrow2Send">
      <path
         transform="matrix(-0.3,0,0,-0.3,0.69,0)"
         d="M 8.7185878,4.0337352 -2.2072895,0.01601326 8.7185884,-4.0017078 c -1.7454984,2.3720609 -1.7354408,5.6174519 -6e-7,8.035443 z"
         style="fill:#ff0000;fill-opacity:1;fill-rule:evenodd;stroke:#ff0000;stroke-width:0.625;stroke-linejoin:round;stroke-opacity:1"
         id="path945-1"
         inkscape:connector-curvature="0" />
    </marker>
    <marker
       inkscape:isstock="true"
       style="overflow:visible"
       id="Arrow2Send-5-1"
       refX="0"
       refY="0"
       orient="auto"
       inkscape:stockid="Arrow2Send">
      <path
         transform="matrix(-0.3,0,0,-0.3,0.69,0)"
         d="M 8.7185878,4.0337352 -2.2072895,0.01601326 8.7185884,-4.0017078 c -1.7454984,2.3720609 -1.7354408,5.6174519 -6e-7,8.035443 z"
         style="fill:#ff0000;fill-opacity:1;fill-rule:evenodd;stroke:#ff0000;stroke-width:0.625;stroke-linejoin:round;stroke-opacity:1"
         id="path945-1-3"
         inkscape:connector-curvature="0" />
    </marker>
    <marker
       inkscape:isstock="true"
       style="overflow:visible"
       id="Arrow2Send-53"
       refX="0"
       refY="0"
       orient="auto"
       inkscape:stockid="Arrow2Send">
      <path
         transform="matrix(-0.3,0,0,-0.3,0.69,0)"
         d="M 8.7185878,4.0337352 -2.2072895,0.01601326 8.7185884,-4.0017078 c -1.7454984,2.3720609 -1.7354408,5.6174519 -6e-7,8.035443 z"
         style="fill:#ff0000;fill-opacity:1;fill-rule:evenodd;stroke:#ff0000;stroke-width:0.625;stroke-linejoin:round;stroke-opacity:1"
         id="path945-11"
         inkscape:connector-curvature="0" />
    </marker>
    <marker
       inkscape:isstock="true"
       style="overflow:visible"
       id="marker6768-6"
       refX="0"
       refY="0"
       orient="auto"
       inkscape:stockid="Arrow1Mend">
      <path
         inkscape:connector-curvature="0"
         transform="matrix(-0.4,0,0,-0.4,-4,0)"
         style="fill:#ff0000;fill-opacity:0.94117647;fill-rule:evenodd;stroke:#ff0000;stroke-width:1.00000003pt;stroke-opacity:0.94117647"
         d="M 0,0 5,-5 -12.5,0 5,5 Z"
         id="path6770-2" />
    </marker>
    <marker
       inkscape:stockid="Arrow1Mend"
       orient="auto"
       refY="0"
       refX="0"
       id="marker6542-5"
       style="overflow:visible"
       inkscape:isstock="true">
      <path
         id="path6544-2"
         d="M 0,0 5,-5 -12.5,0 5,5 Z"
         style="fill:#000000;fill-opacity:1;fill-rule:evenodd;stroke:#000000;stroke-width:1.00000003pt;stroke-opacity:1"
         transform="matrix(-0.4,0,0,-0.4,-4,0)"
         inkscape:connector-curvature="0" />
    </marker>
    <marker
       inkscape:isstock="true"
       style="overflow:visible"
       id="marker7065-1"
       refX="0"
       refY="0"
       orient="auto"
       inkscape:stockid="Arrow1Mend">
      <path
         inkscape:connector-curvature="0"
         transform="matrix(-0.4,0,0,-0.4,-4,0)"
         style="fill:#000000;fill-opacity:1;fill-rule:evenodd;stroke:#000000;stroke-width:1.00000003pt;stroke-opacity:1"
         d="M 0,0 5,-5 -12.5,0 5,5 Z"
         id="path7067-8" />
    </marker>
    <marker
       inkscape:stockid="Arrow1Mstart"
       orient="auto"
       refY="0"
       refX="0"
       id="marker6833-5"
       style="overflow:visible"
       inkscape:isstock="true">
      <path
         inkscape:connector-curvature="0"
         id="path6835-1"
         d="M 0,0 5,-5 -12.5,0 5,5 Z"
         style="fill:#000000;fill-opacity:1;fill-rule:evenodd;stroke:#000000;stroke-width:1.00000003pt;stroke-opacity:1"
         transform="matrix(0.4,0,0,0.4,4,0)" />
    </marker>
    <marker
       inkscape:isstock="true"
       style="overflow:visible"
       id="marker5585-3"
       refX="0"
       refY="0"
       orient="auto"
       inkscape:stockid="Arrow1Lend">
      <path
         inkscape:connector-curvature="0"
         transform="matrix(-0.8,0,0,-0.8,-10,0)"
         style="fill:#000000;fill-opacity:1;fill-rule:evenodd;stroke:#000000;stroke-width:1.00000003pt;stroke-opacity:1"
         d="M 0,0 5,-5 -12.5,0 5,5 Z"
         id="path5587-0" />
    </marker>
    <marker
       inkscape:isstock="true"
       style="overflow:visible"
       id="TriangleOutL-9"
       refX="0"
       refY="0"
       orient="auto"
       inkscape:stockid="TriangleOutL">
      <path
         inkscape:connector-curvature="0"
         transform="scale(0.8)"
         style="fill:#000000;fill-opacity:1;fill-rule:evenodd;stroke:#000000;stroke-width:1.00000003pt;stroke-opacity:1"
         d="M 5.77,0 -2.88,5 V -5 Z"
         id="path5355-1" />
    </marker>
    <marker
       inkscape:isstock="true"
       style="overflow:visible"
       id="Arrow2Lend-9"
       refX="0"
       refY="0"
       orient="auto"
       inkscape:stockid="Arrow2Lend">
      <path
         inkscape:connector-curvature="0"
         transform="matrix(-1.1,0,0,-1.1,-1.1,0)"
         d="M 8.7185878,4.0337352 -2.2072895,0.01601326 8.7185884,-4.0017078 c -1.7454984,2.3720609 -1.7354408,5.6174519 -6e-7,8.035443 z"
         style="fill:#000000;fill-opacity:1;fill-rule:evenodd;stroke:#000000;stroke-width:0.625;stroke-linejoin:round;stroke-opacity:1"
         id="path5234-4" />
    </marker>
    <marker
       inkscape:isstock="true"
       style="overflow:visible"
       id="Arrow1Send-1"
       refX="0"
       refY="0"
       orient="auto"
       inkscape:stockid="Arrow1Send">
      <path
         inkscape:connector-curvature="0"
         transform="matrix(-0.2,0,0,-0.2,-1.2,0)"
         style="fill:#000000;fill-opacity:1;fill-rule:evenodd;stroke:#000000;stroke-width:1.00000003pt;stroke-opacity:1"
         d="M 0,0 5,-5 -12.5,0 5,5 Z"
         id="path5228-0" />
    </marker>
    <marker
       inkscape:isstock="true"
       style="overflow:visible"
       id="Arrow1Lend-2"
       refX="0"
       refY="0"
       orient="auto"
       inkscape:stockid="Arrow1Lend">
      <path
         inkscape:connector-curvature="0"
         transform="matrix(-0.8,0,0,-0.8,-10,0)"
         style="fill:#000000;fill-opacity:1;fill-rule:evenodd;stroke:#000000;stroke-width:1.00000003pt;stroke-opacity:1"
         d="M 0,0 5,-5 -12.5,0 5,5 Z"
         id="path5216-5" />
    </marker>
    <pattern
       id="EMFhbasepattern-4"
       patternUnits="userSpaceOnUse"
       width="6"
       height="6"
       x="0"
       y="0" />
    <pattern
       id="EMFhbasepattern-7-9"
       patternUnits="userSpaceOnUse"
       width="6"
       height="6"
       x="0"
       y="0" />
    <pattern
       id="EMFhbasepattern-9-6"
       patternUnits="userSpaceOnUse"
       width="6"
       height="6"
       x="0"
       y="0" />
    <pattern
       id="EMFhbasepattern-94-6"
       patternUnits="userSpaceOnUse"
       width="6"
       height="6"
       x="0"
       y="0" />
    <marker
       style="overflow:visible"
       id="Arrow1Mend-3"
       refX="0"
       refY="0"
       orient="auto"
       inkscape:stockid="Arrow1Mend">
      <path
         transform="matrix(-0.4,0,0,-0.4,-4,0)"
         style="fill-rule:evenodd;stroke:#000000;stroke-width:1.00000003pt"
         d="M 0,0 5,-5 -12.5,0 5,5 Z"
         id="path3774-2"
         inkscape:connector-curvature="0" />
    </marker>
    <marker
       style="overflow:visible"
       id="Arrow1Mend-7-0"
       refX="0"
       refY="0"
       orient="auto"
       inkscape:stockid="Arrow1Mend">
      <path
         transform="matrix(-0.4,0,0,-0.4,-4,0)"
         style="fill-rule:evenodd;stroke:#000000;stroke-width:1.00000003pt"
         d="M 0,0 5,-5 -12.5,0 5,5 Z"
         id="path3774-6-3"
         inkscape:connector-curvature="0" />
    </marker>
    <marker
       style="overflow:visible"
       id="Arrow1Mend-78-6"
       refX="0"
       refY="0"
       orient="auto"
       inkscape:stockid="Arrow1Mend">
      <path
         transform="matrix(-0.4,0,0,-0.4,-4,0)"
         style="fill-rule:evenodd;stroke:#000000;stroke-width:1.00000003pt"
         d="M 0,0 5,-5 -12.5,0 5,5 Z"
         id="path3774-3-7"
         inkscape:connector-curvature="0" />
    </marker>
    <marker
       style="overflow:visible"
       id="Arrow1Mend-4-7"
       refX="0"
       refY="0"
       orient="auto"
       inkscape:stockid="Arrow1Mend">
      <path
         transform="matrix(-0.4,0,0,-0.4,-4,0)"
         style="fill-rule:evenodd;stroke:#000000;stroke-width:1.00000003pt"
         d="M 0,0 5,-5 -12.5,0 5,5 Z"
         id="path3774-9-3"
         inkscape:connector-curvature="0" />
    </marker>
    <marker
       style="overflow:visible"
       id="Arrow1Mend-5-6"
       refX="0"
       refY="0"
       orient="auto"
       inkscape:stockid="Arrow1Mend">
      <path
         transform="matrix(-0.4,0,0,-0.4,-4,0)"
         style="fill-rule:evenodd;stroke:#000000;stroke-width:1.00000003pt"
         d="M 0,0 5,-5 -12.5,0 5,5 Z"
         id="path3774-60-9"
         inkscape:connector-curvature="0" />
    </marker>
    <marker
       style="overflow:visible"
       id="Arrow1Mend-3-5"
       refX="0"
       refY="0"
       orient="auto"
       inkscape:stockid="Arrow1Mend">
      <path
         transform="matrix(-0.4,0,0,-0.4,-4,0)"
         style="fill-rule:evenodd;stroke:#000000;stroke-width:1.00000003pt"
         d="M 0,0 5,-5 -12.5,0 5,5 Z"
         id="path3774-2-1"
         inkscape:connector-curvature="0" />
    </marker>
  </defs>
  <sodipodi:namedview
     id="base"
     pagecolor="#ffffff"
     bordercolor="#666666"
     borderopacity="1.0"
     inkscape:pageopacity="0.0"
     inkscape:pageshadow="2"
     inkscape:zoom="0.98994949"
     inkscape:cx="353.87006"
     inkscape:cy="312.12699"
     inkscape:document-units="mm"
     inkscape:current-layer="layer1"
     showgrid="false"
     inkscape:snap-bbox="true"
     inkscape:snap-global="false"
     inkscape:window-width="1920"
     inkscape:window-height="1017"
     inkscape:window-x="-8"
     inkscape:window-y="-8"
     inkscape:window-maximized="1"
     fit-margin-top="0"
     fit-margin-left="0"
     fit-margin-right="0"
     fit-margin-bottom="0" />
  <metadata
     id="metadata4754">
    <rdf:RDF>
      <cc:Work
         rdf:about="">
        <dc:format>image/svg+xml</dc:format>
        <dc:type
           rdf:resource="http://purl.org/dc/dcmitype/StillImage" />
        <dc:title></dc:title>
      </cc:Work>
    </rdf:RDF>
  </metadata>
  <g
     inkscape:label="Ebene 1"
     inkscape:groupmode="layer"
     id="layer1"
     transform="translate(-3.777849,-112.91426)">
    <g
       transform="matrix(0.28222223,0,0,0.28222223,-400.12371,-69.13873)"
       id="layer1-1"
       inkscape:label="Layer 1">
      <g
         transform="matrix(0.49999985,0,0,0.49999985,2.0346299,669.66961)"
         id="g5866">
        <g
           style="font-style:normal;font-variant:normal;font-weight:normal;font-stretch:normal;letter-spacing:normal;word-spacing:normal;text-anchor:start;fill:none;fill-opacity:1;fill-rule:evenodd;stroke:#000000;stroke-linecap:butt;stroke-linejoin:miter;stroke-miterlimit:10.43299961;stroke-dasharray:none;stroke-dashoffset:0;stroke-opacity:1"
           id="g5868"
           transform="matrix(1.0629921,0,0,-1.0629921,-186.02362,789.27165)"
           xml:space="preserve"
           stroke-miterlimit="10.433"
           font-style="normal"
           font-variant="normal"
           font-weight="normal"
           font-stretch="normal"
           font-size-adjust="none"
           letter-spacing="normal"
           word-spacing="normal" />      </g>
      <text
         inkscape:export-ydpi="1200"
         inkscape:export-xdpi="1200"
         id="text4374-40-4-2"
         y="817.16931"
         x="1426.1472"
         style="font-style:italic;font-variant:normal;font-weight:normal;font-stretch:normal;font-size:12px;line-height:0%;font-family:'Times New Roman';-inkscape-font-specification:'Times New Roman, Italic';text-align:start;letter-spacing:0px;word-spacing:0px;writing-mode:lr-tb;text-anchor:start;fill:#000000;fill-opacity:1;stroke:none;stroke-width:2.8125;stroke-miterlimit:4;stroke-dasharray:none"
         xml:space="preserve"><tspan
           style="font-style:italic;font-variant:normal;font-weight:normal;font-stretch:normal;font-size:40px;line-height:125%;font-family:'Times New Roman';-inkscape-font-specification:'Times New Roman, Italic';text-align:start;writing-mode:lr-tb;text-anchor:start;stroke-width:2.8125;stroke-miterlimit:4;stroke-dasharray:none"
           y="817.16931"
           x="1426.1472"
           id="tspan4376-5-4-5"
           sodipodi:role="line">V<tspan
   id="tspan5481-7"
   style="font-size:26.00036621px;baseline-shift:sub;stroke-width:2.8125;stroke-miterlimit:4;stroke-dasharray:none">0</tspan></tspan></text>
      <a
         inkscape:export-ydpi="1200"
         inkscape:export-xdpi="1200"
         style="fill:none;stroke-width:2.8125;stroke-miterlimit:4;stroke-dasharray:none"
         transform="translate(1199.5396,73.616925)"
         id="a5155-5-6">
        <circle
           transform="translate(42.461945,154.40287)"
           style="fill:none;stroke:#000000;stroke-width:2.8125;stroke-linecap:round;stroke-miterlimit:4;stroke-dasharray:none"
           id="path4153-2-2"
           r="25.279066"
           cy="554.54272"
           cx="251.77907" />
      </a>
      <path
         inkscape:export-ydpi="1200"
         inkscape:export-xdpi="1200"
         inkscape:connector-curvature="0"
         id="path4159-3-9"
         d="m 1485.8523,775.30093 h 17"
         style="fill:none;stroke:#000000;stroke-width:2.8125;stroke-linecap:square;stroke-linejoin:miter;stroke-miterlimit:4;stroke-dasharray:none;stroke-opacity:1" />
      <path
         inkscape:export-ydpi="1200"
         inkscape:export-xdpi="1200"
         style="fill:none;stroke:#000000;stroke-width:2.8125;stroke-linecap:square;stroke-linejoin:miter;stroke-miterlimit:4;stroke-dasharray:none;stroke-opacity:1"
         d="m 1494.3523,766.80093 v 17"
         id="path4161-2-0"
         inkscape:connector-curvature="0" />
      <path
         inkscape:export-ydpi="1200"
         inkscape:export-xdpi="1200"
         style="fill:none;stroke:#000000;stroke-width:2.8125;stroke-linecap:square;stroke-linejoin:miter;stroke-miterlimit:4;stroke-dasharray:none;stroke-opacity:1"
         d="m 1485.8523,798.59382 h 17"
         id="path4163-4-9"
         inkscape:connector-curvature="0" />
      <path
         inkscape:export-ydpi="1200"
         inkscape:export-xdpi="1200"
         inkscape:connector-curvature="0"
         id="path4177-0"
         d="m 2102.7636,886.27557 -607.343,-0.86769"
         style="fill:none;stroke:#000000;stroke-width:2.75646257;stroke-linecap:round;stroke-linejoin:miter;stroke-miterlimit:4;stroke-dasharray:none;stroke-opacity:1"
         sodipodi:nodetypes="cc" />
      <path
         style="fill:none;stroke:#ff0000;stroke-width:2.8125;stroke-linecap:square;stroke-linejoin:miter;stroke-miterlimit:4;stroke-dasharray:none;stroke-opacity:1"
         d="m 1799.4765,917.17068 v -30.6417"
         id="path4179-5"
         inkscape:connector-curvature="0" />
      <path
         inkscape:connector-curvature="0"
         id="path4181-7"
         d="m 1771.0081,919.84174 h 56.25"
         style="fill:none;stroke:#ff0000;stroke-width:2.8125;stroke-linecap:butt;stroke-linejoin:miter;stroke-miterlimit:4;stroke-dasharray:none;stroke-opacity:1" />
      <path
         style="fill:none;stroke:#ff0000;stroke-width:2.8125;stroke-linecap:butt;stroke-linejoin:miter;stroke-miterlimit:4;stroke-dasharray:none;stroke-opacity:1"
         d="m 1780.3831,927.34174 h 37.5"
         id="path4183-0"
         inkscape:connector-curvature="0" />
      <path
         inkscape:connector-curvature="0"
         id="path4185-0"
         d="m 1789.7581,934.84173 h 18.75"
         style="fill:none;stroke:#ff0000;stroke-width:2.8125;stroke-linecap:butt;stroke-linejoin:miter;stroke-miterlimit:4;stroke-dasharray:none;stroke-opacity:1" />
      <path
         inkscape:export-ydpi="1200"
         inkscape:export-xdpi="1200"
         inkscape:connector-curvature="0"
         id="path4157-5-6"
         d="M 1495.3081,885.08897 V 808.66199"
         style="fill:none;stroke:#000000;stroke-width:2.95393491;stroke-linecap:round;stroke-linejoin:miter;stroke-miterlimit:4;stroke-dasharray:none;stroke-opacity:1"
         sodipodi:nodetypes="cc" />
      <path
         inkscape:export-ydpi="1200"
         inkscape:export-xdpi="1200"
         inkscape:connector-curvature="0"
         id="path4157-5-6-4"
         d="M 1698.2242,885.46082 V 806.41576"
         style="fill:none;stroke:#000000;stroke-width:3.00410342;stroke-linecap:round;stroke-linejoin:miter;stroke-miterlimit:4;stroke-dasharray:none;stroke-opacity:1"
         sodipodi:nodetypes="cc" />
      <path
         inkscape:export-ydpi="1200"
         inkscape:export-xdpi="1200"
         inkscape:connector-curvature="0"
         id="path4157-5-6-42"
         d="m 2102.6986,885.31917 v -76.8677"
         style="fill:none;stroke:#000000;stroke-width:2.96243954;stroke-linecap:round;stroke-linejoin:miter;stroke-miterlimit:4;stroke-dasharray:none;stroke-opacity:1"
         sodipodi:nodetypes="cc" />
      <circle
         style="fill:#ff0000;stroke:#ff0000;stroke-width:2.8125;stroke-linecap:square;stroke-miterlimit:4;stroke-dasharray:none"
         id="circle5450-3-1-5"
         cx="1799.3885"
         cy="885.80603"
         r="1.40625" />
      <path
         inkscape:export-ydpi="1200"
         inkscape:export-xdpi="1200"
         inkscape:connector-curvature="0"
         id="path4157-5-6-9"
         d="m 1494.5676,756.43092 0.5339,-61.3048"
         style="fill:none;stroke:#000000;stroke-width:2.6771667;stroke-linecap:round;stroke-linejoin:miter;stroke-miterlimit:4;stroke-dasharray:none;stroke-opacity:1"
         sodipodi:nodetypes="cc" />
      <path
         inkscape:export-ydpi="1200"
         inkscape:export-xdpi="1200"
         style="fill:none;stroke:#000000;stroke-width:3.01448607;stroke-linecap:round;stroke-linejoin:miter;stroke-miterlimit:4;stroke-dasharray:none;stroke-opacity:1"
         d="m 1495.8666,695.03848 h 75.335"
         id="path4151-1"
         inkscape:connector-curvature="0"
         sodipodi:nodetypes="cc" />
      <path
         inkscape:export-ydpi="1200"
         inkscape:export-xdpi="1200"
         inkscape:connector-curvature="0"
         id="path4157-5-6-42-1"
         d="m 1698.0833,694.69187 v 63.06075"
         style="fill:none;stroke:#000000;stroke-width:2.68322468;stroke-linecap:round;stroke-linejoin:miter;stroke-miterlimit:4;stroke-dasharray:none;stroke-opacity:1"
         sodipodi:nodetypes="cc" />
      <g
         inkscape:export-ydpi="1200"
         inkscape:export-xdpi="1200"
         style="stroke-width:2.8125;stroke-miterlimit:4;stroke-dasharray:none"
         transform="matrix(-0.99731855,0,0,-1.040594,1709.4468,807.80113)"
         id="g6491-2-6-2">
        <path
           inkscape:connector-curvature="0"
           style="fill:none;stroke:#000000;stroke-width:2.8125;stroke-linecap:round;stroke-linejoin:round;stroke-miterlimit:4;stroke-dasharray:none;stroke-opacity:1"
           d="M 11.420521,2.1149114 20.673259,6.0274974 2.1149114,13.746924 20.673259,21.46635 2.1149114,29.185777 20.673259,36.905204 2.1149114,44.62463 11.420521,48.484343"
           id="path6493-1-2-0" />
      </g>
      <text
         inkscape:export-ydpi="1200"
         inkscape:export-xdpi="1200"
         id="text4374-4-4-9-9"
         y="792.48547"
         x="1718.9456"
         style="font-style:italic;font-variant:normal;font-weight:normal;font-stretch:normal;font-size:12px;line-height:0%;font-family:'Times New Roman';-inkscape-font-specification:'Times New Roman, Italic';text-align:start;letter-spacing:0px;word-spacing:0px;writing-mode:lr-tb;text-anchor:start;fill:#000000;fill-opacity:1;stroke:none;stroke-width:2.8125;stroke-miterlimit:4;stroke-dasharray:none"
         xml:space="preserve"><tspan
           style="font-style:italic;font-variant:normal;font-weight:normal;font-stretch:normal;font-size:40px;line-height:125%;font-family:'Times New Roman';-inkscape-font-specification:'Times New Roman, Italic';text-align:start;writing-mode:lr-tb;text-anchor:start;stroke-width:2.8125;stroke-miterlimit:4;stroke-dasharray:none"
           y="792.48547"
           x="1718.9456"
           id="tspan4376-0-8-0-2"
           sodipodi:role="line">R<tspan
   id="tspan5137-5-8"
   style="font-size:26.00036621px;baseline-shift:sub;stroke-width:2.8125;stroke-miterlimit:4;stroke-dasharray:none">2</tspan></tspan></text>
      <text
         inkscape:export-ydpi="1200"
         inkscape:export-xdpi="1200"
         id="text4374-4-4-4"
         y="671.8587"
         x="1578.9551"
         style="font-style:italic;font-variant:normal;font-weight:normal;font-stretch:normal;font-size:12px;line-height:0%;font-family:'Times New Roman';-inkscape-font-specification:'Times New Roman, Italic';text-align:start;letter-spacing:0px;word-spacing:0px;writing-mode:lr-tb;text-anchor:start;fill:#000000;fill-opacity:1;stroke:none;stroke-width:2.8125;stroke-miterlimit:4;stroke-dasharray:none"
         xml:space="preserve"><tspan
           style="font-style:italic;font-variant:normal;font-weight:normal;font-stretch:normal;font-size:40px;line-height:125%;font-family:'Times New Roman';-inkscape-font-specification:'Times New Roman, Italic';text-align:start;writing-mode:lr-tb;text-anchor:start;stroke-width:2.8125;stroke-miterlimit:4;stroke-dasharray:none"
           y="671.8587"
           x="1578.9551"
           id="tspan4376-0-8-57"
           sodipodi:role="line">R<tspan
   id="tspan5137-8"
   style="font-size:26.00036621px;baseline-shift:sub;stroke-width:2.8125;stroke-miterlimit:4;stroke-dasharray:none">1</tspan></tspan></text>
      <g
         inkscape:export-ydpi="1200"
         inkscape:export-xdpi="1200"
         style="stroke-width:2.8125;stroke-miterlimit:4;stroke-dasharray:none"
         transform="rotate(90,444.38064,1128.0064)"
         id="g6491-2-5">
        <path
           inkscape:connector-curvature="0"
           style="fill:none;stroke:#000000;stroke-width:2.8125;stroke-linecap:round;stroke-linejoin:round;stroke-miterlimit:4;stroke-dasharray:none;stroke-opacity:1"
           d="m 11.420521,-45.651296 9.252738,3.912586 -18.5583476,7.719427 18.5583476,7.719426 -18.5583476,7.719427 18.5583476,7.719427 -18.5583476,7.7194257 9.3056096,3.85971297"
           id="path6493-1-7" />
      </g>
      <text
         id="text4154-2-4-73"
         y="678.01044"
         x="1481.6689"
         style="font-style:italic;font-variant:normal;font-weight:normal;font-stretch:normal;font-size:11.25px;line-height:0%;font-family:'Times New Roman';-inkscape-font-specification:'Times New Roman, Italic';text-align:start;letter-spacing:0px;word-spacing:0px;writing-mode:lr-tb;text-anchor:start;fill:#ff0000;fill-opacity:1;stroke:none;stroke-width:0.93749994"
         xml:space="preserve"><tspan
           style="font-size:37.5px;line-height:1.25;fill:#ff0000;fill-opacity:1;stroke-width:0.93749994"
           y="678.01044"
           x="1481.6689"
           id="tspan4156-3-2-74"
           sodipodi:role="line">e<tspan
   id="tspan4510-3"
   style="font-size:24.37534332px;baseline-shift:sub;fill:#ff0000;fill-opacity:1;stroke-width:0.93749994">1</tspan></tspan></text>
      <circle
         style="fill:#ff0000;stroke:#ff0000;stroke-width:2.8125;stroke-linecap:square;stroke-miterlimit:4;stroke-dasharray:none"
         id="circle5450-3-2"
         cx="1495.209"
         cy="695.29388"
         r="1.40625" />
      <path
         inkscape:export-ydpi="1200"
         inkscape:export-xdpi="1200"
         style="fill:none;stroke:#000000;stroke-width:3.05892587;stroke-linecap:round;stroke-linejoin:miter;stroke-miterlimit:4;stroke-dasharray:none;stroke-opacity:1"
         d="m 1618.5475,695.03848 h 78.5655"
         id="path4151-1-1"
         inkscape:connector-curvature="0" />
      <text
         id="text4154-2-4-7-9"
         y="678.01044"
         x="1684.0254"
         style="font-style:italic;font-variant:normal;font-weight:normal;font-stretch:normal;font-size:11.25px;line-height:0%;font-family:'Times New Roman';-inkscape-font-specification:'Times New Roman, Italic';text-align:start;letter-spacing:0px;word-spacing:0px;writing-mode:lr-tb;text-anchor:start;fill:#ff0000;fill-opacity:1;stroke:none;stroke-width:0.93749994"
         xml:space="preserve"><tspan
           style="font-size:37.5px;line-height:1.25;fill:#ff0000;fill-opacity:1;stroke-width:0.93749994"
           y="678.01044"
           x="1684.0254"
           id="tspan4156-3-2-7-3"
           sodipodi:role="line">e<tspan
   id="tspan4510-9-2"
   style="font-size:24.37534332px;baseline-shift:sub;fill:#ff0000;fill-opacity:1;stroke-width:0.93749994">2</tspan></tspan></text>
      <text
         inkscape:export-ydpi="1200"
         inkscape:export-xdpi="1200"
         id="text3229-1-4-9-7-1-6"
         y="855.71674"
         x="1529.911"
         style="font-style:italic;font-variant:normal;font-weight:normal;font-stretch:normal;font-size:11.25px;line-height:0%;font-family:'Times New Roman';-inkscape-font-specification:'Times New Roman, Italic';text-align:start;letter-spacing:0px;word-spacing:0px;writing-mode:lr-tb;text-anchor:start;fill:#ff0000;fill-opacity:1;stroke:none;stroke-width:2.8125;stroke-miterlimit:4;stroke-dasharray:none"
         xml:space="preserve"><tspan
           style="font-size:37.5px;line-height:1.25;fill:#ff0000;fill-opacity:1;stroke-width:2.8125;stroke-miterlimit:4;stroke-dasharray:none"
           y="855.71674"
           x="1529.911"
           id="tspan3231-7-0-4-1-4-8"
           sodipodi:role="line">i<tspan
   id="tspan4332-5"
   style="font-size:24.375px;baseline-shift:sub;fill:#ff0000;fill-opacity:1;stroke-width:2.8125;stroke-miterlimit:4;stroke-dasharray:none">10</tspan></tspan></text>
      <path
         inkscape:export-ydpi="1200"
         inkscape:export-xdpi="1200"
         inkscape:connector-curvature="0"
         id="path908-7"
         d="m 1513.6748,828.03287 c 0,31.87286 0,31.87286 0,31.87286"
         style="fill:none;stroke:#ff0000;stroke-width:2.8125;stroke-linecap:butt;stroke-linejoin:miter;stroke-miterlimit:4;stroke-dasharray:none;stroke-opacity:1;marker-end:url(#Arrow2Send-53)" />
      <path
         inkscape:export-ydpi="1200"
         inkscape:export-xdpi="1200"
         style="fill:none;stroke:#000000;stroke-width:3.01448607;stroke-linecap:round;stroke-linejoin:miter;stroke-miterlimit:4;stroke-dasharray:none;stroke-opacity:1"
         d="m 1699.1904,695.2492 h 75.335"
         id="path4151-1-9"
         inkscape:connector-curvature="0"
         sodipodi:nodetypes="cc" />
      <g
         inkscape:export-ydpi="1200"
         inkscape:export-xdpi="1200"
         style="stroke-width:2.8125;stroke-miterlimit:4;stroke-dasharray:none"
         transform="rotate(90,545.9372,1229.7737)"
         id="g6491-2-5-8">
        <path
           inkscape:connector-curvature="0"
           style="fill:none;stroke:#000000;stroke-width:2.8125;stroke-linecap:round;stroke-linejoin:round;stroke-miterlimit:4;stroke-dasharray:none;stroke-opacity:1"
           d="m 11.420521,-45.651296 9.252738,3.912586 -18.5583476,7.719427 18.5583476,7.719426 -18.5583476,7.719427 18.5583476,7.719427 -18.5583476,7.7194257 9.3056096,3.85971297"
           id="path6493-1-7-6" />
      </g>
      <path
         inkscape:export-ydpi="1200"
         inkscape:export-xdpi="1200"
         style="fill:none;stroke:#000000;stroke-width:3.05892587;stroke-linecap:round;stroke-linejoin:miter;stroke-miterlimit:4;stroke-dasharray:none;stroke-opacity:1"
         d="m 1821.8713,695.2492 h 78.5655"
         id="path4151-1-1-6"
         inkscape:connector-curvature="0" />
      <text
         id="text4154-2-4-7-9-2"
         y="677.72479"
         x="1886.1439"
         style="font-style:italic;font-variant:normal;font-weight:normal;font-stretch:normal;font-size:11.25px;line-height:0%;font-family:'Times New Roman';-inkscape-font-specification:'Times New Roman, Italic';text-align:start;letter-spacing:0px;word-spacing:0px;writing-mode:lr-tb;text-anchor:start;fill:#ff0000;fill-opacity:1;stroke:none;stroke-width:0.93749994"
         xml:space="preserve"><tspan
           style="font-size:37.5px;line-height:1.25;fill:#ff0000;fill-opacity:1;stroke-width:0.93749994"
           y="677.72479"
           x="1886.1439"
           id="tspan4156-3-2-7-3-2"
           sodipodi:role="line">e<tspan
   id="tspan4510-9-2-0"
   style="font-size:24.37534332px;baseline-shift:sub;fill:#ff0000;fill-opacity:1;stroke-width:0.93749994">3</tspan></tspan></text>
      <text
         inkscape:export-ydpi="1200"
         inkscape:export-xdpi="1200"
         id="text4374-4-4-4-3"
         y="671.55402"
         x="1781.5505"
         style="font-style:italic;font-variant:normal;font-weight:normal;font-stretch:normal;font-size:12px;line-height:0%;font-family:'Times New Roman';-inkscape-font-specification:'Times New Roman, Italic';text-align:start;letter-spacing:0px;word-spacing:0px;writing-mode:lr-tb;text-anchor:start;fill:#000000;fill-opacity:1;stroke:none;stroke-width:2.8125;stroke-miterlimit:4;stroke-dasharray:none"
         xml:space="preserve"><tspan
           style="font-style:italic;font-variant:normal;font-weight:normal;font-stretch:normal;font-size:40px;line-height:125%;font-family:'Times New Roman';-inkscape-font-specification:'Times New Roman, Italic';text-align:start;writing-mode:lr-tb;text-anchor:start;stroke-width:2.8125;stroke-miterlimit:4;stroke-dasharray:none"
           y="671.55402"
           x="1781.5505"
           id="tspan4376-0-8-57-4"
           sodipodi:role="line">R<tspan
   id="tspan5137-8-3"
   style="font-size:26.00036621px;baseline-shift:sub;stroke-width:2.8125;stroke-miterlimit:4;stroke-dasharray:none">3</tspan></tspan></text>
      <circle
         style="fill:#ff0000;stroke:#ff0000;stroke-width:2.8125;stroke-linecap:square;stroke-miterlimit:4;stroke-dasharray:none"
         id="circle5450-3-7-3"
         cx="1698.1267"
         cy="695.29388"
         r="1.40625" />
      <path
         inkscape:export-ydpi="1200"
         inkscape:export-xdpi="1200"
         inkscape:connector-curvature="0"
         id="path4157-5-6-4-3"
         d="M 1900.7288,885.5245 V 806.47945"
         style="fill:none;stroke:#000000;stroke-width:3.00410342;stroke-linecap:round;stroke-linejoin:miter;stroke-miterlimit:4;stroke-dasharray:none;stroke-opacity:1"
         sodipodi:nodetypes="cc" />
      <path
         inkscape:export-ydpi="1200"
         inkscape:export-xdpi="1200"
         inkscape:connector-curvature="0"
         id="path4157-5-6-42-1-6"
         d="m 1900.5879,694.75556 v 63.06075"
         style="fill:none;stroke:#000000;stroke-width:2.68322468;stroke-linecap:round;stroke-linejoin:miter;stroke-miterlimit:4;stroke-dasharray:none;stroke-opacity:1"
         sodipodi:nodetypes="cc" />
      <g
         inkscape:export-ydpi="1200"
         inkscape:export-xdpi="1200"
         style="stroke-width:2.8125;stroke-miterlimit:4;stroke-dasharray:none"
         transform="matrix(-0.99731857,0,0,-1.040594,1911.9514,807.80113)"
         id="g6491-2-6-2-1">
        <path
           inkscape:connector-curvature="0"
           style="fill:none;stroke:#000000;stroke-width:2.8125;stroke-linecap:round;stroke-linejoin:round;stroke-miterlimit:4;stroke-dasharray:none;stroke-opacity:1"
           d="M 11.420521,2.1149114 20.673259,6.0274974 2.1149114,13.746924 20.673259,21.46635 2.1149114,29.185777 20.673259,36.905204 2.1149114,44.62463 11.420521,48.484343"
           id="path6493-1-2-0-3" />
      </g>
      <text
         inkscape:export-ydpi="1200"
         inkscape:export-xdpi="1200"
         id="text4374-4-4-9-9-3"
         y="792.54919"
         x="1921.4502"
         style="font-style:italic;font-variant:normal;font-weight:normal;font-stretch:normal;font-size:12px;line-height:0%;font-family:'Times New Roman';-inkscape-font-specification:'Times New Roman, Italic';text-align:start;letter-spacing:0px;word-spacing:0px;writing-mode:lr-tb;text-anchor:start;fill:#000000;fill-opacity:1;stroke:none;stroke-width:2.8125;stroke-miterlimit:4;stroke-dasharray:none"
         xml:space="preserve"><tspan
           style="font-style:italic;font-variant:normal;font-weight:normal;font-stretch:normal;font-size:40px;line-height:125%;font-family:'Times New Roman';-inkscape-font-specification:'Times New Roman, Italic';text-align:start;writing-mode:lr-tb;text-anchor:start;stroke-width:2.8125;stroke-miterlimit:4;stroke-dasharray:none"
           y="792.54919"
           x="1921.4502"
           id="tspan4376-0-8-0-2-2"
           sodipodi:role="line">R<tspan
   id="tspan5137-5-8-7"
   style="font-size:26.00036621px;baseline-shift:sub;stroke-width:2.8125;stroke-miterlimit:4;stroke-dasharray:none">4</tspan></tspan></text>
      <a
         inkscape:export-ydpi="1200"
         inkscape:export-xdpi="1200"
         style="fill:none;stroke-width:2.8125;stroke-miterlimit:4;stroke-dasharray:none"
         transform="translate(1808.4576,73.616925)"
         id="a5155-0">
        <circle
           transform="translate(42.461945,154.40287)"
           style="fill:none;stroke:#000000;stroke-width:2.8125;stroke-linecap:round;stroke-miterlimit:4;stroke-dasharray:none"
           id="path4153-3-1"
           cx="251.77907"
           cy="554.54272"
           r="25.279066" />
      </a>
      <text
         inkscape:export-ydpi="1200"
         inkscape:export-xdpi="1200"
         id="text4374-40-1"
         y="817.474"
         x="2128.155"
         style="font-style:italic;font-variant:normal;font-weight:normal;font-stretch:normal;font-size:12px;line-height:0%;font-family:'Times New Roman';-inkscape-font-specification:'Times New Roman, Italic';text-align:start;letter-spacing:0px;word-spacing:0px;writing-mode:lr-tb;text-anchor:start;fill:#000000;fill-opacity:1;stroke:none;stroke-width:2.8125;stroke-miterlimit:4;stroke-dasharray:none"
         xml:space="preserve"><tspan
           style="font-style:italic;font-variant:normal;font-weight:normal;font-stretch:normal;font-size:40px;line-height:125%;font-family:'Times New Roman';-inkscape-font-specification:'Times New Roman, Italic';text-align:start;writing-mode:lr-tb;text-anchor:start;stroke-width:2.8125;stroke-miterlimit:4;stroke-dasharray:none"
           y="817.474"
           x="2128.155"
           id="tspan4376-5-7"
           sodipodi:role="line">I<tspan
   id="tspan5265-4"
   style="font-size:26.00036621px;baseline-shift:sub;stroke-width:2.8125;stroke-miterlimit:4;stroke-dasharray:none">1</tspan></tspan></text>
      <path
         inkscape:export-ydpi="1200"
         inkscape:export-xdpi="1200"
         inkscape:connector-curvature="0"
         id="path3759-6-1-1-2-3"
         d="M 2102.6986,799.64417 V 771.95078"
         style="fill:none;stroke:#000000;stroke-width:2.8125;stroke-linecap:butt;stroke-linejoin:miter;stroke-miterlimit:4;stroke-dasharray:none;stroke-opacity:1;marker-end:url(#Arrow1Mend-3-5)" />
      <path
         inkscape:export-ydpi="1200"
         inkscape:export-xdpi="1200"
         inkscape:connector-curvature="0"
         id="path4157-5-6-42-1-6-7"
         d="m 2102.6986,695.08353 v 60.9358"
         style="fill:none;stroke:#000000;stroke-width:2.63762927;stroke-linecap:round;stroke-linejoin:miter;stroke-miterlimit:4;stroke-dasharray:none;stroke-opacity:1"
         sodipodi:nodetypes="cc" />
      <g
         id="g7160">
        <g
           id="g7139">
          <path
             inkscape:export-ydpi="1200"
             inkscape:export-xdpi="1200"
             style="fill:none;stroke:#000000;stroke-width:3.01448607;stroke-linecap:round;stroke-linejoin:miter;stroke-miterlimit:4;stroke-dasharray:none;stroke-opacity:1"
             d="m 1900.741,695.33301 h 75.335"
             id="path4151-1-9-1"
             inkscape:connector-curvature="0"
             sodipodi:nodetypes="cc" />
          <path
             inkscape:export-ydpi="1200"
             inkscape:export-xdpi="1200"
             style="fill:none;stroke:#000000;stroke-width:3.01448607;stroke-linecap:round;stroke-linejoin:miter;stroke-miterlimit:4;stroke-dasharray:none;stroke-opacity:1"
             d="m 1974.4031,695.34662 h 75.335"
             id="path4151-1-9-1-1"
             inkscape:connector-curvature="0"
             sodipodi:nodetypes="cc" />
        </g>
        <path
           inkscape:connector-curvature="0"
           id="path4151-1-1-6-2"
           d="m 2023.296,695.29238 h 79.021"
           style="fill:none;stroke:#000000;stroke-width:3.06778073;stroke-linecap:round;stroke-linejoin:miter;stroke-miterlimit:4;stroke-dasharray:none;stroke-opacity:1"
           inkscape:export-xdpi="1200"
           inkscape:export-ydpi="1200" />
      </g>
      <circle
         style="fill:#ff0000;stroke:#ff0000;stroke-width:2.8125;stroke-linecap:square;stroke-miterlimit:4;stroke-dasharray:none"
         id="circle5450-3-7-3-0"
         cx="1900.5228"
         cy="695.29388"
         r="1.40625" />
    </g>
  </g>
</svg>
