(kicad_sch
	(version 20231120)
	(generator "eeschema")
	(generator_version "8.0")
	(uuid "1f13bc88-ea1f-4c9f-9fa8-0abe542e5203")
	(paper "A4")
	(title_block
		(title "Sub Grandstand")
		(date "2020-07-23")
		(rev "1")
		(company "Institute for Automation of Complex Power Systems - E.ON ERC - RWTH Aachen University")
		(comment 1 "Designer: D.Wienands, S.Melcher, L.Jeske, D.Moll, M.Nowak")
		(comment 2 "Supervisor: C. Guarnieri Calò Carducci, J.Klimt")
	)
	(lib_symbols
		(symbol "Device:LED_Small"
			(pin_numbers hide)
			(pin_names
				(offset 0.254) hide)
			(exclude_from_sim no)
			(in_bom yes)
			(on_board yes)
			(property "Reference" "D"
				(at -1.27 3.175 0)
				(effects
					(font
						(size 1.27 1.27)
					)
					(justify left)
				)
			)
			(property "Value" "LED_Small"
				(at -4.445 -2.54 0)
				(effects
					(font
						(size 1.27 1.27)
					)
					(justify left)
				)
			)
			(property "Footprint" ""
				(at 0 0 90)
				(effects
					(font
						(size 1.27 1.27)
					)
					(hide yes)
				)
			)
			(property "Datasheet" "~"
				(at 0 0 90)
				(effects
					(font
						(size 1.27 1.27)
					)
					(hide yes)
				)
			)
			(property "Description" "Light emitting diode, small symbol"
				(at 0 0 0)
				(effects
					(font
						(size 1.27 1.27)
					)
					(hide yes)
				)
			)
			(property "ki_keywords" "LED diode light-emitting-diode"
				(at 0 0 0)
				(effects
					(font
						(size 1.27 1.27)
					)
					(hide yes)
				)
			)
			(property "ki_fp_filters" "LED* LED_SMD:* LED_THT:*"
				(at 0 0 0)
				(effects
					(font
						(size 1.27 1.27)
					)
					(hide yes)
				)
			)
			(symbol "LED_Small_0_1"
				(polyline
					(pts
						(xy -0.762 -1.016) (xy -0.762 1.016)
					)
					(stroke
						(width 0.254)
						(type default)
					)
					(fill
						(type none)
					)
				)
				(polyline
					(pts
						(xy 1.016 0) (xy -0.762 0)
					)
					(stroke
						(width 0)
						(type default)
					)
					(fill
						(type none)
					)
				)
				(polyline
					(pts
						(xy 0.762 -1.016) (xy -0.762 0) (xy 0.762 1.016) (xy 0.762 -1.016)
					)
					(stroke
						(width 0.254)
						(type default)
					)
					(fill
						(type none)
					)
				)
				(polyline
					(pts
						(xy 0 0.762) (xy -0.508 1.27) (xy -0.254 1.27) (xy -0.508 1.27) (xy -0.508 1.016)
					)
					(stroke
						(width 0)
						(type default)
					)
					(fill
						(type none)
					)
				)
				(polyline
					(pts
						(xy 0.508 1.27) (xy 0 1.778) (xy 0.254 1.778) (xy 0 1.778) (xy 0 1.524)
					)
					(stroke
						(width 0)
						(type default)
					)
					(fill
						(type none)
					)
				)
			)
			(symbol "LED_Small_1_1"
				(pin passive line
					(at -2.54 0 0)
					(length 1.778)
					(name "K"
						(effects
							(font
								(size 1.27 1.27)
							)
						)
					)
					(number "1"
						(effects
							(font
								(size 1.27 1.27)
							)
						)
					)
				)
				(pin passive line
					(at 2.54 0 180)
					(length 1.778)
					(name "A"
						(effects
							(font
								(size 1.27 1.27)
							)
						)
					)
					(number "2"
						(effects
							(font
								(size 1.27 1.27)
							)
						)
					)
				)
			)
		)
		(symbol "Device:R_Small"
			(pin_numbers hide)
			(pin_names
				(offset 0.254) hide)
			(exclude_from_sim no)
			(in_bom yes)
			(on_board yes)
			(property "Reference" "R"
				(at 0.762 0.508 0)
				(effects
					(font
						(size 1.27 1.27)
					)
					(justify left)
				)
			)
			(property "Value" "R_Small"
				(at 0.762 -1.016 0)
				(effects
					(font
						(size 1.27 1.27)
					)
					(justify left)
				)
			)
			(property "Footprint" ""
				(at 0 0 0)
				(effects
					(font
						(size 1.27 1.27)
					)
					(hide yes)
				)
			)
			(property "Datasheet" "~"
				(at 0 0 0)
				(effects
					(font
						(size 1.27 1.27)
					)
					(hide yes)
				)
			)
			(property "Description" "Resistor, small symbol"
				(at 0 0 0)
				(effects
					(font
						(size 1.27 1.27)
					)
					(hide yes)
				)
			)
			(property "ki_keywords" "R resistor"
				(at 0 0 0)
				(effects
					(font
						(size 1.27 1.27)
					)
					(hide yes)
				)
			)
			(property "ki_fp_filters" "R_*"
				(at 0 0 0)
				(effects
					(font
						(size 1.27 1.27)
					)
					(hide yes)
				)
			)
			(symbol "R_Small_0_1"
				(rectangle
					(start -0.762 1.778)
					(end 0.762 -1.778)
					(stroke
						(width 0.2032)
						(type default)
					)
					(fill
						(type none)
					)
				)
			)
			(symbol "R_Small_1_1"
				(pin passive line
					(at 0 2.54 270)
					(length 0.762)
					(name "~"
						(effects
							(font
								(size 1.27 1.27)
							)
						)
					)
					(number "1"
						(effects
							(font
								(size 1.27 1.27)
							)
						)
					)
				)
				(pin passive line
					(at 0 -2.54 90)
					(length 0.762)
					(name "~"
						(effects
							(font
								(size 1.27 1.27)
							)
						)
					)
					(number "2"
						(effects
							(font
								(size 1.27 1.27)
							)
						)
					)
				)
			)
		)
	)
	(junction
		(at 165.1 96.52)
		(diameter 0)
		(color 0 0 0 0)
		(uuid "03e41909-e021-4c2b-9b0c-088db703e2ad")
	)
	(junction
		(at 137.16 96.52)
		(diameter 0)
		(color 0 0 0 0)
		(uuid "041267b0-eea3-4106-92ee-8664fe54aece")
	)
	(junction
		(at 81.28 96.52)
		(diameter 0)
		(color 0 0 0 0)
		(uuid "08788cca-c68b-4783-85ec-a50d3500d7b3")
	)
	(junction
		(at 193.04 76.2)
		(diameter 0)
		(color 0 0 0 0)
		(uuid "1792cb4b-875b-4633-bdc5-63c91c2d936b")
	)
	(junction
		(at 193.04 96.52)
		(diameter 0)
		(color 0 0 0 0)
		(uuid "359d83ae-7cc6-4adf-a1ef-d35f85d09bcc")
	)
	(junction
		(at 123.19 96.52)
		(diameter 0)
		(color 0 0 0 0)
		(uuid "40196aab-3ad4-4259-a485-e1f7dc6db335")
	)
	(junction
		(at 95.25 96.52)
		(diameter 0)
		(color 0 0 0 0)
		(uuid "43afda9d-143e-4771-98e8-d5597eb50b3f")
	)
	(junction
		(at 109.22 76.2)
		(diameter 0)
		(color 0 0 0 0)
		(uuid "5feb748e-e2ae-4ea5-88dd-a95974d6474d")
	)
	(junction
		(at 179.07 76.2)
		(diameter 0)
		(color 0 0 0 0)
		(uuid "87228c49-14f3-4cc0-bead-e38da0372e37")
	)
	(junction
		(at 81.28 76.2)
		(diameter 0)
		(color 0 0 0 0)
		(uuid "a1024a2d-f7c9-4976-a603-7bb259d5bdc7")
	)
	(junction
		(at 95.25 76.2)
		(diameter 0)
		(color 0 0 0 0)
		(uuid "a337c152-0034-4280-91ee-f8e58bc0590b")
	)
	(junction
		(at 165.1 76.2)
		(diameter 0)
		(color 0 0 0 0)
		(uuid "a4dfc62a-741d-468b-b008-785c955392a8")
	)
	(junction
		(at 137.16 76.2)
		(diameter 0)
		(color 0 0 0 0)
		(uuid "aa086e1b-643d-4cf0-a122-c0b3ea95e452")
	)
	(junction
		(at 109.22 96.52)
		(diameter 0)
		(color 0 0 0 0)
		(uuid "afad3c2b-16e1-49ca-be3f-02956975af89")
	)
	(junction
		(at 207.01 76.2)
		(diameter 0)
		(color 0 0 0 0)
		(uuid "bcbbc061-2c16-4b7f-a28a-19600ff718fb")
	)
	(junction
		(at 67.31 76.2)
		(diameter 0)
		(color 0 0 0 0)
		(uuid "c3ae7228-06e6-44cf-888d-286ea5164ad3")
	)
	(junction
		(at 207.01 96.52)
		(diameter 0)
		(color 0 0 0 0)
		(uuid "c8204720-d631-4c09-98a8-ba114bb016d9")
	)
	(junction
		(at 151.13 76.2)
		(diameter 0)
		(color 0 0 0 0)
		(uuid "c8e6f00a-0899-4584-865d-f6941529f765")
	)
	(junction
		(at 123.19 76.2)
		(diameter 0)
		(color 0 0 0 0)
		(uuid "daed67a6-aaec-4154-8099-8c08a548e714")
	)
	(junction
		(at 179.07 96.52)
		(diameter 0)
		(color 0 0 0 0)
		(uuid "eded03c1-baf7-47a1-badc-a3ffc5937162")
	)
	(junction
		(at 67.31 96.52)
		(diameter 0)
		(color 0 0 0 0)
		(uuid "eea04419-326c-4f02-a49c-e4233edd2222")
	)
	(junction
		(at 151.13 96.52)
		(diameter 0)
		(color 0 0 0 0)
		(uuid "fdfa20be-579e-4c02-aef8-5a1fd04aa7c0")
	)
	(wire
		(pts
			(xy 123.19 76.2) (xy 137.16 76.2)
		)
		(stroke
			(width 0)
			(type default)
		)
		(uuid "000b54e5-1aba-48be-b7f9-2386f47a5a27")
	)
	(wire
		(pts
			(xy 81.28 96.52) (xy 95.25 96.52)
		)
		(stroke
			(width 0)
			(type default)
		)
		(uuid "0594e0f5-793e-4efa-8017-aa408a2c6826")
	)
	(wire
		(pts
			(xy 137.16 92.71) (xy 137.16 96.52)
		)
		(stroke
			(width 0)
			(type default)
		)
		(uuid "07bb38df-8f92-4e8f-9ecb-935e27e127b9")
	)
	(wire
		(pts
			(xy 95.25 92.71) (xy 95.25 96.52)
		)
		(stroke
			(width 0)
			(type default)
		)
		(uuid "07ed1065-45f6-45d9-908d-e7e0a5cc49be")
	)
	(wire
		(pts
			(xy 57.15 76.2) (xy 57.15 85.09)
		)
		(stroke
			(width 0)
			(type default)
		)
		(uuid "09f911fd-96cb-413e-9570-2cc3f9906c73")
	)
	(wire
		(pts
			(xy 81.28 76.2) (xy 95.25 76.2)
		)
		(stroke
			(width 0)
			(type default)
		)
		(uuid "0d1781b4-96d1-496d-94f7-ebd0299222a6")
	)
	(wire
		(pts
			(xy 57.15 76.2) (xy 67.31 76.2)
		)
		(stroke
			(width 0)
			(type default)
		)
		(uuid "0ee25d3c-50e7-4ee6-abb6-080c0bc979a3")
	)
	(wire
		(pts
			(xy 193.04 96.52) (xy 207.01 96.52)
		)
		(stroke
			(width 0)
			(type default)
		)
		(uuid "0ef2b68d-5df4-4431-a91d-da4aa54a18f3")
	)
	(wire
		(pts
			(xy 81.28 76.2) (xy 81.28 80.01)
		)
		(stroke
			(width 0)
			(type default)
		)
		(uuid "15c72365-d9fa-482d-8c28-09968561522f")
	)
	(wire
		(pts
			(xy 193.04 76.2) (xy 207.01 76.2)
		)
		(stroke
			(width 0)
			(type default)
		)
		(uuid "1a957843-d281-413f-849c-16598b3876ae")
	)
	(wire
		(pts
			(xy 220.98 92.71) (xy 220.98 96.52)
		)
		(stroke
			(width 0)
			(type default)
		)
		(uuid "20640ed3-fae7-4037-becd-9add481370ef")
	)
	(wire
		(pts
			(xy 57.15 87.63) (xy 50.8 87.63)
		)
		(stroke
			(width 0)
			(type default)
		)
		(uuid "23ce054c-d91e-45e0-ab3a-3a580aae0912")
	)
	(wire
		(pts
			(xy 109.22 85.09) (xy 109.22 87.63)
		)
		(stroke
			(width 0)
			(type default)
		)
		(uuid "261f0764-0876-4557-90af-4164516034eb")
	)
	(wire
		(pts
			(xy 67.31 92.71) (xy 67.31 96.52)
		)
		(stroke
			(width 0)
			(type default)
		)
		(uuid "2ba74c2c-a553-49ff-a7ee-4c74641a4419")
	)
	(wire
		(pts
			(xy 137.16 76.2) (xy 137.16 80.01)
		)
		(stroke
			(width 0)
			(type default)
		)
		(uuid "3431c637-2ce9-4110-a951-49873b91f323")
	)
	(wire
		(pts
			(xy 67.31 76.2) (xy 67.31 80.01)
		)
		(stroke
			(width 0)
			(type default)
		)
		(uuid "3817543f-3178-45d0-8b80-80829502a930")
	)
	(wire
		(pts
			(xy 165.1 96.52) (xy 179.07 96.52)
		)
		(stroke
			(width 0)
			(type default)
		)
		(uuid "3ddffc11-67ca-42a3-9d82-cfaf95d1150d")
	)
	(wire
		(pts
			(xy 207.01 76.2) (xy 207.01 80.01)
		)
		(stroke
			(width 0)
			(type default)
		)
		(uuid "47ec68ab-11ae-4a72-876f-96d69f03da19")
	)
	(wire
		(pts
			(xy 123.19 76.2) (xy 123.19 80.01)
		)
		(stroke
			(width 0)
			(type default)
		)
		(uuid "527dfa03-507a-427a-9d39-2170dcb4a0bc")
	)
	(wire
		(pts
			(xy 109.22 76.2) (xy 109.22 80.01)
		)
		(stroke
			(width 0)
			(type default)
		)
		(uuid "52c54859-ab25-4983-9c69-7ed3c57c0af6")
	)
	(wire
		(pts
			(xy 179.07 92.71) (xy 179.07 96.52)
		)
		(stroke
			(width 0)
			(type default)
		)
		(uuid "53ea7bbe-0a2a-41b1-b745-70a465f02a4b")
	)
	(wire
		(pts
			(xy 95.25 76.2) (xy 95.25 80.01)
		)
		(stroke
			(width 0)
			(type default)
		)
		(uuid "55bfed27-9388-45c9-81ad-25f9ef540d8a")
	)
	(wire
		(pts
			(xy 179.07 85.09) (xy 179.07 87.63)
		)
		(stroke
			(width 0)
			(type default)
		)
		(uuid "584a0c58-2e10-45bc-a8c8-3d48d9c4c7ea")
	)
	(wire
		(pts
			(xy 193.04 85.09) (xy 193.04 87.63)
		)
		(stroke
			(width 0)
			(type default)
		)
		(uuid "5875ab50-ca9d-4f23-a542-b33d81f60a6d")
	)
	(wire
		(pts
			(xy 67.31 96.52) (xy 57.15 96.52)
		)
		(stroke
			(width 0)
			(type default)
		)
		(uuid "5ae33abc-d0e0-48d0-a331-f9c2ab8c82dd")
	)
	(wire
		(pts
			(xy 95.25 85.09) (xy 95.25 87.63)
		)
		(stroke
			(width 0)
			(type default)
		)
		(uuid "6150017a-7986-4cfb-aa7b-93608276840b")
	)
	(wire
		(pts
			(xy 151.13 96.52) (xy 165.1 96.52)
		)
		(stroke
			(width 0)
			(type default)
		)
		(uuid "6bd749f2-51fd-4c2c-8559-753f91c847f9")
	)
	(wire
		(pts
			(xy 151.13 92.71) (xy 151.13 96.52)
		)
		(stroke
			(width 0)
			(type default)
		)
		(uuid "6c3e22fb-6393-414d-a6cd-7f09f859765f")
	)
	(wire
		(pts
			(xy 207.01 85.09) (xy 207.01 87.63)
		)
		(stroke
			(width 0)
			(type default)
		)
		(uuid "76f50e5a-ed7e-4602-b27b-33cb4deb094d")
	)
	(wire
		(pts
			(xy 151.13 76.2) (xy 151.13 80.01)
		)
		(stroke
			(width 0)
			(type default)
		)
		(uuid "808e47c8-2c67-4cb0-a582-61d97c8e7128")
	)
	(wire
		(pts
			(xy 123.19 92.71) (xy 123.19 96.52)
		)
		(stroke
			(width 0)
			(type default)
		)
		(uuid "83bbb73f-ee35-4dd9-926f-b4f234ea99ab")
	)
	(wire
		(pts
			(xy 193.04 92.71) (xy 193.04 96.52)
		)
		(stroke
			(width 0)
			(type default)
		)
		(uuid "868a9f0c-085c-4113-a650-f6884a541cd2")
	)
	(wire
		(pts
			(xy 109.22 76.2) (xy 123.19 76.2)
		)
		(stroke
			(width 0)
			(type default)
		)
		(uuid "8e9444ab-5a2a-4780-b1fd-4fcd9ecefe70")
	)
	(wire
		(pts
			(xy 207.01 92.71) (xy 207.01 96.52)
		)
		(stroke
			(width 0)
			(type default)
		)
		(uuid "90bc355c-69b2-408e-b936-e6c98ae2a651")
	)
	(wire
		(pts
			(xy 207.01 76.2) (xy 220.98 76.2)
		)
		(stroke
			(width 0)
			(type default)
		)
		(uuid "9592006a-1937-4b0b-bde6-ae771eee0735")
	)
	(wire
		(pts
			(xy 165.1 76.2) (xy 165.1 80.01)
		)
		(stroke
			(width 0)
			(type default)
		)
		(uuid "98d66506-9527-460c-b360-1bddc891fa03")
	)
	(wire
		(pts
			(xy 137.16 85.09) (xy 137.16 87.63)
		)
		(stroke
			(width 0)
			(type default)
		)
		(uuid "9fcb0b3b-ca31-4f84-be19-4900ce288fd1")
	)
	(wire
		(pts
			(xy 179.07 96.52) (xy 193.04 96.52)
		)
		(stroke
			(width 0)
			(type default)
		)
		(uuid "a4169d77-e650-4139-b99a-aa815429d31b")
	)
	(wire
		(pts
			(xy 95.25 96.52) (xy 109.22 96.52)
		)
		(stroke
			(width 0)
			(type default)
		)
		(uuid "a6e4df4f-923f-46c8-a045-69ec3b2244e5")
	)
	(wire
		(pts
			(xy 151.13 76.2) (xy 165.1 76.2)
		)
		(stroke
			(width 0)
			(type default)
		)
		(uuid "ab3286d1-938a-46a4-a832-c86ce1ef4c2a")
	)
	(wire
		(pts
			(xy 137.16 96.52) (xy 151.13 96.52)
		)
		(stroke
			(width 0)
			(type default)
		)
		(uuid "b6665856-99d7-4170-b8b9-50716b6169ce")
	)
	(wire
		(pts
			(xy 67.31 85.09) (xy 67.31 87.63)
		)
		(stroke
			(width 0)
			(type default)
		)
		(uuid "b6c0353f-5a7e-4e80-b8fc-5990d22f8434")
	)
	(wire
		(pts
			(xy 165.1 85.09) (xy 165.1 87.63)
		)
		(stroke
			(width 0)
			(type default)
		)
		(uuid "b73ecc4f-a7f5-469e-8fa5-02a315454d99")
	)
	(wire
		(pts
			(xy 193.04 76.2) (xy 193.04 80.01)
		)
		(stroke
			(width 0)
			(type default)
		)
		(uuid "b99d3923-b41f-4195-9bc5-911fbb97283d")
	)
	(wire
		(pts
			(xy 165.1 76.2) (xy 179.07 76.2)
		)
		(stroke
			(width 0)
			(type default)
		)
		(uuid "c0148d3a-f8f4-4fd5-85df-2a5fb3bf20c3")
	)
	(wire
		(pts
			(xy 109.22 92.71) (xy 109.22 96.52)
		)
		(stroke
			(width 0)
			(type default)
		)
		(uuid "c2236457-80a5-4313-9c53-eeebb7d382bd")
	)
	(wire
		(pts
			(xy 81.28 92.71) (xy 81.28 96.52)
		)
		(stroke
			(width 0)
			(type default)
		)
		(uuid "c3be146f-3fc1-41d6-9c2a-aad98f90a22e")
	)
	(wire
		(pts
			(xy 151.13 85.09) (xy 151.13 87.63)
		)
		(stroke
			(width 0)
			(type default)
		)
		(uuid "c5ac9cdc-bd9b-4b05-947f-5c2ce1dfc9c7")
	)
	(wire
		(pts
			(xy 57.15 85.09) (xy 50.8 85.09)
		)
		(stroke
			(width 0)
			(type default)
		)
		(uuid "c5cbf648-c50b-4809-a36d-3f82e97ee4ec")
	)
	(wire
		(pts
			(xy 67.31 76.2) (xy 81.28 76.2)
		)
		(stroke
			(width 0)
			(type default)
		)
		(uuid "c5f4139f-66a5-4ff0-8dc4-3b95014a6c9c")
	)
	(wire
		(pts
			(xy 137.16 76.2) (xy 151.13 76.2)
		)
		(stroke
			(width 0)
			(type default)
		)
		(uuid "c82c060d-6209-4e10-93a4-d56e2a29524f")
	)
	(wire
		(pts
			(xy 207.01 96.52) (xy 220.98 96.52)
		)
		(stroke
			(width 0)
			(type default)
		)
		(uuid "cb573c5b-1058-47a0-9898-09b914341c97")
	)
	(wire
		(pts
			(xy 123.19 85.09) (xy 123.19 87.63)
		)
		(stroke
			(width 0)
			(type default)
		)
		(uuid "ce1df1d7-d13e-4125-b45b-d25e7d39fb10")
	)
	(wire
		(pts
			(xy 220.98 85.09) (xy 220.98 87.63)
		)
		(stroke
			(width 0)
			(type default)
		)
		(uuid "ce48aa30-7823-4230-ad28-297a7a73ec93")
	)
	(wire
		(pts
			(xy 81.28 85.09) (xy 81.28 87.63)
		)
		(stroke
			(width 0)
			(type default)
		)
		(uuid "d34973a0-a4a6-45da-8265-963ef32b90c4")
	)
	(wire
		(pts
			(xy 179.07 76.2) (xy 179.07 80.01)
		)
		(stroke
			(width 0)
			(type default)
		)
		(uuid "d7480623-f0b7-448d-b6c0-ef9bb3819312")
	)
	(wire
		(pts
			(xy 123.19 96.52) (xy 137.16 96.52)
		)
		(stroke
			(width 0)
			(type default)
		)
		(uuid "d7dafe55-ce0b-4273-87f3-9191575e2d42")
	)
	(wire
		(pts
			(xy 57.15 87.63) (xy 57.15 96.52)
		)
		(stroke
			(width 0)
			(type default)
		)
		(uuid "dc54ab98-e559-4382-a42a-7e902f2904c1")
	)
	(wire
		(pts
			(xy 109.22 96.52) (xy 123.19 96.52)
		)
		(stroke
			(width 0)
			(type default)
		)
		(uuid "debd58dd-6d36-4d28-bf28-caaf0b7d6b88")
	)
	(wire
		(pts
			(xy 220.98 76.2) (xy 220.98 80.01)
		)
		(stroke
			(width 0)
			(type default)
		)
		(uuid "e8a4ab1f-5d84-4c83-b4cc-8bb67576e039")
	)
	(wire
		(pts
			(xy 67.31 96.52) (xy 81.28 96.52)
		)
		(stroke
			(width 0)
			(type default)
		)
		(uuid "f205195c-c723-46d7-a1ca-2385272b02b2")
	)
	(wire
		(pts
			(xy 95.25 76.2) (xy 109.22 76.2)
		)
		(stroke
			(width 0)
			(type default)
		)
		(uuid "f30fc6de-6c82-4eba-836f-2faea6969115")
	)
	(wire
		(pts
			(xy 165.1 92.71) (xy 165.1 96.52)
		)
		(stroke
			(width 0)
			(type default)
		)
		(uuid "fce92869-607c-4ace-b31e-cfacee7f0188")
	)
	(wire
		(pts
			(xy 179.07 76.2) (xy 193.04 76.2)
		)
		(stroke
			(width 0)
			(type default)
		)
		(uuid "fd1363f8-bb07-4691-a6e9-5f79d98fa5a7")
	)
	(text "If = 12x 10 mA = 120 mA"
		(exclude_from_sim no)
		(at 81.28 74.93 0)
		(effects
			(font
				(size 1.27 1.27)
			)
			(justify left bottom)
		)
		(uuid "50dfc7e0-5455-4e7a-82f5-8cc769503eae")
	)
	(hierarchical_label "V-"
		(shape input)
		(at 50.8 87.63 180)
		(fields_autoplaced yes)
		(effects
			(font
				(size 1.27 1.27)
			)
			(justify right)
		)
		(uuid "0a4e67d1-ab10-495e-b8da-ab48da49ebfa")
	)
	(hierarchical_label "V+"
		(shape input)
		(at 50.8 85.09 180)
		(fields_autoplaced yes)
		(effects
			(font
				(size 1.27 1.27)
			)
			(justify right)
		)
		(uuid "e3598f6b-250d-42d8-a057-d10744b60972")
	)
	(symbol
		(lib_id "Device:LED_Small")
		(at 67.31 90.17 270)
		(mirror x)
		(unit 1)
		(exclude_from_sim no)
		(in_bom yes)
		(on_board yes)
		(dnp no)
		(uuid "00000000-0000-0000-0000-00005f19a6d5")
		(property "Reference" "D14"
			(at 64.77 88.9 90)
			(effects
				(font
					(size 0.9906 0.9906)
				)
				(justify right)
			)
		)
		(property "Value" "IN-S124ARG"
			(at 64.77 90.17 90)
			(effects
				(font
					(size 0.7112 0.7112)
				)
				(justify right)
			)
		)
		(property "Footprint" "LEGOS:LED_1204_3212Metric_ReverseMount_Hole1.8x2.4mm"
			(at 67.31 90.17 90)
			(effects
				(font
					(size 1.27 1.27)
				)
				(hide yes)
			)
		)
		(property "Datasheet" "http://inolux-corp.com/datasheet/SMDLED/Mono%20Color%20Reverse%20Mount/IN-S124AR%20Series_V1.0.pdf"
			(at 67.31 90.17 90)
			(effects
				(font
					(size 1.27 1.27)
				)
				(hide yes)
			)
		)
		(property "Description" ""
			(at 67.31 90.17 0)
			(effects
				(font
					(size 1.27 1.27)
				)
				(hide yes)
			)
		)
		(pin "1"
			(uuid "30992887-f048-4050-8a8b-56110f25fe16")
		)
		(pin "2"
			(uuid "b723db5c-9e98-4bbc-a711-5afb4bc45aaf")
		)
		(instances
			(project ""
				(path "/392ef6f2-42f3-4add-8750-3f29e19823aa/00000000-0000-0000-0000-00005f7b83a2"
					(reference "D14")
					(unit 1)
				)
			)
		)
	)
	(symbol
		(lib_id "Device:LED_Small")
		(at 109.22 90.17 270)
		(mirror x)
		(unit 1)
		(exclude_from_sim no)
		(in_bom yes)
		(on_board yes)
		(dnp no)
		(uuid "00000000-0000-0000-0000-00005f32f1e9")
		(property "Reference" "D17"
			(at 106.68 88.9 90)
			(effects
				(font
					(size 0.9906 0.9906)
				)
				(justify right)
			)
		)
		(property "Value" "IN-S124ARG"
			(at 106.68 90.17 90)
			(effects
				(font
					(size 0.7112 0.7112)
				)
				(justify right)
			)
		)
		(property "Footprint" "LEGOS:LED_1204_3212Metric_ReverseMount_Hole1.8x2.4mm"
			(at 109.22 90.17 90)
			(effects
				(font
					(size 1.27 1.27)
				)
				(hide yes)
			)
		)
		(property "Datasheet" "http://inolux-corp.com/datasheet/SMDLED/Mono%20Color%20Reverse%20Mount/IN-S124AR%20Series_V1.0.pdf"
			(at 109.22 90.17 90)
			(effects
				(font
					(size 1.27 1.27)
				)
				(hide yes)
			)
		)
		(property "Description" ""
			(at 109.22 90.17 0)
			(effects
				(font
					(size 1.27 1.27)
				)
				(hide yes)
			)
		)
		(pin "1"
			(uuid "dea904d1-40e0-47e2-acbd-7e25fc7ae417")
		)
		(pin "2"
			(uuid "4481c566-457f-4008-8ec9-f7529e2f4c29")
		)
		(instances
			(project ""
				(path "/392ef6f2-42f3-4add-8750-3f29e19823aa/00000000-0000-0000-0000-00005f7b83a2"
					(reference "D17")
					(unit 1)
				)
			)
		)
	)
	(symbol
		(lib_id "Device:LED_Small")
		(at 137.16 90.17 270)
		(mirror x)
		(unit 1)
		(exclude_from_sim no)
		(in_bom yes)
		(on_board yes)
		(dnp no)
		(uuid "00000000-0000-0000-0000-00005f333037")
		(property "Reference" "D19"
			(at 134.62 88.9 90)
			(effects
				(font
					(size 0.9906 0.9906)
				)
				(justify right)
			)
		)
		(property "Value" "IN-S124ARG"
			(at 134.62 90.17 90)
			(effects
				(font
					(size 0.7112 0.7112)
				)
				(justify right)
			)
		)
		(property "Footprint" "LEGOS:LED_1204_3212Metric_ReverseMount_Hole1.8x2.4mm"
			(at 137.16 90.17 90)
			(effects
				(font
					(size 1.27 1.27)
				)
				(hide yes)
			)
		)
		(property "Datasheet" "http://inolux-corp.com/datasheet/SMDLED/Mono%20Color%20Reverse%20Mount/IN-S124AR%20Series_V1.0.pdf"
			(at 137.16 90.17 90)
			(effects
				(font
					(size 1.27 1.27)
				)
				(hide yes)
			)
		)
		(property "Description" ""
			(at 137.16 90.17 0)
			(effects
				(font
					(size 1.27 1.27)
				)
				(hide yes)
			)
		)
		(pin "1"
			(uuid "6ae8f6e0-d848-4758-96a7-36bf8b4f4614")
		)
		(pin "2"
			(uuid "8eaeb561-cdee-4471-9656-a0e993a1c212")
		)
		(instances
			(project ""
				(path "/392ef6f2-42f3-4add-8750-3f29e19823aa/00000000-0000-0000-0000-00005f7b83a2"
					(reference "D19")
					(unit 1)
				)
			)
		)
	)
	(symbol
		(lib_id "Device:LED_Small")
		(at 165.1 90.17 270)
		(mirror x)
		(unit 1)
		(exclude_from_sim no)
		(in_bom yes)
		(on_board yes)
		(dnp no)
		(uuid "00000000-0000-0000-0000-00005f333047")
		(property "Reference" "D21"
			(at 162.56 88.9 90)
			(effects
				(font
					(size 0.9906 0.9906)
				)
				(justify right)
			)
		)
		(property "Value" "IN-S124ARG"
			(at 162.56 90.17 90)
			(effects
				(font
					(size 0.7112 0.7112)
				)
				(justify right)
			)
		)
		(property "Footprint" "LEGOS:LED_1204_3212Metric_ReverseMount_Hole1.8x2.4mm"
			(at 165.1 90.17 90)
			(effects
				(font
					(size 1.27 1.27)
				)
				(hide yes)
			)
		)
		(property "Datasheet" "http://inolux-corp.com/datasheet/SMDLED/Mono%20Color%20Reverse%20Mount/IN-S124AR%20Series_V1.0.pdf"
			(at 165.1 90.17 90)
			(effects
				(font
					(size 1.27 1.27)
				)
				(hide yes)
			)
		)
		(property "Description" ""
			(at 165.1 90.17 0)
			(effects
				(font
					(size 1.27 1.27)
				)
				(hide yes)
			)
		)
		(pin "1"
			(uuid "3dcb950b-957d-458c-9ca2-f43db84c4c1f")
		)
		(pin "2"
			(uuid "f2bfa33e-a3da-4537-8930-9b89acddc839")
		)
		(instances
			(project ""
				(path "/392ef6f2-42f3-4add-8750-3f29e19823aa/00000000-0000-0000-0000-00005f7b83a2"
					(reference "D21")
					(unit 1)
				)
			)
		)
	)
	(symbol
		(lib_id "Device:LED_Small")
		(at 179.07 90.17 270)
		(mirror x)
		(unit 1)
		(exclude_from_sim no)
		(in_bom yes)
		(on_board yes)
		(dnp no)
		(uuid "00000000-0000-0000-0000-00005f33304f")
		(property "Reference" "D22"
			(at 176.53 88.9 90)
			(effects
				(font
					(size 0.9906 0.9906)
				)
				(justify right)
			)
		)
		(property "Value" "IN-S124ARG"
			(at 176.53 90.17 90)
			(effects
				(font
					(size 0.7112 0.7112)
				)
				(justify right)
			)
		)
		(property "Footprint" "LEGOS:LED_1204_3212Metric_ReverseMount_Hole1.8x2.4mm"
			(at 179.07 90.17 90)
			(effects
				(font
					(size 1.27 1.27)
				)
				(hide yes)
			)
		)
		(property "Datasheet" "http://inolux-corp.com/datasheet/SMDLED/Mono%20Color%20Reverse%20Mount/IN-S124AR%20Series_V1.0.pdf"
			(at 179.07 90.17 90)
			(effects
				(font
					(size 1.27 1.27)
				)
				(hide yes)
			)
		)
		(property "Description" ""
			(at 179.07 90.17 0)
			(effects
				(font
					(size 1.27 1.27)
				)
				(hide yes)
			)
		)
		(pin "1"
			(uuid "8e9d0db0-8fdd-4315-a811-f4da906fee55")
		)
		(pin "2"
			(uuid "5d926dbe-f3cc-43d2-baa0-fddb3a31292e")
		)
		(instances
			(project ""
				(path "/392ef6f2-42f3-4add-8750-3f29e19823aa/00000000-0000-0000-0000-00005f7b83a2"
					(reference "D22")
					(unit 1)
				)
			)
		)
	)
	(symbol
		(lib_id "Device:LED_Small")
		(at 220.98 90.17 270)
		(mirror x)
		(unit 1)
		(exclude_from_sim no)
		(in_bom yes)
		(on_board yes)
		(dnp no)
		(uuid "00000000-0000-0000-0000-00005f335aed")
		(property "Reference" "D25"
			(at 218.44 88.9 90)
			(effects
				(font
					(size 0.9906 0.9906)
				)
				(justify right)
			)
		)
		(property "Value" "IN-S124ARG"
			(at 218.44 90.17 90)
			(effects
				(font
					(size 0.7112 0.7112)
				)
				(justify right)
			)
		)
		(property "Footprint" "LEGOS:LED_1204_3212Metric_ReverseMount_Hole1.8x2.4mm"
			(at 220.98 90.17 90)
			(effects
				(font
					(size 1.27 1.27)
				)
				(hide yes)
			)
		)
		(property "Datasheet" "http://inolux-corp.com/datasheet/SMDLED/Mono%20Color%20Reverse%20Mount/IN-S124AR%20Series_V1.0.pdf"
			(at 220.98 90.17 90)
			(effects
				(font
					(size 1.27 1.27)
				)
				(hide yes)
			)
		)
		(property "Description" ""
			(at 220.98 90.17 0)
			(effects
				(font
					(size 1.27 1.27)
				)
				(hide yes)
			)
		)
		(pin "1"
			(uuid "b8eff185-c2c1-4f7c-9503-03c92df89b7d")
		)
		(pin "2"
			(uuid "70e89118-f17d-4c88-ae30-3c5e1ea08b34")
		)
		(instances
			(project ""
				(path "/392ef6f2-42f3-4add-8750-3f29e19823aa/00000000-0000-0000-0000-00005f7b83a2"
					(reference "D25")
					(unit 1)
				)
			)
		)
	)
	(symbol
		(lib_id "Device:R_Small")
		(at 151.13 82.55 180)
		(unit 1)
		(exclude_from_sim no)
		(in_bom yes)
		(on_board yes)
		(dnp no)
		(uuid "00000000-0000-0000-0000-00005f7ad1cd")
		(property "Reference" "R30"
			(at 149.86 81.28 0)
			(effects
				(font
					(size 0.9906 0.9906)
				)
				(justify left)
			)
		)
		(property "Value" "20"
			(at 149.86 82.55 0)
			(effects
				(font
					(size 0.9906 0.9906)
				)
				(justify left)
			)
		)
		(property "Footprint" "Resistor_SMD:R_0603_1608Metric"
			(at 151.13 82.55 0)
			(effects
				(font
					(size 1.27 1.27)
				)
				(hide yes)
			)
		)
		(property "Datasheet" "~"
			(at 151.13 82.55 0)
			(effects
				(font
					(size 1.27 1.27)
				)
				(hide yes)
			)
		)
		(property "Description" ""
			(at 151.13 82.55 0)
			(effects
				(font
					(size 1.27 1.27)
				)
				(hide yes)
			)
		)
		(pin "1"
			(uuid "e46fcf11-f983-4329-8672-5286881519f5")
		)
		(pin "2"
			(uuid "7d43dd01-cec7-42c4-ad62-cc4fc34a52a3")
		)
		(instances
			(project ""
				(path "/392ef6f2-42f3-4add-8750-3f29e19823aa/00000000-0000-0000-0000-00005f7b83a2"
					(reference "R30")
					(unit 1)
				)
			)
		)
	)
	(symbol
		(lib_id "Device:R_Small")
		(at 165.1 82.55 180)
		(unit 1)
		(exclude_from_sim no)
		(in_bom yes)
		(on_board yes)
		(dnp no)
		(uuid "00000000-0000-0000-0000-00005f7ad1d4")
		(property "Reference" "R31"
			(at 163.83 81.28 0)
			(effects
				(font
					(size 0.9906 0.9906)
				)
				(justify left)
			)
		)
		(property "Value" "20"
			(at 163.83 82.55 0)
			(effects
				(font
					(size 0.9906 0.9906)
				)
				(justify left)
			)
		)
		(property "Footprint" "Resistor_SMD:R_0603_1608Metric"
			(at 165.1 82.55 0)
			(effects
				(font
					(size 1.27 1.27)
				)
				(hide yes)
			)
		)
		(property "Datasheet" "~"
			(at 165.1 82.55 0)
			(effects
				(font
					(size 1.27 1.27)
				)
				(hide yes)
			)
		)
		(property "Description" ""
			(at 165.1 82.55 0)
			(effects
				(font
					(size 1.27 1.27)
				)
				(hide yes)
			)
		)
		(pin "1"
			(uuid "c00a8d74-3491-46ea-8f37-117e6afd3731")
		)
		(pin "2"
			(uuid "545384d7-6760-4446-871c-89dc5b3b291e")
		)
		(instances
			(project ""
				(path "/392ef6f2-42f3-4add-8750-3f29e19823aa/00000000-0000-0000-0000-00005f7b83a2"
					(reference "R31")
					(unit 1)
				)
			)
		)
	)
	(symbol
		(lib_id "Device:R_Small")
		(at 179.07 82.55 180)
		(unit 1)
		(exclude_from_sim no)
		(in_bom yes)
		(on_board yes)
		(dnp no)
		(uuid "00000000-0000-0000-0000-00005f7afbfe")
		(property "Reference" "R32"
			(at 177.8 81.28 0)
			(effects
				(font
					(size 0.9906 0.9906)
				)
				(justify left)
			)
		)
		(property "Value" "20"
			(at 177.8 82.55 0)
			(effects
				(font
					(size 0.9906 0.9906)
				)
				(justify left)
			)
		)
		(property "Footprint" "Resistor_SMD:R_0603_1608Metric"
			(at 179.07 82.55 0)
			(effects
				(font
					(size 1.27 1.27)
				)
				(hide yes)
			)
		)
		(property "Datasheet" "~"
			(at 179.07 82.55 0)
			(effects
				(font
					(size 1.27 1.27)
				)
				(hide yes)
			)
		)
		(property "Description" ""
			(at 179.07 82.55 0)
			(effects
				(font
					(size 1.27 1.27)
				)
				(hide yes)
			)
		)
		(pin "1"
			(uuid "9055a001-56e8-416b-a920-5a6de8b0fe6d")
		)
		(pin "2"
			(uuid "08eb2dbb-3766-4e2a-af78-6820acd056aa")
		)
		(instances
			(project ""
				(path "/392ef6f2-42f3-4add-8750-3f29e19823aa/00000000-0000-0000-0000-00005f7b83a2"
					(reference "R32")
					(unit 1)
				)
			)
		)
	)
	(symbol
		(lib_id "Device:LED_Small")
		(at 81.28 90.17 270)
		(mirror x)
		(unit 1)
		(exclude_from_sim no)
		(in_bom yes)
		(on_board yes)
		(dnp no)
		(uuid "00000000-0000-0000-0000-00005f7eb350")
		(property "Reference" "D15"
			(at 78.74 88.9 90)
			(effects
				(font
					(size 0.9906 0.9906)
				)
				(justify right)
			)
		)
		(property "Value" "IN-S124ARG"
			(at 78.74 90.17 90)
			(effects
				(font
					(size 0.7112 0.7112)
				)
				(justify right)
			)
		)
		(property "Footprint" "LEGOS:LED_1204_3212Metric_ReverseMount_Hole1.8x2.4mm"
			(at 81.28 90.17 90)
			(effects
				(font
					(size 1.27 1.27)
				)
				(hide yes)
			)
		)
		(property "Datasheet" "http://inolux-corp.com/datasheet/SMDLED/Mono%20Color%20Reverse%20Mount/IN-S124AR%20Series_V1.0.pdf"
			(at 81.28 90.17 90)
			(effects
				(font
					(size 1.27 1.27)
				)
				(hide yes)
			)
		)
		(property "Description" ""
			(at 81.28 90.17 0)
			(effects
				(font
					(size 1.27 1.27)
				)
				(hide yes)
			)
		)
		(pin "1"
			(uuid "6efe7a06-872e-49af-8a47-85140dd927d5")
		)
		(pin "2"
			(uuid "f898abb8-59b5-4e9f-a721-7423dd7092ea")
		)
		(instances
			(project ""
				(path "/392ef6f2-42f3-4add-8750-3f29e19823aa/00000000-0000-0000-0000-00005f7b83a2"
					(reference "D15")
					(unit 1)
				)
			)
		)
	)
	(symbol
		(lib_id "Device:LED_Small")
		(at 95.25 90.17 270)
		(mirror x)
		(unit 1)
		(exclude_from_sim no)
		(in_bom yes)
		(on_board yes)
		(dnp no)
		(uuid "00000000-0000-0000-0000-00005f7eb351")
		(property "Reference" "D16"
			(at 92.71 88.9 90)
			(effects
				(font
					(size 0.9906 0.9906)
				)
				(justify right)
			)
		)
		(property "Value" "IN-S124ARG"
			(at 92.71 90.17 90)
			(effects
				(font
					(size 0.7112 0.7112)
				)
				(justify right)
			)
		)
		(property "Footprint" "LEGOS:LED_1204_3212Metric_ReverseMount_Hole1.8x2.4mm"
			(at 95.25 90.17 90)
			(effects
				(font
					(size 1.27 1.27)
				)
				(hide yes)
			)
		)
		(property "Datasheet" "http://inolux-corp.com/datasheet/SMDLED/Mono%20Color%20Reverse%20Mount/IN-S124AR%20Series_V1.0.pdf"
			(at 95.25 90.17 90)
			(effects
				(font
					(size 1.27 1.27)
				)
				(hide yes)
			)
		)
		(property "Description" ""
			(at 95.25 90.17 0)
			(effects
				(font
					(size 1.27 1.27)
				)
				(hide yes)
			)
		)
		(pin "1"
			(uuid "8d77cb55-e2c3-4952-af94-3546948728d9")
		)
		(pin "2"
			(uuid "29eb1045-3600-4c14-a7ea-6d149c1970b6")
		)
		(instances
			(project ""
				(path "/392ef6f2-42f3-4add-8750-3f29e19823aa/00000000-0000-0000-0000-00005f7b83a2"
					(reference "D16")
					(unit 1)
				)
			)
		)
	)
	(symbol
		(lib_id "Device:LED_Small")
		(at 193.04 90.17 270)
		(mirror x)
		(unit 1)
		(exclude_from_sim no)
		(in_bom yes)
		(on_board yes)
		(dnp no)
		(uuid "00000000-0000-0000-0000-00005f7eb356")
		(property "Reference" "D23"
			(at 190.5 88.9 90)
			(effects
				(font
					(size 0.9906 0.9906)
				)
				(justify right)
			)
		)
		(property "Value" "IN-S124ARG"
			(at 190.5 90.17 90)
			(effects
				(font
					(size 0.7112 0.7112)
				)
				(justify right)
			)
		)
		(property "Footprint" "LEGOS:LED_1204_3212Metric_ReverseMount_Hole1.8x2.4mm"
			(at 193.04 90.17 90)
			(effects
				(font
					(size 1.27 1.27)
				)
				(hide yes)
			)
		)
		(property "Datasheet" "http://inolux-corp.com/datasheet/SMDLED/Mono%20Color%20Reverse%20Mount/IN-S124AR%20Series_V1.0.pdf"
			(at 193.04 90.17 90)
			(effects
				(font
					(size 1.27 1.27)
				)
				(hide yes)
			)
		)
		(property "Description" ""
			(at 193.04 90.17 0)
			(effects
				(font
					(size 1.27 1.27)
				)
				(hide yes)
			)
		)
		(pin "1"
			(uuid "d09ab74c-e98c-420d-adb6-6b7b1af501ed")
		)
		(pin "2"
			(uuid "d6188703-5939-450e-9e8f-5bc591e68d87")
		)
		(instances
			(project ""
				(path "/392ef6f2-42f3-4add-8750-3f29e19823aa/00000000-0000-0000-0000-00005f7b83a2"
					(reference "D23")
					(unit 1)
				)
			)
		)
	)
	(symbol
		(lib_id "Device:LED_Small")
		(at 207.01 90.17 270)
		(mirror x)
		(unit 1)
		(exclude_from_sim no)
		(in_bom yes)
		(on_board yes)
		(dnp no)
		(uuid "00000000-0000-0000-0000-00005f7eb357")
		(property "Reference" "D24"
			(at 204.47 88.9 90)
			(effects
				(font
					(size 0.9906 0.9906)
				)
				(justify right)
			)
		)
		(property "Value" "IN-S124ARG"
			(at 204.47 90.17 90)
			(effects
				(font
					(size 0.7112 0.7112)
				)
				(justify right)
			)
		)
		(property "Footprint" "LEGOS:LED_1204_3212Metric_ReverseMount_Hole1.8x2.4mm"
			(at 207.01 90.17 90)
			(effects
				(font
					(size 1.27 1.27)
				)
				(hide yes)
			)
		)
		(property "Datasheet" "http://inolux-corp.com/datasheet/SMDLED/Mono%20Color%20Reverse%20Mount/IN-S124AR%20Series_V1.0.pdf"
			(at 207.01 90.17 90)
			(effects
				(font
					(size 1.27 1.27)
				)
				(hide yes)
			)
		)
		(property "Description" ""
			(at 207.01 90.17 0)
			(effects
				(font
					(size 1.27 1.27)
				)
				(hide yes)
			)
		)
		(pin "1"
			(uuid "37972af6-59f3-4c32-8cbe-94cb1b4028b8")
		)
		(pin "2"
			(uuid "a12682da-dfe0-4640-873e-07bc470836fa")
		)
		(instances
			(project ""
				(path "/392ef6f2-42f3-4add-8750-3f29e19823aa/00000000-0000-0000-0000-00005f7b83a2"
					(reference "D24")
					(unit 1)
				)
			)
		)
	)
	(symbol
		(lib_id "Device:LED_Small")
		(at 123.19 90.17 270)
		(mirror x)
		(unit 1)
		(exclude_from_sim no)
		(in_bom yes)
		(on_board yes)
		(dnp no)
		(uuid "00000000-0000-0000-0000-00005f80a6c6")
		(property "Reference" "D18"
			(at 120.65 88.9 90)
			(effects
				(font
					(size 0.9906 0.9906)
				)
				(justify right)
			)
		)
		(property "Value" "IN-S124ARG"
			(at 120.65 90.17 90)
			(effects
				(font
					(size 0.7112 0.7112)
				)
				(justify right)
			)
		)
		(property "Footprint" "LEGOS:LED_1204_3212Metric_ReverseMount_Hole1.8x2.4mm"
			(at 123.19 90.17 90)
			(effects
				(font
					(size 1.27 1.27)
				)
				(hide yes)
			)
		)
		(property "Datasheet" "http://inolux-corp.com/datasheet/SMDLED/Mono%20Color%20Reverse%20Mount/IN-S124AR%20Series_V1.0.pdf"
			(at 123.19 90.17 90)
			(effects
				(font
					(size 1.27 1.27)
				)
				(hide yes)
			)
		)
		(property "Description" ""
			(at 123.19 90.17 0)
			(effects
				(font
					(size 1.27 1.27)
				)
				(hide yes)
			)
		)
		(pin "1"
			(uuid "b953d1de-5f98-4a0f-a70b-d4ccb11f2a0b")
		)
		(pin "2"
			(uuid "7d2f16e2-bd34-4233-a1be-0c48bf813a1d")
		)
		(instances
			(project ""
				(path "/392ef6f2-42f3-4add-8750-3f29e19823aa/00000000-0000-0000-0000-00005f7b83a2"
					(reference "D18")
					(unit 1)
				)
			)
		)
	)
	(symbol
		(lib_id "Device:LED_Small")
		(at 151.13 90.17 270)
		(mirror x)
		(unit 1)
		(exclude_from_sim no)
		(in_bom yes)
		(on_board yes)
		(dnp no)
		(uuid "00000000-0000-0000-0000-00005f80a6c7")
		(property "Reference" "D20"
			(at 148.59 88.9 90)
			(effects
				(font
					(size 0.9906 0.9906)
				)
				(justify right)
			)
		)
		(property "Value" "IN-S124ARG"
			(at 148.59 90.17 90)
			(effects
				(font
					(size 0.7112 0.7112)
				)
				(justify right)
			)
		)
		(property "Footprint" "LEGOS:LED_1204_3212Metric_ReverseMount_Hole1.8x2.4mm"
			(at 151.13 90.17 90)
			(effects
				(font
					(size 1.27 1.27)
				)
				(hide yes)
			)
		)
		(property "Datasheet" "http://inolux-corp.com/datasheet/SMDLED/Mono%20Color%20Reverse%20Mount/IN-S124AR%20Series_V1.0.pdf"
			(at 151.13 90.17 90)
			(effects
				(font
					(size 1.27 1.27)
				)
				(hide yes)
			)
		)
		(property "Description" ""
			(at 151.13 90.17 0)
			(effects
				(font
					(size 1.27 1.27)
				)
				(hide yes)
			)
		)
		(pin "1"
			(uuid "c719f278-7dac-42f3-9c29-af872655f17e")
		)
		(pin "2"
			(uuid "2da75ce6-7f10-4bbb-b24c-80db75ff18c9")
		)
		(instances
			(project ""
				(path "/392ef6f2-42f3-4add-8750-3f29e19823aa/00000000-0000-0000-0000-00005f7b83a2"
					(reference "D20")
					(unit 1)
				)
			)
		)
	)
	(symbol
		(lib_id "Device:R_Small")
		(at 67.31 82.55 180)
		(unit 1)
		(exclude_from_sim no)
		(in_bom yes)
		(on_board yes)
		(dnp no)
		(uuid "00000000-0000-0000-0000-00005f80a6cc")
		(property "Reference" "R24"
			(at 66.04 81.28 0)
			(effects
				(font
					(size 0.9906 0.9906)
				)
				(justify left)
			)
		)
		(property "Value" "20"
			(at 66.04 82.55 0)
			(effects
				(font
					(size 0.9906 0.9906)
				)
				(justify left)
			)
		)
		(property "Footprint" "Resistor_SMD:R_0603_1608Metric"
			(at 67.31 82.55 0)
			(effects
				(font
					(size 1.27 1.27)
				)
				(hide yes)
			)
		)
		(property "Datasheet" "~"
			(at 67.31 82.55 0)
			(effects
				(font
					(size 1.27 1.27)
				)
				(hide yes)
			)
		)
		(property "Description" ""
			(at 67.31 82.55 0)
			(effects
				(font
					(size 1.27 1.27)
				)
				(hide yes)
			)
		)
		(pin "1"
			(uuid "aa5c3777-0c53-4ebc-be4c-116c921392c6")
		)
		(pin "2"
			(uuid "8ff9d458-84bf-40e0-9291-c95f4c45e65c")
		)
		(instances
			(project ""
				(path "/392ef6f2-42f3-4add-8750-3f29e19823aa/00000000-0000-0000-0000-00005f7b83a2"
					(reference "R24")
					(unit 1)
				)
			)
		)
	)
	(symbol
		(lib_id "Device:R_Small")
		(at 81.28 82.55 180)
		(unit 1)
		(exclude_from_sim no)
		(in_bom yes)
		(on_board yes)
		(dnp no)
		(uuid "00000000-0000-0000-0000-00005f80a6cd")
		(property "Reference" "R25"
			(at 80.01 81.28 0)
			(effects
				(font
					(size 0.9906 0.9906)
				)
				(justify left)
			)
		)
		(property "Value" "20"
			(at 80.01 82.55 0)
			(effects
				(font
					(size 0.9906 0.9906)
				)
				(justify left)
			)
		)
		(property "Footprint" "Resistor_SMD:R_0603_1608Metric"
			(at 81.28 82.55 0)
			(effects
				(font
					(size 1.27 1.27)
				)
				(hide yes)
			)
		)
		(property "Datasheet" "~"
			(at 81.28 82.55 0)
			(effects
				(font
					(size 1.27 1.27)
				)
				(hide yes)
			)
		)
		(property "Description" ""
			(at 81.28 82.55 0)
			(effects
				(font
					(size 1.27 1.27)
				)
				(hide yes)
			)
		)
		(pin "1"
			(uuid "c3ebae15-b406-46cb-9d9d-62d26d9ba154")
		)
		(pin "2"
			(uuid "14c0e308-3a70-4663-9411-e5d20b093b74")
		)
		(instances
			(project ""
				(path "/392ef6f2-42f3-4add-8750-3f29e19823aa/00000000-0000-0000-0000-00005f7b83a2"
					(reference "R25")
					(unit 1)
				)
			)
		)
	)
	(symbol
		(lib_id "Device:R_Small")
		(at 95.25 82.55 180)
		(unit 1)
		(exclude_from_sim no)
		(in_bom yes)
		(on_board yes)
		(dnp no)
		(uuid "00000000-0000-0000-0000-00005f80a6ce")
		(property "Reference" "R26"
			(at 93.98 81.28 0)
			(effects
				(font
					(size 0.9906 0.9906)
				)
				(justify left)
			)
		)
		(property "Value" "20"
			(at 93.98 82.55 0)
			(effects
				(font
					(size 0.9906 0.9906)
				)
				(justify left)
			)
		)
		(property "Footprint" "Resistor_SMD:R_0603_1608Metric"
			(at 95.25 82.55 0)
			(effects
				(font
					(size 1.27 1.27)
				)
				(hide yes)
			)
		)
		(property "Datasheet" "~"
			(at 95.25 82.55 0)
			(effects
				(font
					(size 1.27 1.27)
				)
				(hide yes)
			)
		)
		(property "Description" ""
			(at 95.25 82.55 0)
			(effects
				(font
					(size 1.27 1.27)
				)
				(hide yes)
			)
		)
		(pin "1"
			(uuid "b16019ef-4a64-45a7-867d-3b6227d536da")
		)
		(pin "2"
			(uuid "4de51299-9755-48c1-b6ac-f04f56a6c26b")
		)
		(instances
			(project ""
				(path "/392ef6f2-42f3-4add-8750-3f29e19823aa/00000000-0000-0000-0000-00005f7b83a2"
					(reference "R26")
					(unit 1)
				)
			)
		)
	)
	(symbol
		(lib_id "Device:R_Small")
		(at 109.22 82.55 180)
		(unit 1)
		(exclude_from_sim no)
		(in_bom yes)
		(on_board yes)
		(dnp no)
		(uuid "00000000-0000-0000-0000-00005f80a6cf")
		(property "Reference" "R27"
			(at 107.95 81.28 0)
			(effects
				(font
					(size 0.9906 0.9906)
				)
				(justify left)
			)
		)
		(property "Value" "20"
			(at 107.95 82.55 0)
			(effects
				(font
					(size 0.9906 0.9906)
				)
				(justify left)
			)
		)
		(property "Footprint" "Resistor_SMD:R_0603_1608Metric"
			(at 109.22 82.55 0)
			(effects
				(font
					(size 1.27 1.27)
				)
				(hide yes)
			)
		)
		(property "Datasheet" "~"
			(at 109.22 82.55 0)
			(effects
				(font
					(size 1.27 1.27)
				)
				(hide yes)
			)
		)
		(property "Description" ""
			(at 109.22 82.55 0)
			(effects
				(font
					(size 1.27 1.27)
				)
				(hide yes)
			)
		)
		(pin "1"
			(uuid "fd7a83a3-2173-4c26-bc39-24cc881e60db")
		)
		(pin "2"
			(uuid "46933cf6-4ace-43eb-865f-a9f566530d8c")
		)
		(instances
			(project ""
				(path "/392ef6f2-42f3-4add-8750-3f29e19823aa/00000000-0000-0000-0000-00005f7b83a2"
					(reference "R27")
					(unit 1)
				)
			)
		)
	)
	(symbol
		(lib_id "Device:R_Small")
		(at 123.19 82.55 180)
		(unit 1)
		(exclude_from_sim no)
		(in_bom yes)
		(on_board yes)
		(dnp no)
		(uuid "00000000-0000-0000-0000-00005f80a6d0")
		(property "Reference" "R28"
			(at 121.92 81.28 0)
			(effects
				(font
					(size 0.9906 0.9906)
				)
				(justify left)
			)
		)
		(property "Value" "20"
			(at 121.92 82.55 0)
			(effects
				(font
					(size 0.9906 0.9906)
				)
				(justify left)
			)
		)
		(property "Footprint" "Resistor_SMD:R_0603_1608Metric"
			(at 123.19 82.55 0)
			(effects
				(font
					(size 1.27 1.27)
				)
				(hide yes)
			)
		)
		(property "Datasheet" "~"
			(at 123.19 82.55 0)
			(effects
				(font
					(size 1.27 1.27)
				)
				(hide yes)
			)
		)
		(property "Description" ""
			(at 123.19 82.55 0)
			(effects
				(font
					(size 1.27 1.27)
				)
				(hide yes)
			)
		)
		(pin "1"
			(uuid "5bd7b172-828f-4b94-a90e-85391b3331f4")
		)
		(pin "2"
			(uuid "3a25baac-859e-42b1-adcf-7074f0d551d8")
		)
		(instances
			(project ""
				(path "/392ef6f2-42f3-4add-8750-3f29e19823aa/00000000-0000-0000-0000-00005f7b83a2"
					(reference "R28")
					(unit 1)
				)
			)
		)
	)
	(symbol
		(lib_id "Device:R_Small")
		(at 137.16 82.55 180)
		(unit 1)
		(exclude_from_sim no)
		(in_bom yes)
		(on_board yes)
		(dnp no)
		(uuid "00000000-0000-0000-0000-00005f80a6d1")
		(property "Reference" "R29"
			(at 135.89 81.28 0)
			(effects
				(font
					(size 0.9906 0.9906)
				)
				(justify left)
			)
		)
		(property "Value" "20"
			(at 135.89 82.55 0)
			(effects
				(font
					(size 0.9906 0.9906)
				)
				(justify left)
			)
		)
		(property "Footprint" "Resistor_SMD:R_0603_1608Metric"
			(at 137.16 82.55 0)
			(effects
				(font
					(size 1.27 1.27)
				)
				(hide yes)
			)
		)
		(property "Datasheet" "~"
			(at 137.16 82.55 0)
			(effects
				(font
					(size 1.27 1.27)
				)
				(hide yes)
			)
		)
		(property "Description" ""
			(at 137.16 82.55 0)
			(effects
				(font
					(size 1.27 1.27)
				)
				(hide yes)
			)
		)
		(pin "1"
			(uuid "7fffba40-45ec-4f62-9384-51806096ad42")
		)
		(pin "2"
			(uuid "ca8bdd1b-32ca-49cd-9760-f39ec291114a")
		)
		(instances
			(project ""
				(path "/392ef6f2-42f3-4add-8750-3f29e19823aa/00000000-0000-0000-0000-00005f7b83a2"
					(reference "R29")
					(unit 1)
				)
			)
		)
	)
	(symbol
		(lib_id "Device:R_Small")
		(at 193.04 82.55 180)
		(unit 1)
		(exclude_from_sim no)
		(in_bom yes)
		(on_board yes)
		(dnp no)
		(uuid "00000000-0000-0000-0000-00005f80a6d5")
		(property "Reference" "R33"
			(at 191.77 81.28 0)
			(effects
				(font
					(size 0.9906 0.9906)
				)
				(justify left)
			)
		)
		(property "Value" "20"
			(at 191.77 82.55 0)
			(effects
				(font
					(size 0.9906 0.9906)
				)
				(justify left)
			)
		)
		(property "Footprint" "Resistor_SMD:R_0603_1608Metric"
			(at 193.04 82.55 0)
			(effects
				(font
					(size 1.27 1.27)
				)
				(hide yes)
			)
		)
		(property "Datasheet" "~"
			(at 193.04 82.55 0)
			(effects
				(font
					(size 1.27 1.27)
				)
				(hide yes)
			)
		)
		(property "Description" ""
			(at 193.04 82.55 0)
			(effects
				(font
					(size 1.27 1.27)
				)
				(hide yes)
			)
		)
		(pin "1"
			(uuid "451a8e48-f4f0-40bb-a1e2-d49fff157069")
		)
		(pin "2"
			(uuid "ba04a34a-6cc1-461f-a12e-8b8504e7892f")
		)
		(instances
			(project ""
				(path "/392ef6f2-42f3-4add-8750-3f29e19823aa/00000000-0000-0000-0000-00005f7b83a2"
					(reference "R33")
					(unit 1)
				)
			)
		)
	)
	(symbol
		(lib_id "Device:R_Small")
		(at 207.01 82.55 180)
		(unit 1)
		(exclude_from_sim no)
		(in_bom yes)
		(on_board yes)
		(dnp no)
		(uuid "00000000-0000-0000-0000-00005f80a6d6")
		(property "Reference" "R34"
			(at 205.74 81.28 0)
			(effects
				(font
					(size 0.9906 0.9906)
				)
				(justify left)
			)
		)
		(property "Value" "20"
			(at 205.74 82.55 0)
			(effects
				(font
					(size 0.9906 0.9906)
				)
				(justify left)
			)
		)
		(property "Footprint" "Resistor_SMD:R_0603_1608Metric"
			(at 207.01 82.55 0)
			(effects
				(font
					(size 1.27 1.27)
				)
				(hide yes)
			)
		)
		(property "Datasheet" "~"
			(at 207.01 82.55 0)
			(effects
				(font
					(size 1.27 1.27)
				)
				(hide yes)
			)
		)
		(property "Description" ""
			(at 207.01 82.55 0)
			(effects
				(font
					(size 1.27 1.27)
				)
				(hide yes)
			)
		)
		(pin "1"
			(uuid "dd8f77c6-a81b-40c1-a848-658e306cf02f")
		)
		(pin "2"
			(uuid "ef418c98-4a01-4bb7-b3d7-ea0ced190519")
		)
		(instances
			(project ""
				(path "/392ef6f2-42f3-4add-8750-3f29e19823aa/00000000-0000-0000-0000-00005f7b83a2"
					(reference "R34")
					(unit 1)
				)
			)
		)
	)
	(symbol
		(lib_id "Device:R_Small")
		(at 220.98 82.55 180)
		(unit 1)
		(exclude_from_sim no)
		(in_bom yes)
		(on_board yes)
		(dnp no)
		(uuid "00000000-0000-0000-0000-00005f80a6d7")
		(property "Reference" "R35"
			(at 219.71 81.28 0)
			(effects
				(font
					(size 0.9906 0.9906)
				)
				(justify left)
			)
		)
		(property "Value" "20"
			(at 219.71 82.55 0)
			(effects
				(font
					(size 0.9906 0.9906)
				)
				(justify left)
			)
		)
		(property "Footprint" "Resistor_SMD:R_0603_1608Metric"
			(at 220.98 82.55 0)
			(effects
				(font
					(size 1.27 1.27)
				)
				(hide yes)
			)
		)
		(property "Datasheet" "~"
			(at 220.98 82.55 0)
			(effects
				(font
					(size 1.27 1.27)
				)
				(hide yes)
			)
		)
		(property "Description" ""
			(at 220.98 82.55 0)
			(effects
				(font
					(size 1.27 1.27)
				)
				(hide yes)
			)
		)
		(pin "1"
			(uuid "677a9c61-88ef-4521-82af-8aa211932c2b")
		)
		(pin "2"
			(uuid "be58ed3f-ffb3-4c73-aedb-1f89cd5e2fa2")
		)
		(instances
			(project ""
				(path "/392ef6f2-42f3-4add-8750-3f29e19823aa/00000000-0000-0000-0000-00005f7b83a2"
					(reference "R35")
					(unit 1)
				)
			)
		)
	)
)
