(kicad_sch
	(version 20231120)
	(generator "eeschema")
	(generator_version "8.0")
	(uuid "18c61c95-8af1-4986-b67e-c7af9c15ab6b")
	(paper "A4")
	(title_block
		(title "Server Status")
		(date "2022-08-16")
		(rev "2.0")
		(company "Institute for Automation of Complex Power Systems - E.ON ERC - RWTH Aachen University")
		(comment 1 "Designer: D.Wienands, S.Melcher, L.Jeske, D.Moll, M.Nowak")
		(comment 2 "Supervisor: C. Guarnieri Calò Carducci, J.Klimt")
	)
	(lib_symbols
		(symbol "Device:LED"
			(pin_numbers hide)
			(pin_names
				(offset 1.016) hide)
			(exclude_from_sim no)
			(in_bom yes)
			(on_board yes)
			(property "Reference" "D"
				(at 0 2.54 0)
				(effects
					(font
						(size 1.27 1.27)
					)
				)
			)
			(property "Value" "LED"
				(at 0 -2.54 0)
				(effects
					(font
						(size 1.27 1.27)
					)
				)
			)
			(property "Footprint" ""
				(at 0 0 0)
				(effects
					(font
						(size 1.27 1.27)
					)
					(hide yes)
				)
			)
			(property "Datasheet" "~"
				(at 0 0 0)
				(effects
					(font
						(size 1.27 1.27)
					)
					(hide yes)
				)
			)
			(property "Description" "Light emitting diode"
				(at 0 0 0)
				(effects
					(font
						(size 1.27 1.27)
					)
					(hide yes)
				)
			)
			(property "ki_keywords" "LED diode"
				(at 0 0 0)
				(effects
					(font
						(size 1.27 1.27)
					)
					(hide yes)
				)
			)
			(property "ki_fp_filters" "LED* LED_SMD:* LED_THT:*"
				(at 0 0 0)
				(effects
					(font
						(size 1.27 1.27)
					)
					(hide yes)
				)
			)
			(symbol "LED_0_1"
				(polyline
					(pts
						(xy -1.27 -1.27) (xy -1.27 1.27)
					)
					(stroke
						(width 0.254)
						(type default)
					)
					(fill
						(type none)
					)
				)
				(polyline
					(pts
						(xy -1.27 0) (xy 1.27 0)
					)
					(stroke
						(width 0)
						(type default)
					)
					(fill
						(type none)
					)
				)
				(polyline
					(pts
						(xy 1.27 -1.27) (xy 1.27 1.27) (xy -1.27 0) (xy 1.27 -1.27)
					)
					(stroke
						(width 0.254)
						(type default)
					)
					(fill
						(type none)
					)
				)
				(polyline
					(pts
						(xy -3.048 -0.762) (xy -4.572 -2.286) (xy -3.81 -2.286) (xy -4.572 -2.286) (xy -4.572 -1.524)
					)
					(stroke
						(width 0)
						(type default)
					)
					(fill
						(type none)
					)
				)
				(polyline
					(pts
						(xy -1.778 -0.762) (xy -3.302 -2.286) (xy -2.54 -2.286) (xy -3.302 -2.286) (xy -3.302 -1.524)
					)
					(stroke
						(width 0)
						(type default)
					)
					(fill
						(type none)
					)
				)
			)
			(symbol "LED_1_1"
				(pin passive line
					(at -3.81 0 0)
					(length 2.54)
					(name "K"
						(effects
							(font
								(size 1.27 1.27)
							)
						)
					)
					(number "1"
						(effects
							(font
								(size 1.27 1.27)
							)
						)
					)
				)
				(pin passive line
					(at 3.81 0 180)
					(length 2.54)
					(name "A"
						(effects
							(font
								(size 1.27 1.27)
							)
						)
					)
					(number "2"
						(effects
							(font
								(size 1.27 1.27)
							)
						)
					)
				)
			)
		)
		(symbol "LED_1"
			(pin_numbers hide)
			(pin_names
				(offset 1.016) hide)
			(exclude_from_sim no)
			(in_bom yes)
			(on_board yes)
			(property "Reference" "D"
				(at 0 2.54 0)
				(effects
					(font
						(size 1.27 1.27)
					)
				)
			)
			(property "Value" "LED_1"
				(at 0 -2.54 0)
				(effects
					(font
						(size 1.27 1.27)
					)
				)
			)
			(property "Footprint" ""
				(at 0 0 0)
				(effects
					(font
						(size 1.27 1.27)
					)
					(hide yes)
				)
			)
			(property "Datasheet" "~"
				(at 0 0 0)
				(effects
					(font
						(size 1.27 1.27)
					)
					(hide yes)
				)
			)
			(property "Description" "Light emitting diode"
				(at 0 0 0)
				(effects
					(font
						(size 1.27 1.27)
					)
					(hide yes)
				)
			)
			(property "ki_keywords" "LED diode"
				(at 0 0 0)
				(effects
					(font
						(size 1.27 1.27)
					)
					(hide yes)
				)
			)
			(property "ki_fp_filters" "LED* LED_SMD:* LED_THT:*"
				(at 0 0 0)
				(effects
					(font
						(size 1.27 1.27)
					)
					(hide yes)
				)
			)
			(symbol "LED_1_0_1"
				(polyline
					(pts
						(xy -1.27 -1.27) (xy -1.27 1.27)
					)
					(stroke
						(width 0.254)
						(type default)
					)
					(fill
						(type none)
					)
				)
				(polyline
					(pts
						(xy -1.27 0) (xy 1.27 0)
					)
					(stroke
						(width 0)
						(type default)
					)
					(fill
						(type none)
					)
				)
				(polyline
					(pts
						(xy 1.27 -1.27) (xy 1.27 1.27) (xy -1.27 0) (xy 1.27 -1.27)
					)
					(stroke
						(width 0.254)
						(type default)
					)
					(fill
						(type none)
					)
				)
				(polyline
					(pts
						(xy -3.048 -0.762) (xy -4.572 -2.286) (xy -3.81 -2.286) (xy -4.572 -2.286) (xy -4.572 -1.524)
					)
					(stroke
						(width 0)
						(type default)
					)
					(fill
						(type none)
					)
				)
				(polyline
					(pts
						(xy -1.778 -0.762) (xy -3.302 -2.286) (xy -2.54 -2.286) (xy -3.302 -2.286) (xy -3.302 -1.524)
					)
					(stroke
						(width 0)
						(type default)
					)
					(fill
						(type none)
					)
				)
			)
			(symbol "LED_1_1_1"
				(pin passive line
					(at -3.81 0 0)
					(length 2.54)
					(name "K"
						(effects
							(font
								(size 1.27 1.27)
							)
						)
					)
					(number "1"
						(effects
							(font
								(size 1.27 1.27)
							)
						)
					)
				)
				(pin passive line
					(at 3.81 0 180)
					(length 2.54)
					(name "A"
						(effects
							(font
								(size 1.27 1.27)
							)
						)
					)
					(number "2"
						(effects
							(font
								(size 1.27 1.27)
							)
						)
					)
				)
			)
		)
		(symbol "LED_10"
			(pin_numbers hide)
			(pin_names
				(offset 1.016) hide)
			(exclude_from_sim no)
			(in_bom yes)
			(on_board yes)
			(property "Reference" "D"
				(at 0 2.54 0)
				(effects
					(font
						(size 1.27 1.27)
					)
				)
			)
			(property "Value" "LED_10"
				(at 0 -2.54 0)
				(effects
					(font
						(size 1.27 1.27)
					)
				)
			)
			(property "Footprint" ""
				(at 0 0 0)
				(effects
					(font
						(size 1.27 1.27)
					)
					(hide yes)
				)
			)
			(property "Datasheet" "~"
				(at 0 0 0)
				(effects
					(font
						(size 1.27 1.27)
					)
					(hide yes)
				)
			)
			(property "Description" "Light emitting diode"
				(at 0 0 0)
				(effects
					(font
						(size 1.27 1.27)
					)
					(hide yes)
				)
			)
			(property "ki_keywords" "LED diode"
				(at 0 0 0)
				(effects
					(font
						(size 1.27 1.27)
					)
					(hide yes)
				)
			)
			(property "ki_fp_filters" "LED* LED_SMD:* LED_THT:*"
				(at 0 0 0)
				(effects
					(font
						(size 1.27 1.27)
					)
					(hide yes)
				)
			)
			(symbol "LED_10_0_1"
				(polyline
					(pts
						(xy -1.27 -1.27) (xy -1.27 1.27)
					)
					(stroke
						(width 0.254)
						(type default)
					)
					(fill
						(type none)
					)
				)
				(polyline
					(pts
						(xy -1.27 0) (xy 1.27 0)
					)
					(stroke
						(width 0)
						(type default)
					)
					(fill
						(type none)
					)
				)
				(polyline
					(pts
						(xy 1.27 -1.27) (xy 1.27 1.27) (xy -1.27 0) (xy 1.27 -1.27)
					)
					(stroke
						(width 0.254)
						(type default)
					)
					(fill
						(type none)
					)
				)
				(polyline
					(pts
						(xy -3.048 -0.762) (xy -4.572 -2.286) (xy -3.81 -2.286) (xy -4.572 -2.286) (xy -4.572 -1.524)
					)
					(stroke
						(width 0)
						(type default)
					)
					(fill
						(type none)
					)
				)
				(polyline
					(pts
						(xy -1.778 -0.762) (xy -3.302 -2.286) (xy -2.54 -2.286) (xy -3.302 -2.286) (xy -3.302 -1.524)
					)
					(stroke
						(width 0)
						(type default)
					)
					(fill
						(type none)
					)
				)
			)
			(symbol "LED_10_1_1"
				(pin passive line
					(at -3.81 0 0)
					(length 2.54)
					(name "K"
						(effects
							(font
								(size 1.27 1.27)
							)
						)
					)
					(number "1"
						(effects
							(font
								(size 1.27 1.27)
							)
						)
					)
				)
				(pin passive line
					(at 3.81 0 180)
					(length 2.54)
					(name "A"
						(effects
							(font
								(size 1.27 1.27)
							)
						)
					)
					(number "2"
						(effects
							(font
								(size 1.27 1.27)
							)
						)
					)
				)
			)
		)
		(symbol "LED_11"
			(pin_numbers hide)
			(pin_names
				(offset 1.016) hide)
			(exclude_from_sim no)
			(in_bom yes)
			(on_board yes)
			(property "Reference" "D"
				(at 0 2.54 0)
				(effects
					(font
						(size 1.27 1.27)
					)
				)
			)
			(property "Value" "LED_11"
				(at 0 -2.54 0)
				(effects
					(font
						(size 1.27 1.27)
					)
				)
			)
			(property "Footprint" ""
				(at 0 0 0)
				(effects
					(font
						(size 1.27 1.27)
					)
					(hide yes)
				)
			)
			(property "Datasheet" "~"
				(at 0 0 0)
				(effects
					(font
						(size 1.27 1.27)
					)
					(hide yes)
				)
			)
			(property "Description" "Light emitting diode"
				(at 0 0 0)
				(effects
					(font
						(size 1.27 1.27)
					)
					(hide yes)
				)
			)
			(property "ki_keywords" "LED diode"
				(at 0 0 0)
				(effects
					(font
						(size 1.27 1.27)
					)
					(hide yes)
				)
			)
			(property "ki_fp_filters" "LED* LED_SMD:* LED_THT:*"
				(at 0 0 0)
				(effects
					(font
						(size 1.27 1.27)
					)
					(hide yes)
				)
			)
			(symbol "LED_11_0_1"
				(polyline
					(pts
						(xy -1.27 -1.27) (xy -1.27 1.27)
					)
					(stroke
						(width 0.254)
						(type default)
					)
					(fill
						(type none)
					)
				)
				(polyline
					(pts
						(xy -1.27 0) (xy 1.27 0)
					)
					(stroke
						(width 0)
						(type default)
					)
					(fill
						(type none)
					)
				)
				(polyline
					(pts
						(xy 1.27 -1.27) (xy 1.27 1.27) (xy -1.27 0) (xy 1.27 -1.27)
					)
					(stroke
						(width 0.254)
						(type default)
					)
					(fill
						(type none)
					)
				)
				(polyline
					(pts
						(xy -3.048 -0.762) (xy -4.572 -2.286) (xy -3.81 -2.286) (xy -4.572 -2.286) (xy -4.572 -1.524)
					)
					(stroke
						(width 0)
						(type default)
					)
					(fill
						(type none)
					)
				)
				(polyline
					(pts
						(xy -1.778 -0.762) (xy -3.302 -2.286) (xy -2.54 -2.286) (xy -3.302 -2.286) (xy -3.302 -1.524)
					)
					(stroke
						(width 0)
						(type default)
					)
					(fill
						(type none)
					)
				)
			)
			(symbol "LED_11_1_1"
				(pin passive line
					(at -3.81 0 0)
					(length 2.54)
					(name "K"
						(effects
							(font
								(size 1.27 1.27)
							)
						)
					)
					(number "1"
						(effects
							(font
								(size 1.27 1.27)
							)
						)
					)
				)
				(pin passive line
					(at 3.81 0 180)
					(length 2.54)
					(name "A"
						(effects
							(font
								(size 1.27 1.27)
							)
						)
					)
					(number "2"
						(effects
							(font
								(size 1.27 1.27)
							)
						)
					)
				)
			)
		)
		(symbol "LED_2"
			(pin_numbers hide)
			(pin_names
				(offset 1.016) hide)
			(exclude_from_sim no)
			(in_bom yes)
			(on_board yes)
			(property "Reference" "D"
				(at 0 2.54 0)
				(effects
					(font
						(size 1.27 1.27)
					)
				)
			)
			(property "Value" "LED_2"
				(at 0 -2.54 0)
				(effects
					(font
						(size 1.27 1.27)
					)
				)
			)
			(property "Footprint" ""
				(at 0 0 0)
				(effects
					(font
						(size 1.27 1.27)
					)
					(hide yes)
				)
			)
			(property "Datasheet" "~"
				(at 0 0 0)
				(effects
					(font
						(size 1.27 1.27)
					)
					(hide yes)
				)
			)
			(property "Description" "Light emitting diode"
				(at 0 0 0)
				(effects
					(font
						(size 1.27 1.27)
					)
					(hide yes)
				)
			)
			(property "ki_keywords" "LED diode"
				(at 0 0 0)
				(effects
					(font
						(size 1.27 1.27)
					)
					(hide yes)
				)
			)
			(property "ki_fp_filters" "LED* LED_SMD:* LED_THT:*"
				(at 0 0 0)
				(effects
					(font
						(size 1.27 1.27)
					)
					(hide yes)
				)
			)
			(symbol "LED_2_0_1"
				(polyline
					(pts
						(xy -1.27 -1.27) (xy -1.27 1.27)
					)
					(stroke
						(width 0.254)
						(type default)
					)
					(fill
						(type none)
					)
				)
				(polyline
					(pts
						(xy -1.27 0) (xy 1.27 0)
					)
					(stroke
						(width 0)
						(type default)
					)
					(fill
						(type none)
					)
				)
				(polyline
					(pts
						(xy 1.27 -1.27) (xy 1.27 1.27) (xy -1.27 0) (xy 1.27 -1.27)
					)
					(stroke
						(width 0.254)
						(type default)
					)
					(fill
						(type none)
					)
				)
				(polyline
					(pts
						(xy -3.048 -0.762) (xy -4.572 -2.286) (xy -3.81 -2.286) (xy -4.572 -2.286) (xy -4.572 -1.524)
					)
					(stroke
						(width 0)
						(type default)
					)
					(fill
						(type none)
					)
				)
				(polyline
					(pts
						(xy -1.778 -0.762) (xy -3.302 -2.286) (xy -2.54 -2.286) (xy -3.302 -2.286) (xy -3.302 -1.524)
					)
					(stroke
						(width 0)
						(type default)
					)
					(fill
						(type none)
					)
				)
			)
			(symbol "LED_2_1_1"
				(pin passive line
					(at -3.81 0 0)
					(length 2.54)
					(name "K"
						(effects
							(font
								(size 1.27 1.27)
							)
						)
					)
					(number "1"
						(effects
							(font
								(size 1.27 1.27)
							)
						)
					)
				)
				(pin passive line
					(at 3.81 0 180)
					(length 2.54)
					(name "A"
						(effects
							(font
								(size 1.27 1.27)
							)
						)
					)
					(number "2"
						(effects
							(font
								(size 1.27 1.27)
							)
						)
					)
				)
			)
		)
		(symbol "LED_3"
			(pin_numbers hide)
			(pin_names
				(offset 1.016) hide)
			(exclude_from_sim no)
			(in_bom yes)
			(on_board yes)
			(property "Reference" "D"
				(at 0 2.54 0)
				(effects
					(font
						(size 1.27 1.27)
					)
				)
			)
			(property "Value" "LED_3"
				(at 0 -2.54 0)
				(effects
					(font
						(size 1.27 1.27)
					)
				)
			)
			(property "Footprint" ""
				(at 0 0 0)
				(effects
					(font
						(size 1.27 1.27)
					)
					(hide yes)
				)
			)
			(property "Datasheet" "~"
				(at 0 0 0)
				(effects
					(font
						(size 1.27 1.27)
					)
					(hide yes)
				)
			)
			(property "Description" "Light emitting diode"
				(at 0 0 0)
				(effects
					(font
						(size 1.27 1.27)
					)
					(hide yes)
				)
			)
			(property "ki_keywords" "LED diode"
				(at 0 0 0)
				(effects
					(font
						(size 1.27 1.27)
					)
					(hide yes)
				)
			)
			(property "ki_fp_filters" "LED* LED_SMD:* LED_THT:*"
				(at 0 0 0)
				(effects
					(font
						(size 1.27 1.27)
					)
					(hide yes)
				)
			)
			(symbol "LED_3_0_1"
				(polyline
					(pts
						(xy -1.27 -1.27) (xy -1.27 1.27)
					)
					(stroke
						(width 0.254)
						(type default)
					)
					(fill
						(type none)
					)
				)
				(polyline
					(pts
						(xy -1.27 0) (xy 1.27 0)
					)
					(stroke
						(width 0)
						(type default)
					)
					(fill
						(type none)
					)
				)
				(polyline
					(pts
						(xy 1.27 -1.27) (xy 1.27 1.27) (xy -1.27 0) (xy 1.27 -1.27)
					)
					(stroke
						(width 0.254)
						(type default)
					)
					(fill
						(type none)
					)
				)
				(polyline
					(pts
						(xy -3.048 -0.762) (xy -4.572 -2.286) (xy -3.81 -2.286) (xy -4.572 -2.286) (xy -4.572 -1.524)
					)
					(stroke
						(width 0)
						(type default)
					)
					(fill
						(type none)
					)
				)
				(polyline
					(pts
						(xy -1.778 -0.762) (xy -3.302 -2.286) (xy -2.54 -2.286) (xy -3.302 -2.286) (xy -3.302 -1.524)
					)
					(stroke
						(width 0)
						(type default)
					)
					(fill
						(type none)
					)
				)
			)
			(symbol "LED_3_1_1"
				(pin passive line
					(at -3.81 0 0)
					(length 2.54)
					(name "K"
						(effects
							(font
								(size 1.27 1.27)
							)
						)
					)
					(number "1"
						(effects
							(font
								(size 1.27 1.27)
							)
						)
					)
				)
				(pin passive line
					(at 3.81 0 180)
					(length 2.54)
					(name "A"
						(effects
							(font
								(size 1.27 1.27)
							)
						)
					)
					(number "2"
						(effects
							(font
								(size 1.27 1.27)
							)
						)
					)
				)
			)
		)
		(symbol "LED_4"
			(pin_numbers hide)
			(pin_names
				(offset 1.016) hide)
			(exclude_from_sim no)
			(in_bom yes)
			(on_board yes)
			(property "Reference" "D"
				(at 0 2.54 0)
				(effects
					(font
						(size 1.27 1.27)
					)
				)
			)
			(property "Value" "LED_4"
				(at 0 -2.54 0)
				(effects
					(font
						(size 1.27 1.27)
					)
				)
			)
			(property "Footprint" ""
				(at 0 0 0)
				(effects
					(font
						(size 1.27 1.27)
					)
					(hide yes)
				)
			)
			(property "Datasheet" "~"
				(at 0 0 0)
				(effects
					(font
						(size 1.27 1.27)
					)
					(hide yes)
				)
			)
			(property "Description" "Light emitting diode"
				(at 0 0 0)
				(effects
					(font
						(size 1.27 1.27)
					)
					(hide yes)
				)
			)
			(property "ki_keywords" "LED diode"
				(at 0 0 0)
				(effects
					(font
						(size 1.27 1.27)
					)
					(hide yes)
				)
			)
			(property "ki_fp_filters" "LED* LED_SMD:* LED_THT:*"
				(at 0 0 0)
				(effects
					(font
						(size 1.27 1.27)
					)
					(hide yes)
				)
			)
			(symbol "LED_4_0_1"
				(polyline
					(pts
						(xy -1.27 -1.27) (xy -1.27 1.27)
					)
					(stroke
						(width 0.254)
						(type default)
					)
					(fill
						(type none)
					)
				)
				(polyline
					(pts
						(xy -1.27 0) (xy 1.27 0)
					)
					(stroke
						(width 0)
						(type default)
					)
					(fill
						(type none)
					)
				)
				(polyline
					(pts
						(xy 1.27 -1.27) (xy 1.27 1.27) (xy -1.27 0) (xy 1.27 -1.27)
					)
					(stroke
						(width 0.254)
						(type default)
					)
					(fill
						(type none)
					)
				)
				(polyline
					(pts
						(xy -3.048 -0.762) (xy -4.572 -2.286) (xy -3.81 -2.286) (xy -4.572 -2.286) (xy -4.572 -1.524)
					)
					(stroke
						(width 0)
						(type default)
					)
					(fill
						(type none)
					)
				)
				(polyline
					(pts
						(xy -1.778 -0.762) (xy -3.302 -2.286) (xy -2.54 -2.286) (xy -3.302 -2.286) (xy -3.302 -1.524)
					)
					(stroke
						(width 0)
						(type default)
					)
					(fill
						(type none)
					)
				)
			)
			(symbol "LED_4_1_1"
				(pin passive line
					(at -3.81 0 0)
					(length 2.54)
					(name "K"
						(effects
							(font
								(size 1.27 1.27)
							)
						)
					)
					(number "1"
						(effects
							(font
								(size 1.27 1.27)
							)
						)
					)
				)
				(pin passive line
					(at 3.81 0 180)
					(length 2.54)
					(name "A"
						(effects
							(font
								(size 1.27 1.27)
							)
						)
					)
					(number "2"
						(effects
							(font
								(size 1.27 1.27)
							)
						)
					)
				)
			)
		)
		(symbol "LED_5"
			(pin_numbers hide)
			(pin_names
				(offset 1.016) hide)
			(exclude_from_sim no)
			(in_bom yes)
			(on_board yes)
			(property "Reference" "D"
				(at 0 2.54 0)
				(effects
					(font
						(size 1.27 1.27)
					)
				)
			)
			(property "Value" "LED_5"
				(at 0 -2.54 0)
				(effects
					(font
						(size 1.27 1.27)
					)
				)
			)
			(property "Footprint" ""
				(at 0 0 0)
				(effects
					(font
						(size 1.27 1.27)
					)
					(hide yes)
				)
			)
			(property "Datasheet" "~"
				(at 0 0 0)
				(effects
					(font
						(size 1.27 1.27)
					)
					(hide yes)
				)
			)
			(property "Description" "Light emitting diode"
				(at 0 0 0)
				(effects
					(font
						(size 1.27 1.27)
					)
					(hide yes)
				)
			)
			(property "ki_keywords" "LED diode"
				(at 0 0 0)
				(effects
					(font
						(size 1.27 1.27)
					)
					(hide yes)
				)
			)
			(property "ki_fp_filters" "LED* LED_SMD:* LED_THT:*"
				(at 0 0 0)
				(effects
					(font
						(size 1.27 1.27)
					)
					(hide yes)
				)
			)
			(symbol "LED_5_0_1"
				(polyline
					(pts
						(xy -1.27 -1.27) (xy -1.27 1.27)
					)
					(stroke
						(width 0.254)
						(type default)
					)
					(fill
						(type none)
					)
				)
				(polyline
					(pts
						(xy -1.27 0) (xy 1.27 0)
					)
					(stroke
						(width 0)
						(type default)
					)
					(fill
						(type none)
					)
				)
				(polyline
					(pts
						(xy 1.27 -1.27) (xy 1.27 1.27) (xy -1.27 0) (xy 1.27 -1.27)
					)
					(stroke
						(width 0.254)
						(type default)
					)
					(fill
						(type none)
					)
				)
				(polyline
					(pts
						(xy -3.048 -0.762) (xy -4.572 -2.286) (xy -3.81 -2.286) (xy -4.572 -2.286) (xy -4.572 -1.524)
					)
					(stroke
						(width 0)
						(type default)
					)
					(fill
						(type none)
					)
				)
				(polyline
					(pts
						(xy -1.778 -0.762) (xy -3.302 -2.286) (xy -2.54 -2.286) (xy -3.302 -2.286) (xy -3.302 -1.524)
					)
					(stroke
						(width 0)
						(type default)
					)
					(fill
						(type none)
					)
				)
			)
			(symbol "LED_5_1_1"
				(pin passive line
					(at -3.81 0 0)
					(length 2.54)
					(name "K"
						(effects
							(font
								(size 1.27 1.27)
							)
						)
					)
					(number "1"
						(effects
							(font
								(size 1.27 1.27)
							)
						)
					)
				)
				(pin passive line
					(at 3.81 0 180)
					(length 2.54)
					(name "A"
						(effects
							(font
								(size 1.27 1.27)
							)
						)
					)
					(number "2"
						(effects
							(font
								(size 1.27 1.27)
							)
						)
					)
				)
			)
		)
		(symbol "LED_6"
			(pin_numbers hide)
			(pin_names
				(offset 1.016) hide)
			(exclude_from_sim no)
			(in_bom yes)
			(on_board yes)
			(property "Reference" "D"
				(at 0 2.54 0)
				(effects
					(font
						(size 1.27 1.27)
					)
				)
			)
			(property "Value" "LED_6"
				(at 0 -2.54 0)
				(effects
					(font
						(size 1.27 1.27)
					)
				)
			)
			(property "Footprint" ""
				(at 0 0 0)
				(effects
					(font
						(size 1.27 1.27)
					)
					(hide yes)
				)
			)
			(property "Datasheet" "~"
				(at 0 0 0)
				(effects
					(font
						(size 1.27 1.27)
					)
					(hide yes)
				)
			)
			(property "Description" "Light emitting diode"
				(at 0 0 0)
				(effects
					(font
						(size 1.27 1.27)
					)
					(hide yes)
				)
			)
			(property "ki_keywords" "LED diode"
				(at 0 0 0)
				(effects
					(font
						(size 1.27 1.27)
					)
					(hide yes)
				)
			)
			(property "ki_fp_filters" "LED* LED_SMD:* LED_THT:*"
				(at 0 0 0)
				(effects
					(font
						(size 1.27 1.27)
					)
					(hide yes)
				)
			)
			(symbol "LED_6_0_1"
				(polyline
					(pts
						(xy -1.27 -1.27) (xy -1.27 1.27)
					)
					(stroke
						(width 0.254)
						(type default)
					)
					(fill
						(type none)
					)
				)
				(polyline
					(pts
						(xy -1.27 0) (xy 1.27 0)
					)
					(stroke
						(width 0)
						(type default)
					)
					(fill
						(type none)
					)
				)
				(polyline
					(pts
						(xy 1.27 -1.27) (xy 1.27 1.27) (xy -1.27 0) (xy 1.27 -1.27)
					)
					(stroke
						(width 0.254)
						(type default)
					)
					(fill
						(type none)
					)
				)
				(polyline
					(pts
						(xy -3.048 -0.762) (xy -4.572 -2.286) (xy -3.81 -2.286) (xy -4.572 -2.286) (xy -4.572 -1.524)
					)
					(stroke
						(width 0)
						(type default)
					)
					(fill
						(type none)
					)
				)
				(polyline
					(pts
						(xy -1.778 -0.762) (xy -3.302 -2.286) (xy -2.54 -2.286) (xy -3.302 -2.286) (xy -3.302 -1.524)
					)
					(stroke
						(width 0)
						(type default)
					)
					(fill
						(type none)
					)
				)
			)
			(symbol "LED_6_1_1"
				(pin passive line
					(at -3.81 0 0)
					(length 2.54)
					(name "K"
						(effects
							(font
								(size 1.27 1.27)
							)
						)
					)
					(number "1"
						(effects
							(font
								(size 1.27 1.27)
							)
						)
					)
				)
				(pin passive line
					(at 3.81 0 180)
					(length 2.54)
					(name "A"
						(effects
							(font
								(size 1.27 1.27)
							)
						)
					)
					(number "2"
						(effects
							(font
								(size 1.27 1.27)
							)
						)
					)
				)
			)
		)
		(symbol "LED_7"
			(pin_numbers hide)
			(pin_names
				(offset 1.016) hide)
			(exclude_from_sim no)
			(in_bom yes)
			(on_board yes)
			(property "Reference" "D"
				(at 0 2.54 0)
				(effects
					(font
						(size 1.27 1.27)
					)
				)
			)
			(property "Value" "LED_7"
				(at 0 -2.54 0)
				(effects
					(font
						(size 1.27 1.27)
					)
				)
			)
			(property "Footprint" ""
				(at 0 0 0)
				(effects
					(font
						(size 1.27 1.27)
					)
					(hide yes)
				)
			)
			(property "Datasheet" "~"
				(at 0 0 0)
				(effects
					(font
						(size 1.27 1.27)
					)
					(hide yes)
				)
			)
			(property "Description" "Light emitting diode"
				(at 0 0 0)
				(effects
					(font
						(size 1.27 1.27)
					)
					(hide yes)
				)
			)
			(property "ki_keywords" "LED diode"
				(at 0 0 0)
				(effects
					(font
						(size 1.27 1.27)
					)
					(hide yes)
				)
			)
			(property "ki_fp_filters" "LED* LED_SMD:* LED_THT:*"
				(at 0 0 0)
				(effects
					(font
						(size 1.27 1.27)
					)
					(hide yes)
				)
			)
			(symbol "LED_7_0_1"
				(polyline
					(pts
						(xy -1.27 -1.27) (xy -1.27 1.27)
					)
					(stroke
						(width 0.254)
						(type default)
					)
					(fill
						(type none)
					)
				)
				(polyline
					(pts
						(xy -1.27 0) (xy 1.27 0)
					)
					(stroke
						(width 0)
						(type default)
					)
					(fill
						(type none)
					)
				)
				(polyline
					(pts
						(xy 1.27 -1.27) (xy 1.27 1.27) (xy -1.27 0) (xy 1.27 -1.27)
					)
					(stroke
						(width 0.254)
						(type default)
					)
					(fill
						(type none)
					)
				)
				(polyline
					(pts
						(xy -3.048 -0.762) (xy -4.572 -2.286) (xy -3.81 -2.286) (xy -4.572 -2.286) (xy -4.572 -1.524)
					)
					(stroke
						(width 0)
						(type default)
					)
					(fill
						(type none)
					)
				)
				(polyline
					(pts
						(xy -1.778 -0.762) (xy -3.302 -2.286) (xy -2.54 -2.286) (xy -3.302 -2.286) (xy -3.302 -1.524)
					)
					(stroke
						(width 0)
						(type default)
					)
					(fill
						(type none)
					)
				)
			)
			(symbol "LED_7_1_1"
				(pin passive line
					(at -3.81 0 0)
					(length 2.54)
					(name "K"
						(effects
							(font
								(size 1.27 1.27)
							)
						)
					)
					(number "1"
						(effects
							(font
								(size 1.27 1.27)
							)
						)
					)
				)
				(pin passive line
					(at 3.81 0 180)
					(length 2.54)
					(name "A"
						(effects
							(font
								(size 1.27 1.27)
							)
						)
					)
					(number "2"
						(effects
							(font
								(size 1.27 1.27)
							)
						)
					)
				)
			)
		)
		(symbol "LED_8"
			(pin_numbers hide)
			(pin_names
				(offset 1.016) hide)
			(exclude_from_sim no)
			(in_bom yes)
			(on_board yes)
			(property "Reference" "D"
				(at 0 2.54 0)
				(effects
					(font
						(size 1.27 1.27)
					)
				)
			)
			(property "Value" "LED_8"
				(at 0 -2.54 0)
				(effects
					(font
						(size 1.27 1.27)
					)
				)
			)
			(property "Footprint" ""
				(at 0 0 0)
				(effects
					(font
						(size 1.27 1.27)
					)
					(hide yes)
				)
			)
			(property "Datasheet" "~"
				(at 0 0 0)
				(effects
					(font
						(size 1.27 1.27)
					)
					(hide yes)
				)
			)
			(property "Description" "Light emitting diode"
				(at 0 0 0)
				(effects
					(font
						(size 1.27 1.27)
					)
					(hide yes)
				)
			)
			(property "ki_keywords" "LED diode"
				(at 0 0 0)
				(effects
					(font
						(size 1.27 1.27)
					)
					(hide yes)
				)
			)
			(property "ki_fp_filters" "LED* LED_SMD:* LED_THT:*"
				(at 0 0 0)
				(effects
					(font
						(size 1.27 1.27)
					)
					(hide yes)
				)
			)
			(symbol "LED_8_0_1"
				(polyline
					(pts
						(xy -1.27 -1.27) (xy -1.27 1.27)
					)
					(stroke
						(width 0.254)
						(type default)
					)
					(fill
						(type none)
					)
				)
				(polyline
					(pts
						(xy -1.27 0) (xy 1.27 0)
					)
					(stroke
						(width 0)
						(type default)
					)
					(fill
						(type none)
					)
				)
				(polyline
					(pts
						(xy 1.27 -1.27) (xy 1.27 1.27) (xy -1.27 0) (xy 1.27 -1.27)
					)
					(stroke
						(width 0.254)
						(type default)
					)
					(fill
						(type none)
					)
				)
				(polyline
					(pts
						(xy -3.048 -0.762) (xy -4.572 -2.286) (xy -3.81 -2.286) (xy -4.572 -2.286) (xy -4.572 -1.524)
					)
					(stroke
						(width 0)
						(type default)
					)
					(fill
						(type none)
					)
				)
				(polyline
					(pts
						(xy -1.778 -0.762) (xy -3.302 -2.286) (xy -2.54 -2.286) (xy -3.302 -2.286) (xy -3.302 -1.524)
					)
					(stroke
						(width 0)
						(type default)
					)
					(fill
						(type none)
					)
				)
			)
			(symbol "LED_8_1_1"
				(pin passive line
					(at -3.81 0 0)
					(length 2.54)
					(name "K"
						(effects
							(font
								(size 1.27 1.27)
							)
						)
					)
					(number "1"
						(effects
							(font
								(size 1.27 1.27)
							)
						)
					)
				)
				(pin passive line
					(at 3.81 0 180)
					(length 2.54)
					(name "A"
						(effects
							(font
								(size 1.27 1.27)
							)
						)
					)
					(number "2"
						(effects
							(font
								(size 1.27 1.27)
							)
						)
					)
				)
			)
		)
		(symbol "LED_9"
			(pin_numbers hide)
			(pin_names
				(offset 1.016) hide)
			(exclude_from_sim no)
			(in_bom yes)
			(on_board yes)
			(property "Reference" "D"
				(at 0 2.54 0)
				(effects
					(font
						(size 1.27 1.27)
					)
				)
			)
			(property "Value" "LED_9"
				(at 0 -2.54 0)
				(effects
					(font
						(size 1.27 1.27)
					)
				)
			)
			(property "Footprint" ""
				(at 0 0 0)
				(effects
					(font
						(size 1.27 1.27)
					)
					(hide yes)
				)
			)
			(property "Datasheet" "~"
				(at 0 0 0)
				(effects
					(font
						(size 1.27 1.27)
					)
					(hide yes)
				)
			)
			(property "Description" "Light emitting diode"
				(at 0 0 0)
				(effects
					(font
						(size 1.27 1.27)
					)
					(hide yes)
				)
			)
			(property "ki_keywords" "LED diode"
				(at 0 0 0)
				(effects
					(font
						(size 1.27 1.27)
					)
					(hide yes)
				)
			)
			(property "ki_fp_filters" "LED* LED_SMD:* LED_THT:*"
				(at 0 0 0)
				(effects
					(font
						(size 1.27 1.27)
					)
					(hide yes)
				)
			)
			(symbol "LED_9_0_1"
				(polyline
					(pts
						(xy -1.27 -1.27) (xy -1.27 1.27)
					)
					(stroke
						(width 0.254)
						(type default)
					)
					(fill
						(type none)
					)
				)
				(polyline
					(pts
						(xy -1.27 0) (xy 1.27 0)
					)
					(stroke
						(width 0)
						(type default)
					)
					(fill
						(type none)
					)
				)
				(polyline
					(pts
						(xy 1.27 -1.27) (xy 1.27 1.27) (xy -1.27 0) (xy 1.27 -1.27)
					)
					(stroke
						(width 0.254)
						(type default)
					)
					(fill
						(type none)
					)
				)
				(polyline
					(pts
						(xy -3.048 -0.762) (xy -4.572 -2.286) (xy -3.81 -2.286) (xy -4.572 -2.286) (xy -4.572 -1.524)
					)
					(stroke
						(width 0)
						(type default)
					)
					(fill
						(type none)
					)
				)
				(polyline
					(pts
						(xy -1.778 -0.762) (xy -3.302 -2.286) (xy -2.54 -2.286) (xy -3.302 -2.286) (xy -3.302 -1.524)
					)
					(stroke
						(width 0)
						(type default)
					)
					(fill
						(type none)
					)
				)
			)
			(symbol "LED_9_1_1"
				(pin passive line
					(at -3.81 0 0)
					(length 2.54)
					(name "K"
						(effects
							(font
								(size 1.27 1.27)
							)
						)
					)
					(number "1"
						(effects
							(font
								(size 1.27 1.27)
							)
						)
					)
				)
				(pin passive line
					(at 3.81 0 180)
					(length 2.54)
					(name "A"
						(effects
							(font
								(size 1.27 1.27)
							)
						)
					)
					(number "2"
						(effects
							(font
								(size 1.27 1.27)
							)
						)
					)
				)
			)
		)
	)
	(junction
		(at 123.19 88.9)
		(diameter 0)
		(color 0 0 0 0)
		(uuid "239184fc-8a9e-470c-9a1e-e2a3ad7b1a6a")
	)
	(junction
		(at 148.59 66.04)
		(diameter 0)
		(color 0 0 0 0)
		(uuid "44a1aab6-ccf8-48bd-bf2e-0bad40129169")
	)
	(junction
		(at 143.51 88.9)
		(diameter 0)
		(color 0 0 0 0)
		(uuid "7adb6f2f-702c-4b8f-83e2-1aaeab8c3623")
	)
	(junction
		(at 163.83 88.9)
		(diameter 0)
		(color 0 0 0 0)
		(uuid "8840f315-d6ad-40bc-82b3-cb3cc69e996c")
	)
	(junction
		(at 125.73 66.04)
		(diameter 0)
		(color 0 0 0 0)
		(uuid "8fe6c491-5b63-4810-bcdc-8f2d853dc363")
	)
	(junction
		(at 194.31 66.04)
		(diameter 0)
		(color 0 0 0 0)
		(uuid "9acb149f-c8a2-4634-8a72-b26b16fb07ba")
	)
	(junction
		(at 184.15 88.9)
		(diameter 0)
		(color 0 0 0 0)
		(uuid "a4e7ce55-566f-4904-8dcd-b50fea7faf8c")
	)
	(junction
		(at 102.87 88.9)
		(diameter 0)
		(color 0 0 0 0)
		(uuid "c0482252-ec67-44ee-b75d-c94ea881019e")
	)
	(junction
		(at 171.45 66.04)
		(diameter 0)
		(color 0 0 0 0)
		(uuid "f1359800-2f55-422e-821b-28dab450b46f")
	)
	(junction
		(at 102.87 66.04)
		(diameter 0)
		(color 0 0 0 0)
		(uuid "f7ce4c07-86a1-44ed-85a7-52168a296dda")
	)
	(wire
		(pts
			(xy 171.45 78.74) (xy 171.45 76.2)
		)
		(stroke
			(width 0)
			(type default)
		)
		(uuid "054632ad-2cb6-4d8d-9fa6-78fe1a26f539")
	)
	(wire
		(pts
			(xy 171.45 66.04) (xy 171.45 68.58)
		)
		(stroke
			(width 0)
			(type default)
		)
		(uuid "08fd2f3b-503c-4143-8086-75ea5494c38c")
	)
	(polyline
		(pts
			(xy 80.01 118.11) (xy 163.83 118.11)
		)
		(stroke
			(width 0)
			(type dash)
		)
		(uuid "164116e2-48db-43c1-8a3d-348d60d2165f")
	)
	(wire
		(pts
			(xy 143.51 88.9) (xy 163.83 88.9)
		)
		(stroke
			(width 0)
			(type default)
		)
		(uuid "1c25b0c6-c78c-451d-b0a5-a819a97ceee9")
	)
	(polyline
		(pts
			(xy 222.25 105.41) (xy 80.01 105.41)
		)
		(stroke
			(width 0)
			(type dash)
		)
		(uuid "1efe1e60-2b4d-48f0-a284-23c0f3a76149")
	)
	(wire
		(pts
			(xy 191.77 78.74) (xy 194.31 78.74)
		)
		(stroke
			(width 0)
			(type default)
		)
		(uuid "23c49063-9d1a-43f8-b8df-6abe774cd061")
	)
	(wire
		(pts
			(xy 102.87 66.04) (xy 102.87 68.58)
		)
		(stroke
			(width 0)
			(type default)
		)
		(uuid "260dbe43-c568-40b3-932b-39a87c748679")
	)
	(polyline
		(pts
			(xy 80.01 62.23) (xy 222.25 62.23)
		)
		(stroke
			(width 0)
			(type dash)
		)
		(uuid "299a3d86-cc30-4b29-922f-75b47d054dd0")
	)
	(wire
		(pts
			(xy 102.87 78.74) (xy 102.87 76.2)
		)
		(stroke
			(width 0)
			(type default)
		)
		(uuid "2a98569a-f57c-471d-8262-c1fdffaa59a0")
	)
	(wire
		(pts
			(xy 120.65 101.6) (xy 123.19 101.6)
		)
		(stroke
			(width 0)
			(type default)
		)
		(uuid "40b6bd39-e313-44aa-b0fb-088b7c46b8b5")
	)
	(wire
		(pts
			(xy 125.73 78.74) (xy 125.73 76.2)
		)
		(stroke
			(width 0)
			(type default)
		)
		(uuid "4f3b2348-f183-4c04-97a2-4734c9e62e3a")
	)
	(wire
		(pts
			(xy 148.59 66.04) (xy 148.59 68.58)
		)
		(stroke
			(width 0)
			(type default)
		)
		(uuid "54a244f4-8ec1-4d1d-af06-2ef6ba81cc88")
	)
	(wire
		(pts
			(xy 161.29 101.6) (xy 163.83 101.6)
		)
		(stroke
			(width 0)
			(type default)
		)
		(uuid "56066ebf-571c-4497-8f34-8fd35612403c")
	)
	(wire
		(pts
			(xy 217.17 68.58) (xy 217.17 66.04)
		)
		(stroke
			(width 0)
			(type default)
		)
		(uuid "582d2fa4-f80d-4b99-b17a-44e72a1c699d")
	)
	(wire
		(pts
			(xy 125.73 66.04) (xy 125.73 68.58)
		)
		(stroke
			(width 0)
			(type default)
		)
		(uuid "584c3bd9-7f64-4317-a948-0f268fce4dd0")
	)
	(polyline
		(pts
			(xy 163.83 118.11) (xy 163.83 139.7)
		)
		(stroke
			(width 0)
			(type dash)
		)
		(uuid "5a8c5eda-af4b-460f-9db4-9923b094350d")
	)
	(polyline
		(pts
			(xy 80.01 118.11) (xy 80.01 139.7)
		)
		(stroke
			(width 0)
			(type dash)
		)
		(uuid "5d3f6609-d39d-40b2-bc34-50d5e93ac2e7")
	)
	(wire
		(pts
			(xy 146.05 78.74) (xy 148.59 78.74)
		)
		(stroke
			(width 0)
			(type default)
		)
		(uuid "66a220d2-d70e-4e15-a542-186486dab543")
	)
	(wire
		(pts
			(xy 97.79 66.04) (xy 102.87 66.04)
		)
		(stroke
			(width 0)
			(type default)
		)
		(uuid "679fbe28-2655-4519-b1bc-e03433da2326")
	)
	(wire
		(pts
			(xy 214.63 78.74) (xy 217.17 78.74)
		)
		(stroke
			(width 0)
			(type default)
		)
		(uuid "6ddcdfd4-2438-4e2f-af12-d811abc9f505")
	)
	(wire
		(pts
			(xy 163.83 101.6) (xy 163.83 99.06)
		)
		(stroke
			(width 0)
			(type default)
		)
		(uuid "72835ff5-3d16-4e3e-8052-e5ecd4ebc07e")
	)
	(wire
		(pts
			(xy 140.97 101.6) (xy 143.51 101.6)
		)
		(stroke
			(width 0)
			(type default)
		)
		(uuid "763aad10-4bab-4cbc-8791-913cf076b6af")
	)
	(polyline
		(pts
			(xy 80.01 62.23) (xy 80.01 105.41)
		)
		(stroke
			(width 0)
			(type dash)
		)
		(uuid "81e4d6b7-2362-4795-a290-85d68e614efd")
	)
	(wire
		(pts
			(xy 148.59 78.74) (xy 148.59 76.2)
		)
		(stroke
			(width 0)
			(type default)
		)
		(uuid "851d1261-97e9-495b-9fe5-2b13e0809aa9")
	)
	(wire
		(pts
			(xy 100.33 88.9) (xy 102.87 88.9)
		)
		(stroke
			(width 0)
			(type default)
		)
		(uuid "94189263-d7fe-4ee2-a358-97601fe7e250")
	)
	(wire
		(pts
			(xy 123.19 88.9) (xy 123.19 91.44)
		)
		(stroke
			(width 0)
			(type default)
		)
		(uuid "9495d3e9-c23a-44b2-9098-df447f4b068d")
	)
	(wire
		(pts
			(xy 148.59 66.04) (xy 171.45 66.04)
		)
		(stroke
			(width 0)
			(type default)
		)
		(uuid "94e32399-93be-48be-8418-297ee171703d")
	)
	(wire
		(pts
			(xy 102.87 88.9) (xy 123.19 88.9)
		)
		(stroke
			(width 0)
			(type default)
		)
		(uuid "9779f206-e805-4e89-a1c4-c6847296351e")
	)
	(wire
		(pts
			(xy 143.51 101.6) (xy 143.51 99.06)
		)
		(stroke
			(width 0)
			(type default)
		)
		(uuid "9ba723b0-605d-494e-94c1-060ee3a95db0")
	)
	(wire
		(pts
			(xy 217.17 78.74) (xy 217.17 76.2)
		)
		(stroke
			(width 0)
			(type default)
		)
		(uuid "9bdc178e-7b92-4e75-8bc7-58c9606ac6a9")
	)
	(polyline
		(pts
			(xy 222.25 62.23) (xy 222.25 105.41)
		)
		(stroke
			(width 0)
			(type dash)
		)
		(uuid "9e5fbb14-fb75-4b7b-808a-7f69fc2a9fbf")
	)
	(wire
		(pts
			(xy 163.83 88.9) (xy 163.83 91.44)
		)
		(stroke
			(width 0)
			(type default)
		)
		(uuid "a0ad2c69-7819-454d-9552-9ff193b28f64")
	)
	(wire
		(pts
			(xy 123.19 78.74) (xy 125.73 78.74)
		)
		(stroke
			(width 0)
			(type default)
		)
		(uuid "a1a5280e-8e2a-48cd-84e0-65268e6667b0")
	)
	(wire
		(pts
			(xy 143.51 88.9) (xy 143.51 91.44)
		)
		(stroke
			(width 0)
			(type default)
		)
		(uuid "a26c3372-825c-44b2-872d-38a69627824a")
	)
	(wire
		(pts
			(xy 171.45 66.04) (xy 194.31 66.04)
		)
		(stroke
			(width 0)
			(type default)
		)
		(uuid "a83b4c24-07db-4483-956a-d44de0f8f78a")
	)
	(wire
		(pts
			(xy 194.31 66.04) (xy 194.31 68.58)
		)
		(stroke
			(width 0)
			(type default)
		)
		(uuid "a936c377-58fc-46c9-93d9-801c121bb0e6")
	)
	(wire
		(pts
			(xy 194.31 78.74) (xy 194.31 76.2)
		)
		(stroke
			(width 0)
			(type default)
		)
		(uuid "ac91da61-e240-45f7-94fe-39fe022783e9")
	)
	(wire
		(pts
			(xy 102.87 66.04) (xy 125.73 66.04)
		)
		(stroke
			(width 0)
			(type default)
		)
		(uuid "acdf6262-e419-44db-b8e8-d39386c5e9ba")
	)
	(wire
		(pts
			(xy 204.47 88.9) (xy 204.47 91.44)
		)
		(stroke
			(width 0)
			(type default)
		)
		(uuid "b06e1046-a1d7-42d5-83c5-98221f2dbaa4")
	)
	(wire
		(pts
			(xy 184.15 101.6) (xy 184.15 99.06)
		)
		(stroke
			(width 0)
			(type default)
		)
		(uuid "b10f90df-3118-4d87-9477-3cfbf10d60b3")
	)
	(wire
		(pts
			(xy 123.19 101.6) (xy 123.19 99.06)
		)
		(stroke
			(width 0)
			(type default)
		)
		(uuid "c3f5d4f5-f8e7-4e5b-9291-3dfb142cc26e")
	)
	(wire
		(pts
			(xy 194.31 66.04) (xy 217.17 66.04)
		)
		(stroke
			(width 0)
			(type default)
		)
		(uuid "cbac76a3-8586-44c3-a9d7-a5fdf26e5978")
	)
	(polyline
		(pts
			(xy 163.83 139.7) (xy 80.01 139.7)
		)
		(stroke
			(width 0)
			(type dash)
		)
		(uuid "cf9bcc2c-7e6f-47fc-8b06-55f9e7b5b1b0")
	)
	(wire
		(pts
			(xy 100.33 78.74) (xy 102.87 78.74)
		)
		(stroke
			(width 0)
			(type default)
		)
		(uuid "d596be12-53f9-40b9-97a1-dbbc6e3c59c9")
	)
	(wire
		(pts
			(xy 123.19 88.9) (xy 143.51 88.9)
		)
		(stroke
			(width 0)
			(type default)
		)
		(uuid "d6e24ca7-a462-4a23-8062-e5aff5de09ec")
	)
	(wire
		(pts
			(xy 204.47 101.6) (xy 204.47 99.06)
		)
		(stroke
			(width 0)
			(type default)
		)
		(uuid "e6419fd1-7425-4208-83b8-6d0304e0c34a")
	)
	(wire
		(pts
			(xy 168.91 78.74) (xy 171.45 78.74)
		)
		(stroke
			(width 0)
			(type default)
		)
		(uuid "e70d0dde-a736-40a5-a64f-3fda1dbc9af4")
	)
	(wire
		(pts
			(xy 184.15 88.9) (xy 204.47 88.9)
		)
		(stroke
			(width 0)
			(type default)
		)
		(uuid "eb56e1f9-4c43-4665-ba7d-ef3252fd56d7")
	)
	(wire
		(pts
			(xy 181.61 101.6) (xy 184.15 101.6)
		)
		(stroke
			(width 0)
			(type default)
		)
		(uuid "eba669a4-3f1b-47ae-9ec0-9fdd2e694172")
	)
	(wire
		(pts
			(xy 100.33 101.6) (xy 102.87 101.6)
		)
		(stroke
			(width 0)
			(type default)
		)
		(uuid "ee0d5c87-ed18-4128-812f-4aac17ef7fdc")
	)
	(wire
		(pts
			(xy 201.93 101.6) (xy 204.47 101.6)
		)
		(stroke
			(width 0)
			(type default)
		)
		(uuid "efa705ca-a9de-4bf6-8e72-845989d23d5d")
	)
	(wire
		(pts
			(xy 184.15 88.9) (xy 184.15 91.44)
		)
		(stroke
			(width 0)
			(type default)
		)
		(uuid "f0e9b96f-fe2d-496c-8ec0-fc54ed086546")
	)
	(wire
		(pts
			(xy 163.83 88.9) (xy 184.15 88.9)
		)
		(stroke
			(width 0)
			(type default)
		)
		(uuid "fd16a6c2-549b-4540-8090-09195a7805b6")
	)
	(wire
		(pts
			(xy 102.87 88.9) (xy 102.87 91.44)
		)
		(stroke
			(width 0)
			(type default)
		)
		(uuid "fd7ad4b1-f7c9-4b60-8ac7-dc4c61c1848c")
	)
	(wire
		(pts
			(xy 125.73 66.04) (xy 148.59 66.04)
		)
		(stroke
			(width 0)
			(type default)
		)
		(uuid "ffd47cf6-eb75-46bd-91ab-6f0a6ee9e84b")
	)
	(wire
		(pts
			(xy 102.87 101.6) (xy 102.87 99.06)
		)
		(stroke
			(width 0)
			(type default)
		)
		(uuid "ffd7e3fb-ff7b-47c5-a515-f862b8b01582")
	)
	(text "If = 10 mA @ Vf = 3.1 V"
		(exclude_from_sim no)
		(at 83.82 83.82 0)
		(effects
			(font
				(size 0.9906 0.9906)
			)
			(justify left bottom)
		)
		(uuid "5576cd03-3bad-40c5-9316-1d286895d52a")
	)
	(text "Connection:\n\nPower:\nSERVER_LED_VCC	=> 3V3\n\nLEDs:\nSERVER_LED_01..12	=> Activity LED, LED driver sink connection\nSERVER_STATUSLED_01..12	=> Status/Load LED, LED driver sink connection"
		(exclude_from_sim no)
		(at 82.55 137.16 0)
		(effects
			(font
				(size 1.27 1.27)
			)
			(justify left bottom)
		)
		(uuid "ad31854d-273c-44cf-89bd-0934ba4f698d")
	)
	(hierarchical_label "SERVER_LED_2"
		(shape input)
		(at 120.65 101.6 180)
		(fields_autoplaced yes)
		(effects
			(font
				(size 0.9906 0.9906)
			)
			(justify right)
		)
		(uuid "1b023dd4-5185-4576-b544-68a05b9c360b")
	)
	(hierarchical_label "SERVER_LED_4"
		(shape input)
		(at 161.29 101.6 180)
		(fields_autoplaced yes)
		(effects
			(font
				(size 0.9906 0.9906)
			)
			(justify right)
		)
		(uuid "26bc8641-9bca-4204-9709-deedbe202a36")
	)
	(hierarchical_label "SERVER_STATUSLED_4"
		(shape input)
		(at 168.91 78.74 180)
		(fields_autoplaced yes)
		(effects
			(font
				(size 0.9906 0.9906)
			)
			(justify right)
		)
		(uuid "62e8c4d4-266c-4e53-8981-1028251d724c")
	)
	(hierarchical_label "SERVER_STATUSLED_2"
		(shape input)
		(at 123.19 78.74 180)
		(fields_autoplaced yes)
		(effects
			(font
				(size 0.9906 0.9906)
			)
			(justify right)
		)
		(uuid "66bc2bca-dab7-4947-a0ff-403cdaf9fb89")
	)
	(hierarchical_label "SERVER_STATUSLED_5"
		(shape input)
		(at 191.77 78.74 180)
		(fields_autoplaced yes)
		(effects
			(font
				(size 0.9906 0.9906)
			)
			(justify right)
		)
		(uuid "6d0c9e39-9878-44c8-8283-9a59e45006fa")
	)
	(hierarchical_label "SERVER_STATUSLED_6"
		(shape input)
		(at 214.63 78.74 180)
		(fields_autoplaced yes)
		(effects
			(font
				(size 0.9906 0.9906)
			)
			(justify right)
		)
		(uuid "75b944f9-bf25-4dc7-8104-e9f80b4f359b")
	)
	(hierarchical_label "SERVER_STATUSLED_3"
		(shape input)
		(at 146.05 78.74 180)
		(fields_autoplaced yes)
		(effects
			(font
				(size 0.9906 0.9906)
			)
			(justify right)
		)
		(uuid "8cdc8ef9-532e-4bf5-9998-7213b9e692a2")
	)
	(hierarchical_label "SERVER_STATUSLED_1"
		(shape input)
		(at 100.33 78.74 180)
		(fields_autoplaced yes)
		(effects
			(font
				(size 0.9906 0.9906)
			)
			(justify right)
		)
		(uuid "901440f4-e2a6-4447-83cc-f58a2b26f5c4")
	)
	(hierarchical_label "SERVER_LED_6"
		(shape input)
		(at 201.93 101.6 180)
		(fields_autoplaced yes)
		(effects
			(font
				(size 0.9906 0.9906)
			)
			(justify right)
		)
		(uuid "92f063a3-7cce-4a96-8a3a-cf5767f700c6")
	)
	(hierarchical_label "SERVER_LED_VCC"
		(shape input)
		(at 97.79 66.04 180)
		(fields_autoplaced yes)
		(effects
			(font
				(size 1 1)
			)
			(justify right)
		)
		(uuid "a94d4b1c-1b29-44e1-949b-6225b8e5c0bf")
	)
	(hierarchical_label "SERVER_LED_5"
		(shape input)
		(at 181.61 101.6 180)
		(fields_autoplaced yes)
		(effects
			(font
				(size 0.9906 0.9906)
			)
			(justify right)
		)
		(uuid "da546d77-4b03-4562-8fc6-837fd68e7691")
	)
	(hierarchical_label "SERVER_LED_3"
		(shape input)
		(at 140.97 101.6 180)
		(fields_autoplaced yes)
		(effects
			(font
				(size 0.9906 0.9906)
			)
			(justify right)
		)
		(uuid "dd334895-c8ff-4719-bac4-c0b289bb5899")
	)
	(hierarchical_label "SERVER_LED_1"
		(shape input)
		(at 100.33 101.6 180)
		(fields_autoplaced yes)
		(effects
			(font
				(size 0.9906 0.9906)
			)
			(justify right)
		)
		(uuid "e70d061b-28f0-4421-ad15-0598604086e8")
	)
	(hierarchical_label "SERVER_LED_VCC"
		(shape input)
		(at 100.33 88.9 180)
		(fields_autoplaced yes)
		(effects
			(font
				(size 1 1)
			)
			(justify right)
		)
		(uuid "ff0c13fb-7760-455e-ba4d-6243e79e2134")
	)
	(symbol
		(lib_name "LED_11")
		(lib_id "Device:LED")
		(at 125.73 72.39 270)
		(mirror x)
		(unit 1)
		(exclude_from_sim no)
		(in_bom yes)
		(on_board yes)
		(dnp no)
		(uuid "00000000-0000-0000-0000-00005f3662c9")
		(property "Reference" "D4"
			(at 122.7328 71.3994 90)
			(effects
				(font
					(size 0.9906 0.9906)
				)
				(justify right)
			)
		)
		(property "Value" "IN-S126AT5UW"
			(at 122.7328 73.7108 90)
			(effects
				(font
					(size 0.9906 0.9906)
				)
				(justify right)
			)
		)
		(property "Footprint" "LED_SMD:LED_1206_3216Metric_Castellated"
			(at 125.73 72.39 0)
			(effects
				(font
					(size 1.27 1.27)
				)
				(hide yes)
			)
		)
		(property "Datasheet" "http://inolux-corp.com/datasheet/SMDLED/Mono%20Color%20Top%20View/IN-S126AT%20Series_V1.0.pdf"
			(at 125.73 72.39 0)
			(effects
				(font
					(size 1.27 1.27)
				)
				(hide yes)
			)
		)
		(property "Description" ""
			(at 125.73 72.39 0)
			(effects
				(font
					(size 1.27 1.27)
				)
				(hide yes)
			)
		)
		(property "Mfr" "IN-S126AT5UW"
			(at 125.73 72.39 0)
			(effects
				(font
					(size 1.27 1.27)
				)
				(hide yes)
			)
		)
		(pin "1"
			(uuid "581488ee-fe1f-43d1-a23d-526666571191")
		)
		(pin "2"
			(uuid "58e02161-61cc-4d0f-bdc8-c497a25ae380")
		)
		(instances
			(project ""
				(path "/8ca3e20d-bcc7-4c5e-9deb-562dfed9fecb/00000000-0000-0000-0000-00005f1207d0"
					(reference "D4")
					(unit 1)
				)
			)
		)
	)
	(symbol
		(lib_name "LED_10")
		(lib_id "Device:LED")
		(at 148.59 72.39 270)
		(mirror x)
		(unit 1)
		(exclude_from_sim no)
		(in_bom yes)
		(on_board yes)
		(dnp no)
		(uuid "00000000-0000-0000-0000-00005f425cd1")
		(property "Reference" "D6"
			(at 145.5928 71.3994 90)
			(effects
				(font
					(size 0.9906 0.9906)
				)
				(justify right)
			)
		)
		(property "Value" "IN-S126AT5UW"
			(at 145.5928 73.7108 90)
			(effects
				(font
					(size 0.9906 0.9906)
				)
				(justify right)
			)
		)
		(property "Footprint" "LED_SMD:LED_1206_3216Metric_Castellated"
			(at 148.59 72.39 0)
			(effects
				(font
					(size 1.27 1.27)
				)
				(hide yes)
			)
		)
		(property "Datasheet" "http://inolux-corp.com/datasheet/SMDLED/Mono%20Color%20Top%20View/IN-S126AT%20Series_V1.0.pdf"
			(at 148.59 72.39 0)
			(effects
				(font
					(size 1.27 1.27)
				)
				(hide yes)
			)
		)
		(property "Description" ""
			(at 148.59 72.39 0)
			(effects
				(font
					(size 1.27 1.27)
				)
				(hide yes)
			)
		)
		(property "Mfr" "IN-S126AT5UW"
			(at 148.59 72.39 0)
			(effects
				(font
					(size 1.27 1.27)
				)
				(hide yes)
			)
		)
		(pin "1"
			(uuid "6f13bfbf-7f19-4b33-9de2-b8c15c8c88ee")
		)
		(pin "2"
			(uuid "9959c68a-7d2a-4f14-b245-3548992673f3")
		)
		(instances
			(project ""
				(path "/8ca3e20d-bcc7-4c5e-9deb-562dfed9fecb/00000000-0000-0000-0000-00005f1207d0"
					(reference "D6")
					(unit 1)
				)
			)
		)
	)
	(symbol
		(lib_id "Device:LED")
		(at 102.87 72.39 270)
		(mirror x)
		(unit 1)
		(exclude_from_sim no)
		(in_bom yes)
		(on_board yes)
		(dnp no)
		(uuid "00000000-0000-0000-0000-00005f42e3ba")
		(property "Reference" "D2"
			(at 99.8728 71.3994 90)
			(effects
				(font
					(size 0.9906 0.9906)
				)
				(justify right)
			)
		)
		(property "Value" "IN-S126AT5UW"
			(at 99.8728 73.7108 90)
			(effects
				(font
					(size 0.9906 0.9906)
				)
				(justify right)
			)
		)
		(property "Footprint" "LED_SMD:LED_1206_3216Metric_Castellated"
			(at 102.87 72.39 0)
			(effects
				(font
					(size 1.27 1.27)
				)
				(hide yes)
			)
		)
		(property "Datasheet" "http://inolux-corp.com/datasheet/SMDLED/Mono%20Color%20Top%20View/IN-S126AT%20Series_V1.0.pdf"
			(at 102.87 72.39 0)
			(effects
				(font
					(size 1.27 1.27)
				)
				(hide yes)
			)
		)
		(property "Description" ""
			(at 102.87 72.39 0)
			(effects
				(font
					(size 1.27 1.27)
				)
				(hide yes)
			)
		)
		(property "Mfr" "IN-S126AT5UW"
			(at 102.87 72.39 0)
			(effects
				(font
					(size 1.27 1.27)
				)
				(hide yes)
			)
		)
		(pin "1"
			(uuid "856c0384-2dfc-47d2-a66c-a145c3149f14")
		)
		(pin "2"
			(uuid "e4d0483b-1c21-4fb6-87dd-47e636746c0e")
		)
		(instances
			(project ""
				(path "/8ca3e20d-bcc7-4c5e-9deb-562dfed9fecb/00000000-0000-0000-0000-00005f1207d0"
					(reference "D2")
					(unit 1)
				)
			)
		)
	)
	(symbol
		(lib_name "LED_9")
		(lib_id "Device:LED")
		(at 171.45 72.39 270)
		(mirror x)
		(unit 1)
		(exclude_from_sim no)
		(in_bom yes)
		(on_board yes)
		(dnp no)
		(uuid "00000000-0000-0000-0000-00005f433397")
		(property "Reference" "D8"
			(at 168.4528 71.3994 90)
			(effects
				(font
					(size 0.9906 0.9906)
				)
				(justify right)
			)
		)
		(property "Value" "IN-S126AT5UW"
			(at 168.4528 73.7108 90)
			(effects
				(font
					(size 0.9906 0.9906)
				)
				(justify right)
			)
		)
		(property "Footprint" "LED_SMD:LED_1206_3216Metric_Castellated"
			(at 171.45 72.39 0)
			(effects
				(font
					(size 1.27 1.27)
				)
				(hide yes)
			)
		)
		(property "Datasheet" "http://inolux-corp.com/datasheet/SMDLED/Mono%20Color%20Top%20View/IN-S126AT%20Series_V1.0.pdf"
			(at 171.45 72.39 0)
			(effects
				(font
					(size 1.27 1.27)
				)
				(hide yes)
			)
		)
		(property "Description" ""
			(at 171.45 72.39 0)
			(effects
				(font
					(size 1.27 1.27)
				)
				(hide yes)
			)
		)
		(property "Mfr" "IN-S126AT5UW"
			(at 171.45 72.39 0)
			(effects
				(font
					(size 1.27 1.27)
				)
				(hide yes)
			)
		)
		(pin "1"
			(uuid "d6cc98ff-7d68-4734-afa1-c7dd225e08d3")
		)
		(pin "2"
			(uuid "90207e9d-650a-4c45-b7d5-e506cc85537d")
		)
		(instances
			(project ""
				(path "/8ca3e20d-bcc7-4c5e-9deb-562dfed9fecb/00000000-0000-0000-0000-00005f1207d0"
					(reference "D8")
					(unit 1)
				)
			)
		)
	)
	(symbol
		(lib_name "LED_8")
		(lib_id "Device:LED")
		(at 194.31 72.39 270)
		(mirror x)
		(unit 1)
		(exclude_from_sim no)
		(in_bom yes)
		(on_board yes)
		(dnp no)
		(uuid "00000000-0000-0000-0000-00005f438027")
		(property "Reference" "D10"
			(at 191.3128 71.3994 90)
			(effects
				(font
					(size 0.9906 0.9906)
				)
				(justify right)
			)
		)
		(property "Value" "IN-S126AT5UW"
			(at 191.3128 73.7108 90)
			(effects
				(font
					(size 0.9906 0.9906)
				)
				(justify right)
			)
		)
		(property "Footprint" "LED_SMD:LED_1206_3216Metric_Castellated"
			(at 194.31 72.39 0)
			(effects
				(font
					(size 1.27 1.27)
				)
				(hide yes)
			)
		)
		(property "Datasheet" "http://inolux-corp.com/datasheet/SMDLED/Mono%20Color%20Top%20View/IN-S126AT%20Series_V1.0.pdf"
			(at 194.31 72.39 0)
			(effects
				(font
					(size 1.27 1.27)
				)
				(hide yes)
			)
		)
		(property "Description" ""
			(at 194.31 72.39 0)
			(effects
				(font
					(size 1.27 1.27)
				)
				(hide yes)
			)
		)
		(property "Mfr" "IN-S126AT5UW"
			(at 194.31 72.39 0)
			(effects
				(font
					(size 1.27 1.27)
				)
				(hide yes)
			)
		)
		(pin "1"
			(uuid "e4df63e4-2a5a-405f-916a-ea67ff3a2b21")
		)
		(pin "2"
			(uuid "133bb99a-82f3-4f77-a20b-451874ac44f4")
		)
		(instances
			(project ""
				(path "/8ca3e20d-bcc7-4c5e-9deb-562dfed9fecb/00000000-0000-0000-0000-00005f1207d0"
					(reference "D10")
					(unit 1)
				)
			)
		)
	)
	(symbol
		(lib_name "LED_7")
		(lib_id "Device:LED")
		(at 217.17 72.39 270)
		(mirror x)
		(unit 1)
		(exclude_from_sim no)
		(in_bom yes)
		(on_board yes)
		(dnp no)
		(uuid "00000000-0000-0000-0000-00005f43c8cd")
		(property "Reference" "D12"
			(at 214.1728 71.3994 90)
			(effects
				(font
					(size 0.9906 0.9906)
				)
				(justify right)
			)
		)
		(property "Value" "IN-S126AT5UW"
			(at 214.1728 73.7108 90)
			(effects
				(font
					(size 0.9906 0.9906)
				)
				(justify right)
			)
		)
		(property "Footprint" "LED_SMD:LED_1206_3216Metric_Castellated"
			(at 217.17 72.39 0)
			(effects
				(font
					(size 1.27 1.27)
				)
				(hide yes)
			)
		)
		(property "Datasheet" "http://inolux-corp.com/datasheet/SMDLED/Mono%20Color%20Top%20View/IN-S126AT%20Series_V1.0.pdf"
			(at 217.17 72.39 0)
			(effects
				(font
					(size 1.27 1.27)
				)
				(hide yes)
			)
		)
		(property "Description" ""
			(at 217.17 72.39 0)
			(effects
				(font
					(size 1.27 1.27)
				)
				(hide yes)
			)
		)
		(property "Mfr" "IN-S126AT5UW"
			(at 217.17 72.39 0)
			(effects
				(font
					(size 1.27 1.27)
				)
				(hide yes)
			)
		)
		(pin "1"
			(uuid "56801e6d-c4ab-4f7b-8289-2119a52fa227")
		)
		(pin "2"
			(uuid "a8ed9f4d-0385-4ec2-831d-b6c7165c148a")
		)
		(instances
			(project ""
				(path "/8ca3e20d-bcc7-4c5e-9deb-562dfed9fecb/00000000-0000-0000-0000-00005f1207d0"
					(reference "D12")
					(unit 1)
				)
			)
		)
	)
	(symbol
		(lib_name "LED_2")
		(lib_id "Device:LED")
		(at 123.19 95.25 270)
		(mirror x)
		(unit 1)
		(exclude_from_sim no)
		(in_bom yes)
		(on_board yes)
		(dnp no)
		(uuid "00000000-0000-0000-0000-00005f473bd5")
		(property "Reference" "D5"
			(at 120.1928 94.2594 90)
			(effects
				(font
					(size 0.9906 0.9906)
				)
				(justify right)
			)
		)
		(property "Value" "IN-S126ATB"
			(at 120.1928 96.5708 90)
			(effects
				(font
					(size 0.9906 0.9906)
				)
				(justify right)
			)
		)
		(property "Footprint" "LED_SMD:LED_1206_3216Metric_Castellated"
			(at 123.19 95.25 0)
			(effects
				(font
					(size 1.27 1.27)
				)
				(hide yes)
			)
		)
		(property "Datasheet" "http://inolux-corp.com/datasheet/SMDLED/Mono%20Color%20Top%20View/IN-S126AT%20Series_V1.0.pdf"
			(at 123.19 95.25 0)
			(effects
				(font
					(size 1.27 1.27)
				)
				(hide yes)
			)
		)
		(property "Description" ""
			(at 123.19 95.25 0)
			(effects
				(font
					(size 1.27 1.27)
				)
				(hide yes)
			)
		)
		(property "Mfr" "IN-S126ATB "
			(at 123.19 95.25 0)
			(effects
				(font
					(size 1.27 1.27)
				)
				(hide yes)
			)
		)
		(pin "1"
			(uuid "3c3e78d8-62d7-4020-ae7c-c489234b27d5")
		)
		(pin "2"
			(uuid "9caefee8-6dcd-4815-b6e5-c75999fb9c90")
		)
		(instances
			(project ""
				(path "/8ca3e20d-bcc7-4c5e-9deb-562dfed9fecb/00000000-0000-0000-0000-00005f1207d0"
					(reference "D5")
					(unit 1)
				)
			)
		)
	)
	(symbol
		(lib_name "LED_3")
		(lib_id "Device:LED")
		(at 143.51 95.25 270)
		(mirror x)
		(unit 1)
		(exclude_from_sim no)
		(in_bom yes)
		(on_board yes)
		(dnp no)
		(uuid "00000000-0000-0000-0000-00005f473c09")
		(property "Reference" "D7"
			(at 140.5128 94.2594 90)
			(effects
				(font
					(size 0.9906 0.9906)
				)
				(justify right)
			)
		)
		(property "Value" "IN-S126ATB"
			(at 140.5128 96.5708 90)
			(effects
				(font
					(size 0.9906 0.9906)
				)
				(justify right)
			)
		)
		(property "Footprint" "LED_SMD:LED_1206_3216Metric_Castellated"
			(at 143.51 95.25 0)
			(effects
				(font
					(size 1.27 1.27)
				)
				(hide yes)
			)
		)
		(property "Datasheet" "http://inolux-corp.com/datasheet/SMDLED/Mono%20Color%20Top%20View/IN-S126AT%20Series_V1.0.pdf"
			(at 143.51 95.25 0)
			(effects
				(font
					(size 1.27 1.27)
				)
				(hide yes)
			)
		)
		(property "Description" ""
			(at 143.51 95.25 0)
			(effects
				(font
					(size 1.27 1.27)
				)
				(hide yes)
			)
		)
		(property "Mfr" "IN-S126ATB "
			(at 143.51 95.25 0)
			(effects
				(font
					(size 1.27 1.27)
				)
				(hide yes)
			)
		)
		(pin "1"
			(uuid "08fae221-7b6f-4c57-be73-6210c6206091")
		)
		(pin "2"
			(uuid "9ad54c14-6dd1-4741-ab11-80a0275cae72")
		)
		(instances
			(project ""
				(path "/8ca3e20d-bcc7-4c5e-9deb-562dfed9fecb/00000000-0000-0000-0000-00005f1207d0"
					(reference "D7")
					(unit 1)
				)
			)
		)
	)
	(symbol
		(lib_name "LED_1")
		(lib_id "Device:LED")
		(at 102.87 95.25 270)
		(mirror x)
		(unit 1)
		(exclude_from_sim no)
		(in_bom yes)
		(on_board yes)
		(dnp no)
		(uuid "00000000-0000-0000-0000-00005f473c3d")
		(property "Reference" "D3"
			(at 99.8728 94.2594 90)
			(effects
				(font
					(size 0.9906 0.9906)
				)
				(justify right)
			)
		)
		(property "Value" "IN-S126ATB"
			(at 99.8728 96.5708 90)
			(effects
				(font
					(size 0.9906 0.9906)
				)
				(justify right)
			)
		)
		(property "Footprint" "LED_SMD:LED_1206_3216Metric_Castellated"
			(at 102.87 95.25 0)
			(effects
				(font
					(size 1.27 1.27)
				)
				(hide yes)
			)
		)
		(property "Datasheet" "http://inolux-corp.com/datasheet/SMDLED/Mono%20Color%20Top%20View/IN-S126AT%20Series_V1.0.pdf"
			(at 102.87 95.25 0)
			(effects
				(font
					(size 1.27 1.27)
				)
				(hide yes)
			)
		)
		(property "Description" ""
			(at 102.87 95.25 0)
			(effects
				(font
					(size 1.27 1.27)
				)
				(hide yes)
			)
		)
		(property "Mfr" "IN-S126ATB "
			(at 102.87 95.25 0)
			(effects
				(font
					(size 1.27 1.27)
				)
				(hide yes)
			)
		)
		(pin "1"
			(uuid "50d092a1-cb48-4b36-9419-53ddb3f8fa14")
		)
		(pin "2"
			(uuid "ceb65f05-08ce-47e9-8a7e-aa1335099416")
		)
		(instances
			(project ""
				(path "/8ca3e20d-bcc7-4c5e-9deb-562dfed9fecb/00000000-0000-0000-0000-00005f1207d0"
					(reference "D3")
					(unit 1)
				)
			)
		)
	)
	(symbol
		(lib_name "LED_4")
		(lib_id "Device:LED")
		(at 163.83 95.25 270)
		(mirror x)
		(unit 1)
		(exclude_from_sim no)
		(in_bom yes)
		(on_board yes)
		(dnp no)
		(uuid "00000000-0000-0000-0000-00005f473c71")
		(property "Reference" "D9"
			(at 160.8328 94.2594 90)
			(effects
				(font
					(size 0.9906 0.9906)
				)
				(justify right)
			)
		)
		(property "Value" "IN-S126ATB"
			(at 160.8328 96.5708 90)
			(effects
				(font
					(size 0.9906 0.9906)
				)
				(justify right)
			)
		)
		(property "Footprint" "LED_SMD:LED_1206_3216Metric_Castellated"
			(at 163.83 95.25 0)
			(effects
				(font
					(size 1.27 1.27)
				)
				(hide yes)
			)
		)
		(property "Datasheet" "http://inolux-corp.com/datasheet/SMDLED/Mono%20Color%20Top%20View/IN-S126AT%20Series_V1.0.pdf"
			(at 163.83 95.25 0)
			(effects
				(font
					(size 1.27 1.27)
				)
				(hide yes)
			)
		)
		(property "Description" ""
			(at 163.83 95.25 0)
			(effects
				(font
					(size 1.27 1.27)
				)
				(hide yes)
			)
		)
		(property "Mfr" "IN-S126ATB "
			(at 163.83 95.25 0)
			(effects
				(font
					(size 1.27 1.27)
				)
				(hide yes)
			)
		)
		(pin "1"
			(uuid "b2de1057-44b4-4b1a-b3d7-c19d3cd25553")
		)
		(pin "2"
			(uuid "c3f6c24d-368b-47d2-9a0a-d716bb140344")
		)
		(instances
			(project ""
				(path "/8ca3e20d-bcc7-4c5e-9deb-562dfed9fecb/00000000-0000-0000-0000-00005f1207d0"
					(reference "D9")
					(unit 1)
				)
			)
		)
	)
	(symbol
		(lib_name "LED_5")
		(lib_id "Device:LED")
		(at 184.15 95.25 270)
		(mirror x)
		(unit 1)
		(exclude_from_sim no)
		(in_bom yes)
		(on_board yes)
		(dnp no)
		(uuid "00000000-0000-0000-0000-00005f473ca5")
		(property "Reference" "D11"
			(at 181.1528 94.2594 90)
			(effects
				(font
					(size 0.9906 0.9906)
				)
				(justify right)
			)
		)
		(property "Value" "IN-S126ATB"
			(at 181.1528 96.5708 90)
			(effects
				(font
					(size 0.9906 0.9906)
				)
				(justify right)
			)
		)
		(property "Footprint" "LED_SMD:LED_1206_3216Metric_Castellated"
			(at 184.15 95.25 0)
			(effects
				(font
					(size 1.27 1.27)
				)
				(hide yes)
			)
		)
		(property "Datasheet" "http://inolux-corp.com/datasheet/SMDLED/Mono%20Color%20Top%20View/IN-S126AT%20Series_V1.0.pdf"
			(at 184.15 95.25 0)
			(effects
				(font
					(size 1.27 1.27)
				)
				(hide yes)
			)
		)
		(property "Description" ""
			(at 184.15 95.25 0)
			(effects
				(font
					(size 1.27 1.27)
				)
				(hide yes)
			)
		)
		(property "Mfr" "IN-S126ATB "
			(at 184.15 95.25 0)
			(effects
				(font
					(size 1.27 1.27)
				)
				(hide yes)
			)
		)
		(pin "1"
			(uuid "b37c8835-0989-48c9-97ba-c045f0d7107f")
		)
		(pin "2"
			(uuid "65f89bc6-cda1-4481-b360-d7547150b31e")
		)
		(instances
			(project ""
				(path "/8ca3e20d-bcc7-4c5e-9deb-562dfed9fecb/00000000-0000-0000-0000-00005f1207d0"
					(reference "D11")
					(unit 1)
				)
			)
		)
	)
	(symbol
		(lib_name "LED_6")
		(lib_id "Device:LED")
		(at 204.47 95.25 270)
		(mirror x)
		(unit 1)
		(exclude_from_sim no)
		(in_bom yes)
		(on_board yes)
		(dnp no)
		(uuid "00000000-0000-0000-0000-00005f473cd9")
		(property "Reference" "D13"
			(at 201.4728 94.2594 90)
			(effects
				(font
					(size 0.9906 0.9906)
				)
				(justify right)
			)
		)
		(property "Value" "IN-S126ATB"
			(at 201.4728 96.5708 90)
			(effects
				(font
					(size 0.9906 0.9906)
				)
				(justify right)
			)
		)
		(property "Footprint" "LED_SMD:LED_1206_3216Metric_Castellated"
			(at 204.47 95.25 0)
			(effects
				(font
					(size 1.27 1.27)
				)
				(hide yes)
			)
		)
		(property "Datasheet" "http://inolux-corp.com/datasheet/SMDLED/Mono%20Color%20Top%20View/IN-S126AT%20Series_V1.0.pdf"
			(at 204.47 95.25 0)
			(effects
				(font
					(size 1.27 1.27)
				)
				(hide yes)
			)
		)
		(property "Description" ""
			(at 204.47 95.25 0)
			(effects
				(font
					(size 1.27 1.27)
				)
				(hide yes)
			)
		)
		(property "Mfr" "IN-S126ATB "
			(at 204.47 95.25 0)
			(effects
				(font
					(size 1.27 1.27)
				)
				(hide yes)
			)
		)
		(pin "1"
			(uuid "f16972fb-4b2b-49d7-8715-9f31f5431405")
		)
		(pin "2"
			(uuid "937928d4-4dfb-4f2f-91d0-697ec54ac283")
		)
		(instances
			(project ""
				(path "/8ca3e20d-bcc7-4c5e-9deb-562dfed9fecb/00000000-0000-0000-0000-00005f1207d0"
					(reference "D13")
					(unit 1)
				)
			)
		)
	)
)
