(footprint "WP-SMBU_Wuerth_7466204_M4" (version 20221018) (generator pcbnew)
  (layer "F.Cu")
  (descr "REDCUBE SMD with internal blind-hole thread with Pin WP-SMBU")
  (tags "wire-to-board, board-to-board, terminal")
  (attr through_hole)
  (fp_text reference "J**" (at 0.04064 -5.89788) (layer "F.SilkS")
      (effects (font (size 1.27 1.27) (thickness 0.254)))
    (tstamp 8433bf3b-8007-4647-bc5b-8ebad5e254e7)
  )
  (fp_text value "WP-SMBU" (at -0.04064 6.2484) (layer "F.SilkS") hide
      (effects (font (size 1.27 1.27) (thickness 0.254)))
    (tstamp 915e3d85-55f1-4a95-891d-289e0c440ac5)
  )
  (fp_text user "${REFERENCE}" (at 0.05334 -0.0635) (layer "F.Fab")
      (effects (font (size 1.27 1.27) (thickness 0.254)))
    (tstamp 3b4ed431-9abc-4149-a133-dafb3c2c1315)
  )
  (pad "1" smd circle (at 0 0) (size 8 8) (layers "F.Cu" "F.Mask") (tstamp b712296b-b94c-4110-b3f0-74841e0203c8))
  (model "${KIPRJMOD}/../../libs/3D/WP_SMBU_Wuerth_7466105.stp"
    (offset (xyz 0 0 -0.8))
    (scale (xyz 1 0.8 0.8))
    (rotate (xyz 0 90 0))
  )
)
