(kicad_sch (version 20211123) (generator eeschema)

  (uuid 0cab72dd-f919-4919-99d3-6bd5f512b70a)

  (paper "A4")

  (title_block
    (title "Power Supply")
    (date "2022-09-09")
    (rev "1.0")
    (company "Institute for Automation of Complex Power Systems - E.ON ERC - RWTH Aachen University")
    (comment 1 "Designer: D.Wienands, S.Melcher, L.Jeske, D.Moll, M.Nowak")
    (comment 2 "Supervisor: C. Guarnieri Calò Carducci, J.Klimt")
  )

  (lib_symbols
    (symbol "Device:C_Small" (pin_numbers hide) (pin_names (offset 0.254) hide) (in_bom yes) (on_board yes)
      (property "Reference" "C" (id 0) (at 0.254 1.778 0)
        (effects (font (size 1.27 1.27)) (justify left))
      )
      (property "Value" "C_Small" (id 1) (at 0.254 -2.032 0)
        (effects (font (size 1.27 1.27)) (justify left))
      )
      (property "Footprint" "" (id 2) (at 0 0 0)
        (effects (font (size 1.27 1.27)) hide)
      )
      (property "Datasheet" "~" (id 3) (at 0 0 0)
        (effects (font (size 1.27 1.27)) hide)
      )
      (property "ki_keywords" "capacitor cap" (id 4) (at 0 0 0)
        (effects (font (size 1.27 1.27)) hide)
      )
      (property "ki_description" "Unpolarized capacitor, small symbol" (id 5) (at 0 0 0)
        (effects (font (size 1.27 1.27)) hide)
      )
      (property "ki_fp_filters" "C_*" (id 6) (at 0 0 0)
        (effects (font (size 1.27 1.27)) hide)
      )
      (symbol "C_Small_0_1"
        (polyline
          (pts
            (xy -1.524 -0.508)
            (xy 1.524 -0.508)
          )
          (stroke (width 0.3302) (type default) (color 0 0 0 0))
          (fill (type none))
        )
        (polyline
          (pts
            (xy -1.524 0.508)
            (xy 1.524 0.508)
          )
          (stroke (width 0.3048) (type default) (color 0 0 0 0))
          (fill (type none))
        )
      )
      (symbol "C_Small_1_1"
        (pin passive line (at 0 2.54 270) (length 2.032)
          (name "~" (effects (font (size 1.27 1.27))))
          (number "1" (effects (font (size 1.27 1.27))))
        )
        (pin passive line (at 0 -2.54 90) (length 2.032)
          (name "~" (effects (font (size 1.27 1.27))))
          (number "2" (effects (font (size 1.27 1.27))))
        )
      )
    )
    (symbol "Regulator_Linear:NCP1117-3.3_SOT223" (pin_names (offset 0.254)) (in_bom yes) (on_board yes)
      (property "Reference" "U" (id 0) (at -3.81 3.175 0)
        (effects (font (size 1.27 1.27)))
      )
      (property "Value" "NCP1117-3.3_SOT223" (id 1) (at 0 3.175 0)
        (effects (font (size 1.27 1.27)) (justify left))
      )
      (property "Footprint" "Package_TO_SOT_SMD:SOT-223-3_TabPin2" (id 2) (at 0 5.08 0)
        (effects (font (size 1.27 1.27)) hide)
      )
      (property "Datasheet" "http://www.onsemi.com/pub_link/Collateral/NCP1117-D.PDF" (id 3) (at 2.54 -6.35 0)
        (effects (font (size 1.27 1.27)) hide)
      )
      (property "ki_keywords" "REGULATOR LDO 3.3V" (id 4) (at 0 0 0)
        (effects (font (size 1.27 1.27)) hide)
      )
      (property "ki_description" "1A Low drop-out regulator, Fixed Output 3.3V, SOT-223" (id 5) (at 0 0 0)
        (effects (font (size 1.27 1.27)) hide)
      )
      (property "ki_fp_filters" "SOT?223*TabPin2*" (id 6) (at 0 0 0)
        (effects (font (size 1.27 1.27)) hide)
      )
      (symbol "NCP1117-3.3_SOT223_0_1"
        (rectangle (start -5.08 -5.08) (end 5.08 1.905)
          (stroke (width 0.254) (type default) (color 0 0 0 0))
          (fill (type background))
        )
      )
      (symbol "NCP1117-3.3_SOT223_1_1"
        (pin power_in line (at 0 -7.62 90) (length 2.54)
          (name "GND" (effects (font (size 1.27 1.27))))
          (number "1" (effects (font (size 1.27 1.27))))
        )
        (pin power_out line (at 7.62 0 180) (length 2.54)
          (name "VO" (effects (font (size 1.27 1.27))))
          (number "2" (effects (font (size 1.27 1.27))))
        )
        (pin power_in line (at -7.62 0 0) (length 2.54)
          (name "VI" (effects (font (size 1.27 1.27))))
          (number "3" (effects (font (size 1.27 1.27))))
        )
      )
    )
    (symbol "power:GND" (power) (pin_names (offset 0)) (in_bom yes) (on_board yes)
      (property "Reference" "#PWR" (id 0) (at 0 -6.35 0)
        (effects (font (size 1.27 1.27)) hide)
      )
      (property "Value" "GND" (id 1) (at 0 -3.81 0)
        (effects (font (size 1.27 1.27)))
      )
      (property "Footprint" "" (id 2) (at 0 0 0)
        (effects (font (size 1.27 1.27)) hide)
      )
      (property "Datasheet" "" (id 3) (at 0 0 0)
        (effects (font (size 1.27 1.27)) hide)
      )
      (property "ki_keywords" "power-flag" (id 4) (at 0 0 0)
        (effects (font (size 1.27 1.27)) hide)
      )
      (property "ki_description" "Power symbol creates a global label with name \"GND\" , ground" (id 5) (at 0 0 0)
        (effects (font (size 1.27 1.27)) hide)
      )
      (symbol "GND_0_1"
        (polyline
          (pts
            (xy 0 0)
            (xy 0 -1.27)
            (xy 1.27 -1.27)
            (xy 0 -2.54)
            (xy -1.27 -1.27)
            (xy 0 -1.27)
          )
          (stroke (width 0) (type default) (color 0 0 0 0))
          (fill (type none))
        )
      )
      (symbol "GND_1_1"
        (pin power_in line (at 0 0 270) (length 0) hide
          (name "GND" (effects (font (size 1.27 1.27))))
          (number "1" (effects (font (size 1.27 1.27))))
        )
      )
    )
  )

  (junction (at 127 76.2) (diameter 0) (color 0 0 0 0)
    (uuid 1dd3c253-4bcc-4529-a09b-b0d48b8b48f4)
  )
  (junction (at 162.56 76.2) (diameter 0) (color 0 0 0 0)
    (uuid f95cbdd7-98e8-44ed-983a-4af73e262a06)
  )

  (wire (pts (xy 144.78 83.82) (xy 144.78 86.36))
    (stroke (width 0) (type default) (color 0 0 0 0))
    (uuid 1522dd26-72e7-407d-b352-1ae4f447fa50)
  )
  (wire (pts (xy 127 76.2) (xy 121.92 76.2))
    (stroke (width 0) (type default) (color 0 0 0 0))
    (uuid 249c6169-f770-491e-b19c-b7e3bdc39597)
  )
  (wire (pts (xy 127 83.82) (xy 127 86.36))
    (stroke (width 0) (type default) (color 0 0 0 0))
    (uuid 5460da15-a428-45fe-9f62-bfed5534a16d)
  )
  (wire (pts (xy 127 76.2) (xy 137.16 76.2))
    (stroke (width 0) (type default) (color 0 0 0 0))
    (uuid 5504cc4a-ea14-4621-929e-1a40bc8b0b5f)
  )
  (wire (pts (xy 162.56 76.2) (xy 162.56 78.74))
    (stroke (width 0) (type default) (color 0 0 0 0))
    (uuid 57382268-8971-4de8-b16b-6a2b866b7c45)
  )
  (wire (pts (xy 162.56 83.82) (xy 162.56 86.36))
    (stroke (width 0) (type default) (color 0 0 0 0))
    (uuid 5e36266f-ccc0-4c39-86fc-af77f13f6e40)
  )
  (wire (pts (xy 127 76.2) (xy 127 78.74))
    (stroke (width 0) (type default) (color 0 0 0 0))
    (uuid 6489bf15-17d7-4cb7-a689-bdff7b06c011)
  )
  (wire (pts (xy 152.4 76.2) (xy 162.56 76.2))
    (stroke (width 0) (type default) (color 0 0 0 0))
    (uuid c908af37-1948-48fb-912c-d47961d51ba4)
  )
  (wire (pts (xy 167.64 76.2) (xy 162.56 76.2))
    (stroke (width 0) (type default) (color 0 0 0 0))
    (uuid d1f378a7-a85d-4a93-9940-2023e36d1d2c)
  )

  (hierarchical_label "VOUT" (shape output) (at 167.64 76.2 0)
    (effects (font (size 1.27 1.27)) (justify left))
    (uuid 886ca74c-0cd4-4016-bd54-91d1d64b1db2)
  )
  (hierarchical_label "VIN" (shape input) (at 121.92 76.2 180)
    (effects (font (size 1.27 1.27)) (justify right))
    (uuid f08ebfc0-ee4a-4376-ad5d-a8a0c63ec864)
  )

  (symbol (lib_id "Device:C_Small") (at 162.56 81.28 0) (mirror x) (unit 1)
    (in_bom yes) (on_board yes)
    (uuid 00000000-0000-0000-0000-00005f48c62c)
    (property "Reference" "C5" (id 0) (at 161.29 80.01 0)
      (effects (font (size 0.9906 0.9906)) (justify right))
    )
    (property "Value" "4.7u" (id 1) (at 162.56 82.55 0)
      (effects (font (size 0.9906 0.9906)) (justify right))
    )
    (property "Footprint" "Capacitor_SMD:C_0603_1608Metric" (id 2) (at 162.56 81.28 0)
      (effects (font (size 1.27 1.27)) hide)
    )
    (property "Datasheet" "~" (id 3) (at 162.56 81.28 0)
      (effects (font (size 1.27 1.27)) hide)
    )
    (pin "1" (uuid 88537ea4-b082-4c3f-8b38-b54ea3fdfa26))
    (pin "2" (uuid abee5ac9-8a1e-4103-aa7a-859052a4ee8b))
  )

  (symbol (lib_id "power:GND") (at 162.56 86.36 0) (unit 1)
    (in_bom yes) (on_board yes)
    (uuid 00000000-0000-0000-0000-00005f48c632)
    (property "Reference" "#PWR035" (id 0) (at 162.56 92.71 0)
      (effects (font (size 1.27 1.27)) hide)
    )
    (property "Value" "GND" (id 1) (at 162.687 90.7542 0))
    (property "Footprint" "" (id 2) (at 162.56 86.36 0)
      (effects (font (size 1.27 1.27)) hide)
    )
    (property "Datasheet" "" (id 3) (at 162.56 86.36 0)
      (effects (font (size 1.27 1.27)) hide)
    )
    (pin "1" (uuid 57a1e575-9e03-4f9c-ad8b-0a04d6856456))
  )

  (symbol (lib_id "power:GND") (at 144.78 86.36 0) (mirror y) (unit 1)
    (in_bom yes) (on_board yes)
    (uuid 00000000-0000-0000-0000-00005f48c639)
    (property "Reference" "#PWR034" (id 0) (at 144.78 92.71 0)
      (effects (font (size 1.27 1.27)) hide)
    )
    (property "Value" "GND" (id 1) (at 144.653 90.7542 0))
    (property "Footprint" "" (id 2) (at 144.78 86.36 0)
      (effects (font (size 1.27 1.27)) hide)
    )
    (property "Datasheet" "" (id 3) (at 144.78 86.36 0)
      (effects (font (size 1.27 1.27)) hide)
    )
    (pin "1" (uuid 10bd05f1-07f3-4af9-946c-963b9f07c09c))
  )

  (symbol (lib_id "power:GND") (at 127 86.36 0) (mirror y) (unit 1)
    (in_bom yes) (on_board yes)
    (uuid 00000000-0000-0000-0000-00005f48c641)
    (property "Reference" "#PWR033" (id 0) (at 127 92.71 0)
      (effects (font (size 1.27 1.27)) hide)
    )
    (property "Value" "GND" (id 1) (at 126.873 90.7542 0))
    (property "Footprint" "" (id 2) (at 127 86.36 0)
      (effects (font (size 1.27 1.27)) hide)
    )
    (property "Datasheet" "" (id 3) (at 127 86.36 0)
      (effects (font (size 1.27 1.27)) hide)
    )
    (pin "1" (uuid decc9c8b-99ff-443f-82ef-0156bdf1d1a1))
  )

  (symbol (lib_id "Device:C_Small") (at 127 81.28 0) (mirror x) (unit 1)
    (in_bom yes) (on_board yes)
    (uuid 00000000-0000-0000-0000-00005f48c650)
    (property "Reference" "C4" (id 0) (at 125.73 80.01 0)
      (effects (font (size 0.9906 0.9906)) (justify right))
    )
    (property "Value" "4.7u" (id 1) (at 127 82.55 0)
      (effects (font (size 0.9906 0.9906)) (justify right))
    )
    (property "Footprint" "Capacitor_SMD:C_0603_1608Metric" (id 2) (at 127 81.28 0)
      (effects (font (size 1.27 1.27)) hide)
    )
    (property "Datasheet" "~" (id 3) (at 127 81.28 0)
      (effects (font (size 1.27 1.27)) hide)
    )
    (pin "1" (uuid c934120e-cd68-4985-bcbd-5cac505b86eb))
    (pin "2" (uuid 144e53e3-0002-449a-a81f-ea72fba8da8c))
  )

  (symbol (lib_id "Regulator_Linear:NCP1117-3.3_SOT223") (at 144.78 76.2 0) (unit 1)
    (in_bom yes) (on_board yes)
    (uuid 00000000-0000-0000-0000-00005f48c656)
    (property "Reference" "U2" (id 0) (at 144.78 67.5132 0))
    (property "Value" "AP2114HA" (id 1) (at 144.78 69.8246 0))
    (property "Footprint" "Package_TO_SOT_SMD:SOT-223-3_TabPin2" (id 2) (at 144.78 71.12 0)
      (effects (font (size 1.27 1.27)) hide)
    )
    (property "Datasheet" "http://www.onsemi.com/pub_link/Collateral/NCP1117-D.PDF" (id 3) (at 147.32 82.55 0)
      (effects (font (size 1.27 1.27)) hide)
    )
    (pin "1" (uuid 7520f8c0-9248-47d3-a134-a5d524cbc6ba))
    (pin "2" (uuid 69b92baf-a45b-4627-8450-2524c698d09d))
    (pin "3" (uuid 51a7b0ba-ac28-406e-bd9e-5f53cef14e6c))
  )
)
