(kicad_sch
	(version 20231120)
	(generator "eeschema")
	(generator_version "8.0")
	(uuid "eb8d02e9-145c-465d-b6a8-bae84d47a94b")
	(paper "A4")
	(title_block
		(title "Sub Mechanical")
		(date "2022-08-16")
		(rev "2.0")
		(company "Institute for Automation of Complex Power Systems - E.ON ERC - RWTH Aachen University")
		(comment 1 "Designer: D.Wienands, S.Melcher, L.Jeske, D.Moll, M.Nowak")
		(comment 2 "Supervisor: C. Guarnieri Calò Carducci, J.Klimt")
	)
	(lib_symbols
		(symbol "LEGOS:LEGOS"
			(exclude_from_sim no)
			(in_bom yes)
			(on_board yes)
			(property "Reference" "M"
				(at 0 0 0)
				(effects
					(font
						(size 1.27 1.27)
					)
					(hide yes)
				)
			)
			(property "Value" "LEGOS"
				(at 0 0 0)
				(effects
					(font
						(size 1.27 1.27)
					)
					(hide yes)
				)
			)
			(property "Footprint" "LEGOS:LEGOS"
				(at 0 0 0)
				(effects
					(font
						(size 1.27 1.27)
					)
					(hide yes)
				)
			)
			(property "Datasheet" ""
				(at 0 0 0)
				(effects
					(font
						(size 1.27 1.27)
					)
					(hide yes)
				)
			)
			(property "Description" ""
				(at 0 0 0)
				(effects
					(font
						(size 1.27 1.27)
					)
					(hide yes)
				)
			)
			(symbol "LEGOS_0_0"
				(text "LEGOS LOGO"
					(at 0 0 0)
					(effects
						(font
							(size 1.27 1.27)
						)
					)
				)
			)
		)
		(symbol "LEGOS:RWTH"
			(exclude_from_sim no)
			(in_bom yes)
			(on_board yes)
			(property "Reference" "M"
				(at 0 0 0)
				(effects
					(font
						(size 1.27 1.27)
					)
					(hide yes)
				)
			)
			(property "Value" "RWTH"
				(at 0 0 0)
				(effects
					(font
						(size 1.27 1.27)
					)
					(hide yes)
				)
			)
			(property "Footprint" "LEGOS:RWTH"
				(at 0 0 0)
				(effects
					(font
						(size 1.27 1.27)
					)
					(hide yes)
				)
			)
			(property "Datasheet" ""
				(at 0 0 0)
				(effects
					(font
						(size 1.27 1.27)
					)
					(hide yes)
				)
			)
			(property "Description" ""
				(at 0 0 0)
				(effects
					(font
						(size 1.27 1.27)
					)
					(hide yes)
				)
			)
			(symbol "RWTH_0_0"
				(text "RWTH LOGO"
					(at 0 0 0)
					(effects
						(font
							(size 1.27 1.27)
						)
					)
				)
			)
		)
		(symbol "Mechanical:MountingHole"
			(pin_names
				(offset 1.016)
			)
			(exclude_from_sim no)
			(in_bom yes)
			(on_board yes)
			(property "Reference" "H"
				(at 0 5.08 0)
				(effects
					(font
						(size 1.27 1.27)
					)
				)
			)
			(property "Value" "MountingHole"
				(at 0 3.175 0)
				(effects
					(font
						(size 1.27 1.27)
					)
				)
			)
			(property "Footprint" ""
				(at 0 0 0)
				(effects
					(font
						(size 1.27 1.27)
					)
					(hide yes)
				)
			)
			(property "Datasheet" "~"
				(at 0 0 0)
				(effects
					(font
						(size 1.27 1.27)
					)
					(hide yes)
				)
			)
			(property "Description" "Mounting Hole without connection"
				(at 0 0 0)
				(effects
					(font
						(size 1.27 1.27)
					)
					(hide yes)
				)
			)
			(property "ki_keywords" "mounting hole"
				(at 0 0 0)
				(effects
					(font
						(size 1.27 1.27)
					)
					(hide yes)
				)
			)
			(property "ki_fp_filters" "MountingHole*"
				(at 0 0 0)
				(effects
					(font
						(size 1.27 1.27)
					)
					(hide yes)
				)
			)
			(symbol "MountingHole_0_1"
				(circle
					(center 0 0)
					(radius 1.27)
					(stroke
						(width 1.27)
						(type default)
					)
					(fill
						(type none)
					)
				)
			)
		)
		(symbol "MountingHole_1"
			(pin_names
				(offset 1.016)
			)
			(exclude_from_sim no)
			(in_bom yes)
			(on_board yes)
			(property "Reference" "H"
				(at 0 5.08 0)
				(effects
					(font
						(size 1.27 1.27)
					)
				)
			)
			(property "Value" "MountingHole_1"
				(at 0 3.175 0)
				(effects
					(font
						(size 1.27 1.27)
					)
				)
			)
			(property "Footprint" ""
				(at 0 0 0)
				(effects
					(font
						(size 1.27 1.27)
					)
					(hide yes)
				)
			)
			(property "Datasheet" "~"
				(at 0 0 0)
				(effects
					(font
						(size 1.27 1.27)
					)
					(hide yes)
				)
			)
			(property "Description" "Mounting Hole without connection"
				(at 0 0 0)
				(effects
					(font
						(size 1.27 1.27)
					)
					(hide yes)
				)
			)
			(property "ki_keywords" "mounting hole"
				(at 0 0 0)
				(effects
					(font
						(size 1.27 1.27)
					)
					(hide yes)
				)
			)
			(property "ki_fp_filters" "MountingHole*"
				(at 0 0 0)
				(effects
					(font
						(size 1.27 1.27)
					)
					(hide yes)
				)
			)
			(symbol "MountingHole_1_0_1"
				(circle
					(center 0 0)
					(radius 1.27)
					(stroke
						(width 1.27)
						(type default)
					)
					(fill
						(type none)
					)
				)
			)
		)
		(symbol "MountingHole_2"
			(pin_names
				(offset 1.016)
			)
			(exclude_from_sim no)
			(in_bom yes)
			(on_board yes)
			(property "Reference" "H"
				(at 0 5.08 0)
				(effects
					(font
						(size 1.27 1.27)
					)
				)
			)
			(property "Value" "MountingHole_2"
				(at 0 3.175 0)
				(effects
					(font
						(size 1.27 1.27)
					)
				)
			)
			(property "Footprint" ""
				(at 0 0 0)
				(effects
					(font
						(size 1.27 1.27)
					)
					(hide yes)
				)
			)
			(property "Datasheet" "~"
				(at 0 0 0)
				(effects
					(font
						(size 1.27 1.27)
					)
					(hide yes)
				)
			)
			(property "Description" "Mounting Hole without connection"
				(at 0 0 0)
				(effects
					(font
						(size 1.27 1.27)
					)
					(hide yes)
				)
			)
			(property "ki_keywords" "mounting hole"
				(at 0 0 0)
				(effects
					(font
						(size 1.27 1.27)
					)
					(hide yes)
				)
			)
			(property "ki_fp_filters" "MountingHole*"
				(at 0 0 0)
				(effects
					(font
						(size 1.27 1.27)
					)
					(hide yes)
				)
			)
			(symbol "MountingHole_2_0_1"
				(circle
					(center 0 0)
					(radius 1.27)
					(stroke
						(width 1.27)
						(type default)
					)
					(fill
						(type none)
					)
				)
			)
		)
		(symbol "MountingHole_3"
			(pin_names
				(offset 1.016)
			)
			(exclude_from_sim no)
			(in_bom yes)
			(on_board yes)
			(property "Reference" "H"
				(at 0 5.08 0)
				(effects
					(font
						(size 1.27 1.27)
					)
				)
			)
			(property "Value" "MountingHole_3"
				(at 0 3.175 0)
				(effects
					(font
						(size 1.27 1.27)
					)
				)
			)
			(property "Footprint" ""
				(at 0 0 0)
				(effects
					(font
						(size 1.27 1.27)
					)
					(hide yes)
				)
			)
			(property "Datasheet" "~"
				(at 0 0 0)
				(effects
					(font
						(size 1.27 1.27)
					)
					(hide yes)
				)
			)
			(property "Description" "Mounting Hole without connection"
				(at 0 0 0)
				(effects
					(font
						(size 1.27 1.27)
					)
					(hide yes)
				)
			)
			(property "ki_keywords" "mounting hole"
				(at 0 0 0)
				(effects
					(font
						(size 1.27 1.27)
					)
					(hide yes)
				)
			)
			(property "ki_fp_filters" "MountingHole*"
				(at 0 0 0)
				(effects
					(font
						(size 1.27 1.27)
					)
					(hide yes)
				)
			)
			(symbol "MountingHole_3_0_1"
				(circle
					(center 0 0)
					(radius 1.27)
					(stroke
						(width 1.27)
						(type default)
					)
					(fill
						(type none)
					)
				)
			)
		)
	)
	(polyline
		(pts
			(xy 130.81 74.93) (xy 130.81 97.79)
		)
		(stroke
			(width 0)
			(type dash)
		)
		(uuid "126c4337-3801-4812-b60c-1b4e143fa80e")
	)
	(polyline
		(pts
			(xy 130.81 123.19) (xy 148.59 123.19)
		)
		(stroke
			(width 0)
			(type dash)
		)
		(uuid "1a3bc62b-7432-45d3-a374-5f5088eb9d97")
	)
	(polyline
		(pts
			(xy 130.81 110.49) (xy 130.81 123.19)
		)
		(stroke
			(width 0)
			(type dash)
		)
		(uuid "327e70f0-b741-4bf6-b330-daa747dce112")
	)
	(polyline
		(pts
			(xy 130.81 97.79) (xy 180.34 97.79)
		)
		(stroke
			(width 0)
			(type dash)
		)
		(uuid "33f154fb-680f-45e7-a691-9a4feb7ea725")
	)
	(polyline
		(pts
			(xy 148.59 123.19) (xy 148.59 110.49)
		)
		(stroke
			(width 0)
			(type dash)
		)
		(uuid "3ae75b15-e496-403f-9344-91fbdcac41d6")
	)
	(polyline
		(pts
			(xy 148.59 110.49) (xy 130.81 110.49)
		)
		(stroke
			(width 0)
			(type dash)
		)
		(uuid "514c4c1b-317d-4ac4-97bc-c98c8608e30a")
	)
	(polyline
		(pts
			(xy 180.34 97.79) (xy 180.34 74.93)
		)
		(stroke
			(width 0)
			(type dash)
		)
		(uuid "85115d32-577a-4a6a-81de-d30edca25636")
	)
	(polyline
		(pts
			(xy 180.34 74.93) (xy 130.81 74.93)
		)
		(stroke
			(width 0)
			(type dash)
		)
		(uuid "868e65b1-bf90-4fc3-bce2-0f6b1cdc0be1")
	)
	(symbol
		(lib_name "MountingHole_1")
		(lib_id "Mechanical:MountingHole")
		(at 135.89 80.01 0)
		(unit 1)
		(exclude_from_sim no)
		(in_bom yes)
		(on_board yes)
		(dnp no)
		(uuid "00000000-0000-0000-0000-00005f54e3ee")
		(property "Reference" "H2"
			(at 138.43 78.8416 0)
			(effects
				(font
					(size 1.27 1.27)
				)
				(justify left)
			)
		)
		(property "Value" "MountingHole"
			(at 138.43 81.153 0)
			(effects
				(font
					(size 1.27 1.27)
				)
				(justify left)
			)
		)
		(property "Footprint" "LEGOS:WA-SMSI_Wuerth_97730356332"
			(at 135.89 80.01 0)
			(effects
				(font
					(size 1.27 1.27)
				)
				(hide yes)
			)
		)
		(property "Datasheet" "https://www.we-online.de/katalog/en/SMSI_SMT_STEEL_SPACER_M1_6_INTERNAL_BOTTOM_CLOSED_W_PIN/"
			(at 135.89 80.01 0)
			(effects
				(font
					(size 1.27 1.27)
				)
				(hide yes)
			)
		)
		(property "Description" ""
			(at 135.89 80.01 0)
			(effects
				(font
					(size 1.27 1.27)
				)
				(hide yes)
			)
		)
		(property "Mfr" "97730356332R"
			(at 135.89 80.01 0)
			(effects
				(font
					(size 1.27 1.27)
				)
				(hide yes)
			)
		)
		(instances
			(project ""
				(path "/8ca3e20d-bcc7-4c5e-9deb-562dfed9fecb/00000000-0000-0000-0000-00005f5538a6"
					(reference "H2")
					(unit 1)
				)
			)
		)
	)
	(symbol
		(lib_name "MountingHole_2")
		(lib_id "Mechanical:MountingHole")
		(at 161.29 80.01 0)
		(unit 1)
		(exclude_from_sim no)
		(in_bom yes)
		(on_board yes)
		(dnp no)
		(uuid "00000000-0000-0000-0000-00005f54e664")
		(property "Reference" "H3"
			(at 163.83 78.8416 0)
			(effects
				(font
					(size 1.27 1.27)
				)
				(justify left)
			)
		)
		(property "Value" "MountingHole"
			(at 163.83 81.153 0)
			(effects
				(font
					(size 1.27 1.27)
				)
				(justify left)
			)
		)
		(property "Footprint" "LEGOS:WA-SMSI_Wuerth_97730356332"
			(at 161.29 80.01 0)
			(effects
				(font
					(size 1.27 1.27)
				)
				(hide yes)
			)
		)
		(property "Datasheet" "https://www.we-online.de/katalog/en/SMSI_SMT_STEEL_SPACER_M1_6_INTERNAL_BOTTOM_CLOSED_W_PIN/"
			(at 161.29 80.01 0)
			(effects
				(font
					(size 1.27 1.27)
				)
				(hide yes)
			)
		)
		(property "Description" ""
			(at 161.29 80.01 0)
			(effects
				(font
					(size 1.27 1.27)
				)
				(hide yes)
			)
		)
		(property "Mfr" "97730356332R"
			(at 161.29 80.01 0)
			(effects
				(font
					(size 1.27 1.27)
				)
				(hide yes)
			)
		)
		(instances
			(project ""
				(path "/8ca3e20d-bcc7-4c5e-9deb-562dfed9fecb/00000000-0000-0000-0000-00005f5538a6"
					(reference "H3")
					(unit 1)
				)
			)
		)
	)
	(symbol
		(lib_id "Mechanical:MountingHole")
		(at 161.29 92.71 0)
		(unit 1)
		(exclude_from_sim no)
		(in_bom yes)
		(on_board yes)
		(dnp no)
		(uuid "00000000-0000-0000-0000-00005f54fb8f")
		(property "Reference" "H4"
			(at 163.83 91.5416 0)
			(effects
				(font
					(size 1.27 1.27)
				)
				(justify left)
			)
		)
		(property "Value" "MountingHole"
			(at 163.83 93.853 0)
			(effects
				(font
					(size 1.27 1.27)
				)
				(justify left)
			)
		)
		(property "Footprint" "LEGOS:WA-SMSI_Wuerth_97730356332"
			(at 161.29 92.71 0)
			(effects
				(font
					(size 1.27 1.27)
				)
				(hide yes)
			)
		)
		(property "Datasheet" "https://www.we-online.de/katalog/en/SMSI_SMT_STEEL_SPACER_M1_6_INTERNAL_BOTTOM_CLOSED_W_PIN/"
			(at 161.29 92.71 0)
			(effects
				(font
					(size 1.27 1.27)
				)
				(hide yes)
			)
		)
		(property "Description" ""
			(at 161.29 92.71 0)
			(effects
				(font
					(size 1.27 1.27)
				)
				(hide yes)
			)
		)
		(property "Mfr" "97730356332R"
			(at 161.29 92.71 0)
			(effects
				(font
					(size 1.27 1.27)
				)
				(hide yes)
			)
		)
		(instances
			(project ""
				(path "/8ca3e20d-bcc7-4c5e-9deb-562dfed9fecb/00000000-0000-0000-0000-00005f5538a6"
					(reference "H4")
					(unit 1)
				)
			)
		)
	)
	(symbol
		(lib_name "MountingHole_3")
		(lib_id "Mechanical:MountingHole")
		(at 135.89 92.71 0)
		(unit 1)
		(exclude_from_sim no)
		(in_bom yes)
		(on_board yes)
		(dnp no)
		(uuid "00000000-0000-0000-0000-00005f54fb9b")
		(property "Reference" "H6"
			(at 138.43 91.5416 0)
			(effects
				(font
					(size 1.27 1.27)
				)
				(justify left)
			)
		)
		(property "Value" "MountingHole"
			(at 138.43 93.853 0)
			(effects
				(font
					(size 1.27 1.27)
				)
				(justify left)
			)
		)
		(property "Footprint" "LEGOS:WA-SMSI_Wuerth_97730356332"
			(at 135.89 92.71 0)
			(effects
				(font
					(size 1.27 1.27)
				)
				(hide yes)
			)
		)
		(property "Datasheet" "https://www.we-online.de/katalog/en/SMSI_SMT_STEEL_SPACER_M1_6_INTERNAL_BOTTOM_CLOSED_W_PIN/"
			(at 135.89 92.71 0)
			(effects
				(font
					(size 1.27 1.27)
				)
				(hide yes)
			)
		)
		(property "Description" ""
			(at 135.89 92.71 0)
			(effects
				(font
					(size 1.27 1.27)
				)
				(hide yes)
			)
		)
		(property "Mfr" "97730356332R"
			(at 135.89 92.71 0)
			(effects
				(font
					(size 1.27 1.27)
				)
				(hide yes)
			)
		)
		(instances
			(project ""
				(path "/8ca3e20d-bcc7-4c5e-9deb-562dfed9fecb/00000000-0000-0000-0000-00005f5538a6"
					(reference "H6")
					(unit 1)
				)
			)
		)
	)
	(symbol
		(lib_id "LEGOS:LEGOS")
		(at 139.7 119.38 0)
		(unit 1)
		(exclude_from_sim no)
		(in_bom yes)
		(on_board yes)
		(dnp no)
		(fields_autoplaced yes)
		(uuid "1accf12f-5acf-4a60-bf29-b25f93d69cc5")
		(property "Reference" "M2"
			(at 139.7 119.38 0)
			(effects
				(font
					(size 1.27 1.27)
				)
				(hide yes)
			)
		)
		(property "Value" "LEGOS"
			(at 139.7 119.38 0)
			(effects
				(font
					(size 1.27 1.27)
				)
				(hide yes)
			)
		)
		(property "Footprint" "LEGOS:LEGOS"
			(at 139.7 119.38 0)
			(effects
				(font
					(size 1.27 1.27)
				)
				(hide yes)
			)
		)
		(property "Datasheet" ""
			(at 139.7 119.38 0)
			(effects
				(font
					(size 1.27 1.27)
				)
				(hide yes)
			)
		)
		(property "Description" ""
			(at 139.7 119.38 0)
			(effects
				(font
					(size 1.27 1.27)
				)
				(hide yes)
			)
		)
		(instances
			(project ""
				(path "/8ca3e20d-bcc7-4c5e-9deb-562dfed9fecb/00000000-0000-0000-0000-00005f5538a6"
					(reference "M2")
					(unit 1)
				)
			)
		)
	)
	(symbol
		(lib_id "LEGOS:RWTH")
		(at 139.7 114.3 180)
		(unit 1)
		(exclude_from_sim no)
		(in_bom yes)
		(on_board yes)
		(dnp no)
		(fields_autoplaced yes)
		(uuid "f159b781-2c35-4965-8762-025e65c28ac9")
		(property "Reference" "M1"
			(at 139.7 114.3 0)
			(effects
				(font
					(size 1.27 1.27)
				)
				(hide yes)
			)
		)
		(property "Value" "RWTH"
			(at 139.7 114.3 0)
			(effects
				(font
					(size 1.27 1.27)
				)
				(hide yes)
			)
		)
		(property "Footprint" "LEGOS:RWTH"
			(at 139.7 114.3 0)
			(effects
				(font
					(size 1.27 1.27)
				)
				(hide yes)
			)
		)
		(property "Datasheet" ""
			(at 139.7 114.3 0)
			(effects
				(font
					(size 1.27 1.27)
				)
				(hide yes)
			)
		)
		(property "Description" ""
			(at 139.7 114.3 0)
			(effects
				(font
					(size 1.27 1.27)
				)
				(hide yes)
			)
		)
		(instances
			(project ""
				(path "/8ca3e20d-bcc7-4c5e-9deb-562dfed9fecb/00000000-0000-0000-0000-00005f5538a6"
					(reference "M1")
					(unit 1)
				)
			)
		)
	)
)
