(kicad_sch
	(version 20231120)
	(generator "eeschema")
	(generator_version "8.0")
	(uuid "43eb7b1b-0655-4d55-b0d3-d65ce4daa9ff")
	(paper "A4")
	(title_block
		(title "Assembly Line")
		(date "2020-08-10")
		(rev "1.0")
		(company "Institute for Automation of Complex Power Systems - E.ON ERC - RWTH Aachen University")
		(comment 1 "Designer: D.Wienands, S.Melcher, L.Jeske, D.Moll, M.Nowak")
		(comment 2 "Supervisor: C. Guarnieri Calò Carducci, J.Klimt")
	)
	(lib_symbols
		(symbol "Device:C_Polarized_Small"
			(pin_numbers hide)
			(pin_names
				(offset 0.254) hide)
			(exclude_from_sim no)
			(in_bom yes)
			(on_board yes)
			(property "Reference" "C"
				(at 0.254 1.778 0)
				(effects
					(font
						(size 1.27 1.27)
					)
					(justify left)
				)
			)
			(property "Value" "C_Polarized_Small"
				(at 0.254 -2.032 0)
				(effects
					(font
						(size 1.27 1.27)
					)
					(justify left)
				)
			)
			(property "Footprint" ""
				(at 0 0 0)
				(effects
					(font
						(size 1.27 1.27)
					)
					(hide yes)
				)
			)
			(property "Datasheet" "~"
				(at 0 0 0)
				(effects
					(font
						(size 1.27 1.27)
					)
					(hide yes)
				)
			)
			(property "Description" "Polarized capacitor, small symbol"
				(at 0 0 0)
				(effects
					(font
						(size 1.27 1.27)
					)
					(hide yes)
				)
			)
			(property "ki_keywords" "cap capacitor"
				(at 0 0 0)
				(effects
					(font
						(size 1.27 1.27)
					)
					(hide yes)
				)
			)
			(property "ki_fp_filters" "CP_*"
				(at 0 0 0)
				(effects
					(font
						(size 1.27 1.27)
					)
					(hide yes)
				)
			)
			(symbol "C_Polarized_Small_0_1"
				(rectangle
					(start -1.524 -0.3048)
					(end 1.524 -0.6858)
					(stroke
						(width 0)
						(type default)
					)
					(fill
						(type outline)
					)
				)
				(rectangle
					(start -1.524 0.6858)
					(end 1.524 0.3048)
					(stroke
						(width 0)
						(type default)
					)
					(fill
						(type none)
					)
				)
				(polyline
					(pts
						(xy -1.27 1.524) (xy -0.762 1.524)
					)
					(stroke
						(width 0)
						(type default)
					)
					(fill
						(type none)
					)
				)
				(polyline
					(pts
						(xy -1.016 1.27) (xy -1.016 1.778)
					)
					(stroke
						(width 0)
						(type default)
					)
					(fill
						(type none)
					)
				)
			)
			(symbol "C_Polarized_Small_1_1"
				(pin passive line
					(at 0 2.54 270)
					(length 1.8542)
					(name "~"
						(effects
							(font
								(size 1.27 1.27)
							)
						)
					)
					(number "1"
						(effects
							(font
								(size 1.27 1.27)
							)
						)
					)
				)
				(pin passive line
					(at 0 -2.54 90)
					(length 1.8542)
					(name "~"
						(effects
							(font
								(size 1.27 1.27)
							)
						)
					)
					(number "2"
						(effects
							(font
								(size 1.27 1.27)
							)
						)
					)
				)
			)
		)
		(symbol "Device:LED"
			(pin_numbers hide)
			(pin_names
				(offset 1.016) hide)
			(exclude_from_sim no)
			(in_bom yes)
			(on_board yes)
			(property "Reference" "D"
				(at 0 2.54 0)
				(effects
					(font
						(size 1.27 1.27)
					)
				)
			)
			(property "Value" "LED"
				(at 0 -2.54 0)
				(effects
					(font
						(size 1.27 1.27)
					)
				)
			)
			(property "Footprint" ""
				(at 0 0 0)
				(effects
					(font
						(size 1.27 1.27)
					)
					(hide yes)
				)
			)
			(property "Datasheet" "~"
				(at 0 0 0)
				(effects
					(font
						(size 1.27 1.27)
					)
					(hide yes)
				)
			)
			(property "Description" "Light emitting diode"
				(at 0 0 0)
				(effects
					(font
						(size 1.27 1.27)
					)
					(hide yes)
				)
			)
			(property "ki_keywords" "LED diode"
				(at 0 0 0)
				(effects
					(font
						(size 1.27 1.27)
					)
					(hide yes)
				)
			)
			(property "ki_fp_filters" "LED* LED_SMD:* LED_THT:*"
				(at 0 0 0)
				(effects
					(font
						(size 1.27 1.27)
					)
					(hide yes)
				)
			)
			(symbol "LED_0_1"
				(polyline
					(pts
						(xy -1.27 -1.27) (xy -1.27 1.27)
					)
					(stroke
						(width 0.254)
						(type default)
					)
					(fill
						(type none)
					)
				)
				(polyline
					(pts
						(xy -1.27 0) (xy 1.27 0)
					)
					(stroke
						(width 0)
						(type default)
					)
					(fill
						(type none)
					)
				)
				(polyline
					(pts
						(xy 1.27 -1.27) (xy 1.27 1.27) (xy -1.27 0) (xy 1.27 -1.27)
					)
					(stroke
						(width 0.254)
						(type default)
					)
					(fill
						(type none)
					)
				)
				(polyline
					(pts
						(xy -3.048 -0.762) (xy -4.572 -2.286) (xy -3.81 -2.286) (xy -4.572 -2.286) (xy -4.572 -1.524)
					)
					(stroke
						(width 0)
						(type default)
					)
					(fill
						(type none)
					)
				)
				(polyline
					(pts
						(xy -1.778 -0.762) (xy -3.302 -2.286) (xy -2.54 -2.286) (xy -3.302 -2.286) (xy -3.302 -1.524)
					)
					(stroke
						(width 0)
						(type default)
					)
					(fill
						(type none)
					)
				)
			)
			(symbol "LED_1_1"
				(pin passive line
					(at -3.81 0 0)
					(length 2.54)
					(name "K"
						(effects
							(font
								(size 1.27 1.27)
							)
						)
					)
					(number "1"
						(effects
							(font
								(size 1.27 1.27)
							)
						)
					)
				)
				(pin passive line
					(at 3.81 0 180)
					(length 2.54)
					(name "A"
						(effects
							(font
								(size 1.27 1.27)
							)
						)
					)
					(number "2"
						(effects
							(font
								(size 1.27 1.27)
							)
						)
					)
				)
			)
		)
		(symbol "Device:Q_NMOS_GSD"
			(pin_names
				(offset 0) hide)
			(exclude_from_sim no)
			(in_bom yes)
			(on_board yes)
			(property "Reference" "Q"
				(at 5.08 1.27 0)
				(effects
					(font
						(size 1.27 1.27)
					)
					(justify left)
				)
			)
			(property "Value" "Q_NMOS_GSD"
				(at 5.08 -1.27 0)
				(effects
					(font
						(size 1.27 1.27)
					)
					(justify left)
				)
			)
			(property "Footprint" ""
				(at 5.08 2.54 0)
				(effects
					(font
						(size 1.27 1.27)
					)
					(hide yes)
				)
			)
			(property "Datasheet" "~"
				(at 0 0 0)
				(effects
					(font
						(size 1.27 1.27)
					)
					(hide yes)
				)
			)
			(property "Description" "N-MOSFET transistor, gate/source/drain"
				(at 0 0 0)
				(effects
					(font
						(size 1.27 1.27)
					)
					(hide yes)
				)
			)
			(property "ki_keywords" "transistor NMOS N-MOS N-MOSFET"
				(at 0 0 0)
				(effects
					(font
						(size 1.27 1.27)
					)
					(hide yes)
				)
			)
			(symbol "Q_NMOS_GSD_0_1"
				(polyline
					(pts
						(xy 0.254 0) (xy -2.54 0)
					)
					(stroke
						(width 0)
						(type default)
					)
					(fill
						(type none)
					)
				)
				(polyline
					(pts
						(xy 0.254 1.905) (xy 0.254 -1.905)
					)
					(stroke
						(width 0.254)
						(type default)
					)
					(fill
						(type none)
					)
				)
				(polyline
					(pts
						(xy 0.762 -1.27) (xy 0.762 -2.286)
					)
					(stroke
						(width 0.254)
						(type default)
					)
					(fill
						(type none)
					)
				)
				(polyline
					(pts
						(xy 0.762 0.508) (xy 0.762 -0.508)
					)
					(stroke
						(width 0.254)
						(type default)
					)
					(fill
						(type none)
					)
				)
				(polyline
					(pts
						(xy 0.762 2.286) (xy 0.762 1.27)
					)
					(stroke
						(width 0.254)
						(type default)
					)
					(fill
						(type none)
					)
				)
				(polyline
					(pts
						(xy 2.54 2.54) (xy 2.54 1.778)
					)
					(stroke
						(width 0)
						(type default)
					)
					(fill
						(type none)
					)
				)
				(polyline
					(pts
						(xy 2.54 -2.54) (xy 2.54 0) (xy 0.762 0)
					)
					(stroke
						(width 0)
						(type default)
					)
					(fill
						(type none)
					)
				)
				(polyline
					(pts
						(xy 0.762 -1.778) (xy 3.302 -1.778) (xy 3.302 1.778) (xy 0.762 1.778)
					)
					(stroke
						(width 0)
						(type default)
					)
					(fill
						(type none)
					)
				)
				(polyline
					(pts
						(xy 1.016 0) (xy 2.032 0.381) (xy 2.032 -0.381) (xy 1.016 0)
					)
					(stroke
						(width 0)
						(type default)
					)
					(fill
						(type outline)
					)
				)
				(polyline
					(pts
						(xy 2.794 0.508) (xy 2.921 0.381) (xy 3.683 0.381) (xy 3.81 0.254)
					)
					(stroke
						(width 0)
						(type default)
					)
					(fill
						(type none)
					)
				)
				(polyline
					(pts
						(xy 3.302 0.381) (xy 2.921 -0.254) (xy 3.683 -0.254) (xy 3.302 0.381)
					)
					(stroke
						(width 0)
						(type default)
					)
					(fill
						(type none)
					)
				)
				(circle
					(center 1.651 0)
					(radius 2.794)
					(stroke
						(width 0.254)
						(type default)
					)
					(fill
						(type none)
					)
				)
				(circle
					(center 2.54 -1.778)
					(radius 0.254)
					(stroke
						(width 0)
						(type default)
					)
					(fill
						(type outline)
					)
				)
				(circle
					(center 2.54 1.778)
					(radius 0.254)
					(stroke
						(width 0)
						(type default)
					)
					(fill
						(type outline)
					)
				)
			)
			(symbol "Q_NMOS_GSD_1_1"
				(pin input line
					(at -5.08 0 0)
					(length 2.54)
					(name "G"
						(effects
							(font
								(size 1.27 1.27)
							)
						)
					)
					(number "1"
						(effects
							(font
								(size 1.27 1.27)
							)
						)
					)
				)
				(pin passive line
					(at 2.54 -5.08 90)
					(length 2.54)
					(name "S"
						(effects
							(font
								(size 1.27 1.27)
							)
						)
					)
					(number "2"
						(effects
							(font
								(size 1.27 1.27)
							)
						)
					)
				)
				(pin passive line
					(at 2.54 5.08 270)
					(length 2.54)
					(name "D"
						(effects
							(font
								(size 1.27 1.27)
							)
						)
					)
					(number "3"
						(effects
							(font
								(size 1.27 1.27)
							)
						)
					)
				)
			)
		)
		(symbol "Device:R_Small"
			(pin_numbers hide)
			(pin_names
				(offset 0.254) hide)
			(exclude_from_sim no)
			(in_bom yes)
			(on_board yes)
			(property "Reference" "R"
				(at 0.762 0.508 0)
				(effects
					(font
						(size 1.27 1.27)
					)
					(justify left)
				)
			)
			(property "Value" "R_Small"
				(at 0.762 -1.016 0)
				(effects
					(font
						(size 1.27 1.27)
					)
					(justify left)
				)
			)
			(property "Footprint" ""
				(at 0 0 0)
				(effects
					(font
						(size 1.27 1.27)
					)
					(hide yes)
				)
			)
			(property "Datasheet" "~"
				(at 0 0 0)
				(effects
					(font
						(size 1.27 1.27)
					)
					(hide yes)
				)
			)
			(property "Description" "Resistor, small symbol"
				(at 0 0 0)
				(effects
					(font
						(size 1.27 1.27)
					)
					(hide yes)
				)
			)
			(property "ki_keywords" "R resistor"
				(at 0 0 0)
				(effects
					(font
						(size 1.27 1.27)
					)
					(hide yes)
				)
			)
			(property "ki_fp_filters" "R_*"
				(at 0 0 0)
				(effects
					(font
						(size 1.27 1.27)
					)
					(hide yes)
				)
			)
			(symbol "R_Small_0_1"
				(rectangle
					(start -0.762 1.778)
					(end 0.762 -1.778)
					(stroke
						(width 0.2032)
						(type default)
					)
					(fill
						(type none)
					)
				)
			)
			(symbol "R_Small_1_1"
				(pin passive line
					(at 0 2.54 270)
					(length 0.762)
					(name "~"
						(effects
							(font
								(size 1.27 1.27)
							)
						)
					)
					(number "1"
						(effects
							(font
								(size 1.27 1.27)
							)
						)
					)
				)
				(pin passive line
					(at 0 -2.54 90)
					(length 0.762)
					(name "~"
						(effects
							(font
								(size 1.27 1.27)
							)
						)
					)
					(number "2"
						(effects
							(font
								(size 1.27 1.27)
							)
						)
					)
				)
			)
		)
		(symbol "Motor:Motor_Servo"
			(pin_names
				(offset 0.0254)
			)
			(exclude_from_sim no)
			(in_bom yes)
			(on_board yes)
			(property "Reference" "M"
				(at -5.08 4.445 0)
				(effects
					(font
						(size 1.27 1.27)
					)
					(justify left)
				)
			)
			(property "Value" "Motor_Servo"
				(at -5.08 -4.064 0)
				(effects
					(font
						(size 1.27 1.27)
					)
					(justify left top)
				)
			)
			(property "Footprint" ""
				(at 0 -4.826 0)
				(effects
					(font
						(size 1.27 1.27)
					)
					(hide yes)
				)
			)
			(property "Datasheet" "http://forums.parallax.com/uploads/attachments/46831/74481.png"
				(at 0 -4.826 0)
				(effects
					(font
						(size 1.27 1.27)
					)
					(hide yes)
				)
			)
			(property "Description" "Servo Motor (Futaba, HiTec, JR connector)"
				(at 0 0 0)
				(effects
					(font
						(size 1.27 1.27)
					)
					(hide yes)
				)
			)
			(property "ki_keywords" "Servo Motor"
				(at 0 0 0)
				(effects
					(font
						(size 1.27 1.27)
					)
					(hide yes)
				)
			)
			(property "ki_fp_filters" "PinHeader*P2.54mm*"
				(at 0 0 0)
				(effects
					(font
						(size 1.27 1.27)
					)
					(hide yes)
				)
			)
			(symbol "Motor_Servo_0_1"
				(polyline
					(pts
						(xy 2.413 -1.778) (xy 2.032 -1.778)
					)
					(stroke
						(width 0)
						(type default)
					)
					(fill
						(type none)
					)
				)
				(polyline
					(pts
						(xy 2.413 -1.778) (xy 2.286 -1.397)
					)
					(stroke
						(width 0)
						(type default)
					)
					(fill
						(type none)
					)
				)
				(polyline
					(pts
						(xy 2.413 1.778) (xy 1.905 1.778)
					)
					(stroke
						(width 0)
						(type default)
					)
					(fill
						(type none)
					)
				)
				(polyline
					(pts
						(xy 2.413 1.778) (xy 2.286 1.397)
					)
					(stroke
						(width 0)
						(type default)
					)
					(fill
						(type none)
					)
				)
				(polyline
					(pts
						(xy 6.35 4.445) (xy 2.54 1.27)
					)
					(stroke
						(width 0)
						(type default)
					)
					(fill
						(type none)
					)
				)
				(polyline
					(pts
						(xy 7.62 3.175) (xy 4.191 -1.016)
					)
					(stroke
						(width 0)
						(type default)
					)
					(fill
						(type none)
					)
				)
				(polyline
					(pts
						(xy 5.08 3.556) (xy -5.08 3.556) (xy -5.08 -3.556) (xy 6.35 -3.556) (xy 6.35 1.524)
					)
					(stroke
						(width 0.254)
						(type default)
					)
					(fill
						(type none)
					)
				)
				(arc
					(start 2.413 1.778)
					(mid 1.2406 0)
					(end 2.413 -1.778)
					(stroke
						(width 0)
						(type default)
					)
					(fill
						(type none)
					)
				)
				(circle
					(center 3.175 0)
					(radius 0.1778)
					(stroke
						(width 0)
						(type default)
					)
					(fill
						(type none)
					)
				)
				(circle
					(center 3.175 0)
					(radius 1.4224)
					(stroke
						(width 0)
						(type default)
					)
					(fill
						(type none)
					)
				)
				(circle
					(center 5.969 2.794)
					(radius 0.127)
					(stroke
						(width 0)
						(type default)
					)
					(fill
						(type none)
					)
				)
				(circle
					(center 6.477 3.302)
					(radius 0.127)
					(stroke
						(width 0)
						(type default)
					)
					(fill
						(type none)
					)
				)
				(circle
					(center 6.985 3.81)
					(radius 0.127)
					(stroke
						(width 0)
						(type default)
					)
					(fill
						(type none)
					)
				)
				(arc
					(start 7.62 3.175)
					(mid 7.4485 4.2735)
					(end 6.35 4.445)
					(stroke
						(width 0)
						(type default)
					)
					(fill
						(type none)
					)
				)
			)
			(symbol "Motor_Servo_1_1"
				(pin passive line
					(at -7.62 2.54 0)
					(length 2.54)
					(name "PWM"
						(effects
							(font
								(size 1.27 1.27)
							)
						)
					)
					(number "1"
						(effects
							(font
								(size 1.27 1.27)
							)
						)
					)
				)
				(pin passive line
					(at -7.62 0 0)
					(length 2.54)
					(name "+"
						(effects
							(font
								(size 1.27 1.27)
							)
						)
					)
					(number "2"
						(effects
							(font
								(size 1.27 1.27)
							)
						)
					)
				)
				(pin passive line
					(at -7.62 -2.54 0)
					(length 2.54)
					(name "-"
						(effects
							(font
								(size 1.27 1.27)
							)
						)
					)
					(number "3"
						(effects
							(font
								(size 1.27 1.27)
							)
						)
					)
				)
			)
		)
		(symbol "power:+3.3V"
			(power)
			(pin_names
				(offset 0)
			)
			(exclude_from_sim no)
			(in_bom yes)
			(on_board yes)
			(property "Reference" "#PWR"
				(at 0 -3.81 0)
				(effects
					(font
						(size 1.27 1.27)
					)
					(hide yes)
				)
			)
			(property "Value" "+3.3V"
				(at 0 3.556 0)
				(effects
					(font
						(size 1.27 1.27)
					)
				)
			)
			(property "Footprint" ""
				(at 0 0 0)
				(effects
					(font
						(size 1.27 1.27)
					)
					(hide yes)
				)
			)
			(property "Datasheet" ""
				(at 0 0 0)
				(effects
					(font
						(size 1.27 1.27)
					)
					(hide yes)
				)
			)
			(property "Description" "Power symbol creates a global label with name \"+3.3V\""
				(at 0 0 0)
				(effects
					(font
						(size 1.27 1.27)
					)
					(hide yes)
				)
			)
			(property "ki_keywords" "power-flag"
				(at 0 0 0)
				(effects
					(font
						(size 1.27 1.27)
					)
					(hide yes)
				)
			)
			(symbol "+3.3V_0_1"
				(polyline
					(pts
						(xy -0.762 1.27) (xy 0 2.54)
					)
					(stroke
						(width 0)
						(type default)
					)
					(fill
						(type none)
					)
				)
				(polyline
					(pts
						(xy 0 0) (xy 0 2.54)
					)
					(stroke
						(width 0)
						(type default)
					)
					(fill
						(type none)
					)
				)
				(polyline
					(pts
						(xy 0 2.54) (xy 0.762 1.27)
					)
					(stroke
						(width 0)
						(type default)
					)
					(fill
						(type none)
					)
				)
			)
			(symbol "+3.3V_1_1"
				(pin power_in line
					(at 0 0 90)
					(length 0) hide
					(name "+3V3"
						(effects
							(font
								(size 1.27 1.27)
							)
						)
					)
					(number "1"
						(effects
							(font
								(size 1.27 1.27)
							)
						)
					)
				)
			)
		)
		(symbol "power:+5V"
			(power)
			(pin_names
				(offset 0)
			)
			(exclude_from_sim no)
			(in_bom yes)
			(on_board yes)
			(property "Reference" "#PWR"
				(at 0 -3.81 0)
				(effects
					(font
						(size 1.27 1.27)
					)
					(hide yes)
				)
			)
			(property "Value" "+5V"
				(at 0 3.556 0)
				(effects
					(font
						(size 1.27 1.27)
					)
				)
			)
			(property "Footprint" ""
				(at 0 0 0)
				(effects
					(font
						(size 1.27 1.27)
					)
					(hide yes)
				)
			)
			(property "Datasheet" ""
				(at 0 0 0)
				(effects
					(font
						(size 1.27 1.27)
					)
					(hide yes)
				)
			)
			(property "Description" "Power symbol creates a global label with name \"+5V\""
				(at 0 0 0)
				(effects
					(font
						(size 1.27 1.27)
					)
					(hide yes)
				)
			)
			(property "ki_keywords" "power-flag"
				(at 0 0 0)
				(effects
					(font
						(size 1.27 1.27)
					)
					(hide yes)
				)
			)
			(symbol "+5V_0_1"
				(polyline
					(pts
						(xy -0.762 1.27) (xy 0 2.54)
					)
					(stroke
						(width 0)
						(type default)
					)
					(fill
						(type none)
					)
				)
				(polyline
					(pts
						(xy 0 0) (xy 0 2.54)
					)
					(stroke
						(width 0)
						(type default)
					)
					(fill
						(type none)
					)
				)
				(polyline
					(pts
						(xy 0 2.54) (xy 0.762 1.27)
					)
					(stroke
						(width 0)
						(type default)
					)
					(fill
						(type none)
					)
				)
			)
			(symbol "+5V_1_1"
				(pin power_in line
					(at 0 0 90)
					(length 0) hide
					(name "+5V"
						(effects
							(font
								(size 1.27 1.27)
							)
						)
					)
					(number "1"
						(effects
							(font
								(size 1.27 1.27)
							)
						)
					)
				)
			)
		)
		(symbol "power:GND"
			(power)
			(pin_names
				(offset 0)
			)
			(exclude_from_sim no)
			(in_bom yes)
			(on_board yes)
			(property "Reference" "#PWR"
				(at 0 -6.35 0)
				(effects
					(font
						(size 1.27 1.27)
					)
					(hide yes)
				)
			)
			(property "Value" "GND"
				(at 0 -3.81 0)
				(effects
					(font
						(size 1.27 1.27)
					)
				)
			)
			(property "Footprint" ""
				(at 0 0 0)
				(effects
					(font
						(size 1.27 1.27)
					)
					(hide yes)
				)
			)
			(property "Datasheet" ""
				(at 0 0 0)
				(effects
					(font
						(size 1.27 1.27)
					)
					(hide yes)
				)
			)
			(property "Description" "Power symbol creates a global label with name \"GND\" , ground"
				(at 0 0 0)
				(effects
					(font
						(size 1.27 1.27)
					)
					(hide yes)
				)
			)
			(property "ki_keywords" "power-flag"
				(at 0 0 0)
				(effects
					(font
						(size 1.27 1.27)
					)
					(hide yes)
				)
			)
			(symbol "GND_0_1"
				(polyline
					(pts
						(xy 0 0) (xy 0 -1.27) (xy 1.27 -1.27) (xy 0 -2.54) (xy -1.27 -1.27) (xy 0 -1.27)
					)
					(stroke
						(width 0)
						(type default)
					)
					(fill
						(type none)
					)
				)
			)
			(symbol "GND_1_1"
				(pin power_in line
					(at 0 0 270)
					(length 0) hide
					(name "GND"
						(effects
							(font
								(size 1.27 1.27)
							)
						)
					)
					(number "1"
						(effects
							(font
								(size 1.27 1.27)
							)
						)
					)
				)
			)
		)
	)
	(junction
		(at 71.12 101.6)
		(diameter 0)
		(color 0 0 0 0)
		(uuid "40fb2004-50c4-40b1-a783-823850f1d93e")
	)
	(junction
		(at 72.39 50.8)
		(diameter 0)
		(color 0 0 0 0)
		(uuid "48ad2d3b-23df-468b-8a04-c4812e6ce710")
	)
	(junction
		(at 58.42 127)
		(diameter 0)
		(color 0 0 0 0)
		(uuid "65f58814-95d7-40d7-a587-09d1cd5c468a")
	)
	(junction
		(at 90.17 60.96)
		(diameter 0)
		(color 0 0 0 0)
		(uuid "778c948f-0c89-4e95-8f0e-7ef5e51e3298")
	)
	(junction
		(at 96.52 127)
		(diameter 0)
		(color 0 0 0 0)
		(uuid "8348f7a5-6e88-4fdb-8185-7af86fbcaf80")
	)
	(junction
		(at 109.22 101.6)
		(diameter 0)
		(color 0 0 0 0)
		(uuid "b174a682-4cc5-44f3-b0ae-8edddcb7316a")
	)
	(junction
		(at 72.39 60.96)
		(diameter 0)
		(color 0 0 0 0)
		(uuid "fd5fb0a1-287b-4d7d-84c0-2cd2fe34a83f")
	)
	(wire
		(pts
			(xy 100.33 101.6) (xy 100.33 111.76)
		)
		(stroke
			(width 0)
			(type default)
		)
		(uuid "136ae2f4-385b-47a5-a963-03a99c39818a")
	)
	(wire
		(pts
			(xy 90.17 60.96) (xy 90.17 58.42)
		)
		(stroke
			(width 0)
			(type default)
		)
		(uuid "1c61bfad-dd69-434c-a4b4-8ad942263c91")
	)
	(wire
		(pts
			(xy 72.39 50.8) (xy 72.39 53.34)
		)
		(stroke
			(width 0)
			(type default)
		)
		(uuid "1f334823-7fc8-4270-aecc-0f1ff0d14ab2")
	)
	(wire
		(pts
			(xy 68.58 60.96) (xy 72.39 60.96)
		)
		(stroke
			(width 0)
			(type default)
		)
		(uuid "2091ac19-208c-4508-9529-f9325ad4efbd")
	)
	(wire
		(pts
			(xy 63.5 127) (xy 58.42 127)
		)
		(stroke
			(width 0)
			(type default)
		)
		(uuid "21c49c1c-6832-4e72-a039-3b069553653d")
	)
	(wire
		(pts
			(xy 109.22 132.08) (xy 109.22 134.62)
		)
		(stroke
			(width 0)
			(type default)
		)
		(uuid "26326bdd-b83a-4f69-9c6f-a839120b9c1b")
	)
	(wire
		(pts
			(xy 109.22 118.11) (xy 109.22 121.92)
		)
		(stroke
			(width 0)
			(type default)
		)
		(uuid "2cfd5b2e-5e8c-4a6f-ae65-7156904ff04a")
	)
	(wire
		(pts
			(xy 86.36 60.96) (xy 90.17 60.96)
		)
		(stroke
			(width 0)
			(type default)
		)
		(uuid "2ec39d8d-b8ff-4126-b217-27a254306094")
	)
	(wire
		(pts
			(xy 72.39 58.42) (xy 72.39 60.96)
		)
		(stroke
			(width 0)
			(type default)
		)
		(uuid "328458d6-aa40-48b4-9d43-7351a06c110a")
	)
	(wire
		(pts
			(xy 101.6 60.96) (xy 90.17 60.96)
		)
		(stroke
			(width 0)
			(type default)
		)
		(uuid "3b7795fe-7717-4be3-8cd7-db74d334b824")
	)
	(wire
		(pts
			(xy 109.22 99.695) (xy 109.22 101.6)
		)
		(stroke
			(width 0)
			(type default)
		)
		(uuid "4a581951-e4cb-4ee5-a5c3-92f69a570ac5")
	)
	(wire
		(pts
			(xy 101.6 63.5) (xy 97.79 63.5)
		)
		(stroke
			(width 0)
			(type default)
		)
		(uuid "4ce7599f-9664-45ec-9b38-ac92e8390a27")
	)
	(wire
		(pts
			(xy 109.22 107.95) (xy 109.22 110.49)
		)
		(stroke
			(width 0)
			(type default)
		)
		(uuid "4e879a93-c0e5-40b3-8446-e3055e695087")
	)
	(wire
		(pts
			(xy 71.12 101.6) (xy 62.23 101.6)
		)
		(stroke
			(width 0)
			(type default)
		)
		(uuid "51394878-eb30-4c3c-bfc9-f2bb5a138117")
	)
	(wire
		(pts
			(xy 71.12 99.695) (xy 71.12 101.6)
		)
		(stroke
			(width 0)
			(type default)
		)
		(uuid "547ddd8e-837c-45b2-8808-685d71be2c55")
	)
	(wire
		(pts
			(xy 58.42 127) (xy 58.42 129.54)
		)
		(stroke
			(width 0)
			(type default)
		)
		(uuid "5fe3ef84-7bb7-46a4-bedd-2a4133081bc6")
	)
	(wire
		(pts
			(xy 71.12 107.95) (xy 71.12 110.49)
		)
		(stroke
			(width 0)
			(type default)
		)
		(uuid "73251525-3e50-438a-ab98-dba33d4b3b72")
	)
	(wire
		(pts
			(xy 101.6 127) (xy 96.52 127)
		)
		(stroke
			(width 0)
			(type default)
		)
		(uuid "7e97169f-73eb-46c8-a74c-edce944825d2")
	)
	(wire
		(pts
			(xy 71.12 118.11) (xy 71.12 121.92)
		)
		(stroke
			(width 0)
			(type default)
		)
		(uuid "84ef047e-541f-45fd-9fb6-3b8f85f98ed8")
	)
	(wire
		(pts
			(xy 62.23 101.6) (xy 62.23 111.76)
		)
		(stroke
			(width 0)
			(type default)
		)
		(uuid "860aef81-b1e5-42b3-9b2c-674c055a49ac")
	)
	(wire
		(pts
			(xy 72.39 60.96) (xy 76.2 60.96)
		)
		(stroke
			(width 0)
			(type default)
		)
		(uuid "87c5df03-80bc-4619-8172-97ef68be8cc7")
	)
	(wire
		(pts
			(xy 55.88 127) (xy 58.42 127)
		)
		(stroke
			(width 0)
			(type default)
		)
		(uuid "8f622fe9-1b7f-4f98-9755-297e92d37bc3")
	)
	(wire
		(pts
			(xy 109.22 101.6) (xy 100.33 101.6)
		)
		(stroke
			(width 0)
			(type default)
		)
		(uuid "8ffcaf84-d0d4-44da-bc8b-670cffe6d8e3")
	)
	(wire
		(pts
			(xy 90.17 50.8) (xy 90.17 53.34)
		)
		(stroke
			(width 0)
			(type default)
		)
		(uuid "abab73f9-16f5-4d29-8510-581c75d51f56")
	)
	(wire
		(pts
			(xy 71.12 132.08) (xy 71.12 134.62)
		)
		(stroke
			(width 0)
			(type default)
		)
		(uuid "aff03b99-4f1b-4294-9457-b73fe892d16a")
	)
	(wire
		(pts
			(xy 81.28 50.8) (xy 81.28 53.34)
		)
		(stroke
			(width 0)
			(type default)
		)
		(uuid "b3663776-9f48-46c7-83e8-ffbfc3201537")
	)
	(wire
		(pts
			(xy 109.22 101.6) (xy 109.22 102.87)
		)
		(stroke
			(width 0)
			(type default)
		)
		(uuid "b57a164c-8c27-495a-af41-acba8fc44e29")
	)
	(wire
		(pts
			(xy 81.28 50.8) (xy 72.39 50.8)
		)
		(stroke
			(width 0)
			(type default)
		)
		(uuid "b879dbef-aec8-491d-960c-f63716ac8712")
	)
	(wire
		(pts
			(xy 93.98 127) (xy 96.52 127)
		)
		(stroke
			(width 0)
			(type default)
		)
		(uuid "c9b87130-afab-466d-8e3d-c7925de1ff71")
	)
	(wire
		(pts
			(xy 97.79 63.5) (xy 97.79 50.8)
		)
		(stroke
			(width 0)
			(type default)
		)
		(uuid "d1368a29-b1e3-4ecf-9ea1-417831a836df")
	)
	(wire
		(pts
			(xy 71.12 101.6) (xy 71.12 102.87)
		)
		(stroke
			(width 0)
			(type default)
		)
		(uuid "d503f7ca-c4fd-4dea-8955-60badf623f44")
	)
	(wire
		(pts
			(xy 96.52 127) (xy 96.52 129.54)
		)
		(stroke
			(width 0)
			(type default)
		)
		(uuid "fccc8594-c6a7-40ff-b04e-1cf19299d1c3")
	)
	(text "L128-RYL1003500000\nRoyal Blue 440nm-460nm\nIf 125 mA @ Vf = 3"
		(exclude_from_sim no)
		(at 74.93 121.92 0)
		(effects
			(font
				(size 0.9906 0.9906)
			)
			(justify left bottom)
		)
		(uuid "12659f6e-cf28-4412-8457-717cf3a1d14d")
	)
	(text "L128-5770003500000\nCold White 5700K\nIf 125 mA @ Vf = 2.85"
		(exclude_from_sim no)
		(at 113.03 121.92 0)
		(effects
			(font
				(size 0.9906 0.9906)
			)
			(justify left bottom)
		)
		(uuid "2ee2ca68-e7d8-4e81-b252-c26311069466")
	)
	(hierarchical_label "SPARK1"
		(shape input)
		(at 55.88 127 180)
		(fields_autoplaced yes)
		(effects
			(font
				(size 0.9906 0.9906)
			)
			(justify right)
		)
		(uuid "15eeef30-e984-4408-824b-7e9640b9d69e")
	)
	(hierarchical_label "SERVO"
		(shape input)
		(at 68.58 60.96 180)
		(fields_autoplaced yes)
		(effects
			(font
				(size 0.9906 0.9906)
			)
			(justify right)
		)
		(uuid "4379eed5-ffc9-47d6-9bf8-ea0fd51d54c8")
	)
	(hierarchical_label "SPARK2"
		(shape input)
		(at 93.98 127 180)
		(fields_autoplaced yes)
		(effects
			(font
				(size 0.9906 0.9906)
			)
			(justify right)
		)
		(uuid "8a61a083-e6a4-461a-a8de-d0d0273546aa")
	)
	(symbol
		(lib_id "Device:R_Small")
		(at 109.22 105.41 0)
		(mirror x)
		(unit 1)
		(exclude_from_sim no)
		(in_bom yes)
		(on_board yes)
		(dnp no)
		(uuid "00000000-0000-0000-0000-00005f406309")
		(property "Reference" "R22"
			(at 110.49 104.14 0)
			(effects
				(font
					(size 0.9906 0.9906)
				)
				(justify left)
			)
		)
		(property "Value" "3.6 - 1/4 W"
			(at 110.49 105.41 0)
			(effects
				(font
					(size 0.9906 0.9906)
				)
				(justify left)
			)
		)
		(property "Footprint" "Resistor_SMD:R_0805_2012Metric"
			(at 109.22 105.41 0)
			(effects
				(font
					(size 1.27 1.27)
				)
				(hide yes)
			)
		)
		(property "Datasheet" "https://eu.mouser.com/datasheet/2/219/RK73B-1825463.pdf"
			(at 109.22 105.41 0)
			(effects
				(font
					(size 1.27 1.27)
				)
				(hide yes)
			)
		)
		(property "Description" ""
			(at 109.22 105.41 0)
			(effects
				(font
					(size 1.27 1.27)
				)
				(hide yes)
			)
		)
		(property "Mfr" "RK73B2ATTD3R6J "
			(at 109.22 105.41 0)
			(effects
				(font
					(size 1.27 1.27)
				)
				(hide yes)
			)
		)
		(pin "1"
			(uuid "7d229171-dbc0-4c47-9f4c-cbc5f513f9dd")
		)
		(pin "2"
			(uuid "86530986-cdde-4b7a-8aa7-4115ff9313ae")
		)
		(instances
			(project ""
				(path "/d6d63c7c-d82d-4890-9f75-94cf42dec49c/00000000-0000-0000-0000-00005f0c6676"
					(reference "R22")
					(unit 1)
				)
			)
		)
	)
	(symbol
		(lib_id "Device:C_Polarized_Small")
		(at 100.33 114.3 0)
		(mirror y)
		(unit 1)
		(exclude_from_sim no)
		(in_bom yes)
		(on_board yes)
		(dnp no)
		(uuid "00000000-0000-0000-0000-00005f407107")
		(property "Reference" "C6"
			(at 102.5652 113.3348 0)
			(effects
				(font
					(size 0.9906 0.9906)
				)
				(justify right)
			)
		)
		(property "Value" "100u"
			(at 102.5652 115.2398 0)
			(effects
				(font
					(size 0.9906 0.9906)
				)
				(justify right)
			)
		)
		(property "Footprint" "Capacitor_Tantalum_SMD:CP_EIA-3216-18_Kemet-A"
			(at 100.33 114.3 0)
			(effects
				(font
					(size 1.27 1.27)
				)
				(hide yes)
			)
		)
		(property "Datasheet" "~"
			(at 100.33 114.3 0)
			(effects
				(font
					(size 1.27 1.27)
				)
				(hide yes)
			)
		)
		(property "Description" ""
			(at 100.33 114.3 0)
			(effects
				(font
					(size 1.27 1.27)
				)
				(hide yes)
			)
		)
		(property "Mfr" "TLJA107M004R0500 "
			(at 100.33 114.3 0)
			(effects
				(font
					(size 1.27 1.27)
				)
				(hide yes)
			)
		)
		(pin "1"
			(uuid "57d3a2d8-dc10-4e0e-96ef-f65adfdf540b")
		)
		(pin "2"
			(uuid "54972a84-a8cf-4a51-ab5a-d21df273d748")
		)
		(instances
			(project ""
				(path "/d6d63c7c-d82d-4890-9f75-94cf42dec49c/00000000-0000-0000-0000-00005f0c6676"
					(reference "C6")
					(unit 1)
				)
			)
		)
	)
	(symbol
		(lib_id "power:GND")
		(at 100.33 116.84 0)
		(unit 1)
		(exclude_from_sim no)
		(in_bom yes)
		(on_board yes)
		(dnp no)
		(uuid "00000000-0000-0000-0000-00005f4085f5")
		(property "Reference" "#PWR049"
			(at 100.33 123.19 0)
			(effects
				(font
					(size 1.27 1.27)
				)
				(hide yes)
			)
		)
		(property "Value" "GND"
			(at 100.457 121.2342 0)
			(effects
				(font
					(size 0.9906 0.9906)
				)
			)
		)
		(property "Footprint" ""
			(at 100.33 116.84 0)
			(effects
				(font
					(size 1.27 1.27)
				)
				(hide yes)
			)
		)
		(property "Datasheet" ""
			(at 100.33 116.84 0)
			(effects
				(font
					(size 1.27 1.27)
				)
				(hide yes)
			)
		)
		(property "Description" ""
			(at 100.33 116.84 0)
			(effects
				(font
					(size 1.27 1.27)
				)
				(hide yes)
			)
		)
		(pin "1"
			(uuid "4d1b1eac-9d2b-4b31-8fc0-5d0591a1fa79")
		)
		(instances
			(project ""
				(path "/d6d63c7c-d82d-4890-9f75-94cf42dec49c/00000000-0000-0000-0000-00005f0c6676"
					(reference "#PWR049")
					(unit 1)
				)
			)
		)
	)
	(symbol
		(lib_id "Device:C_Polarized_Small")
		(at 62.23 114.3 0)
		(mirror y)
		(unit 1)
		(exclude_from_sim no)
		(in_bom yes)
		(on_board yes)
		(dnp no)
		(uuid "00000000-0000-0000-0000-00005f40c92f")
		(property "Reference" "C5"
			(at 64.4652 113.3348 0)
			(effects
				(font
					(size 0.9906 0.9906)
				)
				(justify right)
			)
		)
		(property "Value" "100u"
			(at 64.4652 115.2398 0)
			(effects
				(font
					(size 0.9906 0.9906)
				)
				(justify right)
			)
		)
		(property "Footprint" "Capacitor_Tantalum_SMD:CP_EIA-3216-18_Kemet-A"
			(at 62.23 114.3 0)
			(effects
				(font
					(size 1.27 1.27)
				)
				(hide yes)
			)
		)
		(property "Datasheet" "~"
			(at 62.23 114.3 0)
			(effects
				(font
					(size 1.27 1.27)
				)
				(hide yes)
			)
		)
		(property "Description" ""
			(at 62.23 114.3 0)
			(effects
				(font
					(size 1.27 1.27)
				)
				(hide yes)
			)
		)
		(property "Mfr" "TLJA107M004R0500 "
			(at 62.23 114.3 0)
			(effects
				(font
					(size 1.27 1.27)
				)
				(hide yes)
			)
		)
		(pin "1"
			(uuid "bc84323c-17d1-4f64-953b-57f140b0fa2b")
		)
		(pin "2"
			(uuid "8852167f-2c67-4947-9f4d-b0946a8bc469")
		)
		(instances
			(project ""
				(path "/d6d63c7c-d82d-4890-9f75-94cf42dec49c/00000000-0000-0000-0000-00005f0c6676"
					(reference "C5")
					(unit 1)
				)
			)
		)
	)
	(symbol
		(lib_id "power:GND")
		(at 62.23 116.84 0)
		(unit 1)
		(exclude_from_sim no)
		(in_bom yes)
		(on_board yes)
		(dnp no)
		(uuid "00000000-0000-0000-0000-00005f40c935")
		(property "Reference" "#PWR048"
			(at 62.23 123.19 0)
			(effects
				(font
					(size 1.27 1.27)
				)
				(hide yes)
			)
		)
		(property "Value" "GND"
			(at 62.357 121.2342 0)
			(effects
				(font
					(size 0.9906 0.9906)
				)
			)
		)
		(property "Footprint" ""
			(at 62.23 116.84 0)
			(effects
				(font
					(size 1.27 1.27)
				)
				(hide yes)
			)
		)
		(property "Datasheet" ""
			(at 62.23 116.84 0)
			(effects
				(font
					(size 1.27 1.27)
				)
				(hide yes)
			)
		)
		(property "Description" ""
			(at 62.23 116.84 0)
			(effects
				(font
					(size 1.27 1.27)
				)
				(hide yes)
			)
		)
		(pin "1"
			(uuid "f392c196-ff4d-4108-8d34-92e24191638f")
		)
		(instances
			(project ""
				(path "/d6d63c7c-d82d-4890-9f75-94cf42dec49c/00000000-0000-0000-0000-00005f0c6676"
					(reference "#PWR048")
					(unit 1)
				)
			)
		)
	)
	(symbol
		(lib_id "Device:R_Small")
		(at 71.12 105.41 0)
		(mirror x)
		(unit 1)
		(exclude_from_sim no)
		(in_bom yes)
		(on_board yes)
		(dnp no)
		(uuid "00000000-0000-0000-0000-00005f40e567")
		(property "Reference" "R21"
			(at 72.39 104.14 0)
			(effects
				(font
					(size 0.9906 0.9906)
				)
				(justify left)
			)
		)
		(property "Value" "2.4 - 1/4 W"
			(at 72.39 105.41 0)
			(effects
				(font
					(size 0.9906 0.9906)
				)
				(justify left)
			)
		)
		(property "Footprint" "Resistor_SMD:R_0805_2012Metric"
			(at 71.12 105.41 0)
			(effects
				(font
					(size 1.27 1.27)
				)
				(hide yes)
			)
		)
		(property "Datasheet" "https://eu.mouser.com/datasheet/2/219/RK73B-1825463.pdf"
			(at 71.12 105.41 0)
			(effects
				(font
					(size 1.27 1.27)
				)
				(hide yes)
			)
		)
		(property "Description" ""
			(at 71.12 105.41 0)
			(effects
				(font
					(size 1.27 1.27)
				)
				(hide yes)
			)
		)
		(property "Mfr" "RK73B2ATTD2R4J "
			(at 71.12 105.41 0)
			(effects
				(font
					(size 1.27 1.27)
				)
				(hide yes)
			)
		)
		(pin "1"
			(uuid "f5212957-254c-46fb-a323-ae1dc0782c9e")
		)
		(pin "2"
			(uuid "d0dd92d4-fcea-4311-93db-c45b6bdda878")
		)
		(instances
			(project ""
				(path "/d6d63c7c-d82d-4890-9f75-94cf42dec49c/00000000-0000-0000-0000-00005f0c6676"
					(reference "R21")
					(unit 1)
				)
			)
		)
	)
	(symbol
		(lib_id "Motor:Motor_Servo")
		(at 109.22 63.5 0)
		(unit 1)
		(exclude_from_sim no)
		(in_bom yes)
		(on_board yes)
		(dnp no)
		(uuid "00000000-0000-0000-0000-00005f428139")
		(property "Reference" "M1"
			(at 117.6528 61.849 0)
			(effects
				(font
					(size 1.27 1.27)
				)
				(justify left)
			)
		)
		(property "Value" "SG51R"
			(at 117.6528 64.1604 0)
			(effects
				(font
					(size 1.27 1.27)
				)
				(justify left)
			)
		)
		(property "Footprint" "Connector_PinHeader_2.54mm:PinHeader_1x03_P2.54mm_Vertical_SMD_Pin1Right"
			(at 109.22 68.326 0)
			(effects
				(font
					(size 1.27 1.27)
				)
				(hide yes)
			)
		)
		(property "Datasheet" "https://www.adafruit.com/product/2201"
			(at 109.22 68.326 0)
			(effects
				(font
					(size 1.27 1.27)
				)
				(hide yes)
			)
		)
		(property "Description" ""
			(at 109.22 63.5 0)
			(effects
				(font
					(size 1.27 1.27)
				)
				(hide yes)
			)
		)
		(property "Mfr" "TSM-103-01-F-SV"
			(at 109.22 63.5 0)
			(effects
				(font
					(size 1.27 1.27)
				)
				(hide yes)
			)
		)
		(pin "1"
			(uuid "5981fadf-9c19-4fc6-acbe-f90a681426c8")
		)
		(pin "2"
			(uuid "9fb70866-732b-4df3-b91a-0a49abb76e50")
		)
		(pin "3"
			(uuid "a155c490-f6c5-4ed9-9682-92db95f3c855")
		)
		(instances
			(project ""
				(path "/d6d63c7c-d82d-4890-9f75-94cf42dec49c/00000000-0000-0000-0000-00005f0c6676"
					(reference "M1")
					(unit 1)
				)
			)
		)
	)
	(symbol
		(lib_id "power:GND")
		(at 101.6 66.04 0)
		(unit 1)
		(exclude_from_sim no)
		(in_bom yes)
		(on_board yes)
		(dnp no)
		(uuid "00000000-0000-0000-0000-00005f42813f")
		(property "Reference" "#PWR030"
			(at 101.6 72.39 0)
			(effects
				(font
					(size 1.27 1.27)
				)
				(hide yes)
			)
		)
		(property "Value" "GND"
			(at 101.727 70.4342 0)
			(effects
				(font
					(size 0.9906 0.9906)
				)
			)
		)
		(property "Footprint" ""
			(at 101.6 66.04 0)
			(effects
				(font
					(size 1.27 1.27)
				)
				(hide yes)
			)
		)
		(property "Datasheet" ""
			(at 101.6 66.04 0)
			(effects
				(font
					(size 1.27 1.27)
				)
				(hide yes)
			)
		)
		(property "Description" ""
			(at 101.6 66.04 0)
			(effects
				(font
					(size 1.27 1.27)
				)
				(hide yes)
			)
		)
		(pin "1"
			(uuid "5c0c47f6-44cf-46b2-9bb0-ff5b728477de")
		)
		(instances
			(project ""
				(path "/d6d63c7c-d82d-4890-9f75-94cf42dec49c/00000000-0000-0000-0000-00005f0c6676"
					(reference "#PWR030")
					(unit 1)
				)
			)
		)
	)
	(symbol
		(lib_id "Device:Q_NMOS_GSD")
		(at 81.28 58.42 270)
		(unit 1)
		(exclude_from_sim no)
		(in_bom yes)
		(on_board yes)
		(dnp no)
		(uuid "00000000-0000-0000-0000-00005f428145")
		(property "Reference" "Q2"
			(at 82.55 64.77 90)
			(effects
				(font
					(size 0.9906 0.9906)
				)
				(justify left)
			)
		)
		(property "Value" "Si2302CDS"
			(at 82.55 67.31 90)
			(effects
				(font
					(size 0.9906 0.9906)
				)
				(justify left)
			)
		)
		(property "Footprint" "Package_TO_SOT_SMD:SOT-23"
			(at 83.82 63.5 0)
			(effects
				(font
					(size 1.27 1.27)
				)
				(hide yes)
			)
		)
		(property "Datasheet" "https://eu.mouser.com/datasheet/2/427/si2302cds-1764899.pdf"
			(at 81.28 58.42 0)
			(effects
				(font
					(size 1.27 1.27)
				)
				(hide yes)
			)
		)
		(property "Description" ""
			(at 81.28 58.42 0)
			(effects
				(font
					(size 1.27 1.27)
				)
				(hide yes)
			)
		)
		(pin "1"
			(uuid "89c56318-aa04-4c00-80ca-69749a2b3bd8")
		)
		(pin "2"
			(uuid "2ec9ff68-af0d-4b3f-b49b-cd3b04603db0")
		)
		(pin "3"
			(uuid "49f3d2a7-15d3-497d-8a9f-d205ca7ba8b5")
		)
		(instances
			(project ""
				(path "/d6d63c7c-d82d-4890-9f75-94cf42dec49c/00000000-0000-0000-0000-00005f0c6676"
					(reference "Q2")
					(unit 1)
				)
			)
		)
	)
	(symbol
		(lib_id "Device:R_Small")
		(at 72.39 55.88 180)
		(unit 1)
		(exclude_from_sim no)
		(in_bom yes)
		(on_board yes)
		(dnp no)
		(uuid "00000000-0000-0000-0000-00005f42814b")
		(property "Reference" "R8"
			(at 71.12 54.61 0)
			(effects
				(font
					(size 0.9906 0.9906)
				)
				(justify left)
			)
		)
		(property "Value" "10k"
			(at 71.12 55.88 0)
			(effects
				(font
					(size 0.9906 0.9906)
				)
				(justify left)
			)
		)
		(property "Footprint" "Resistor_SMD:R_0603_1608Metric"
			(at 72.39 55.88 0)
			(effects
				(font
					(size 1.27 1.27)
				)
				(hide yes)
			)
		)
		(property "Datasheet" "~"
			(at 72.39 55.88 0)
			(effects
				(font
					(size 1.27 1.27)
				)
				(hide yes)
			)
		)
		(property "Description" ""
			(at 72.39 55.88 0)
			(effects
				(font
					(size 1.27 1.27)
				)
				(hide yes)
			)
		)
		(pin "1"
			(uuid "443747d2-0840-49ac-9bcb-7af952c63509")
		)
		(pin "2"
			(uuid "fbc37fb4-a144-4460-8d99-61143cd17b45")
		)
		(instances
			(project ""
				(path "/d6d63c7c-d82d-4890-9f75-94cf42dec49c/00000000-0000-0000-0000-00005f0c6676"
					(reference "R8")
					(unit 1)
				)
			)
		)
	)
	(symbol
		(lib_id "Device:R_Small")
		(at 90.17 55.88 180)
		(unit 1)
		(exclude_from_sim no)
		(in_bom yes)
		(on_board yes)
		(dnp no)
		(uuid "00000000-0000-0000-0000-00005f428151")
		(property "Reference" "R9"
			(at 88.9 54.61 0)
			(effects
				(font
					(size 0.9906 0.9906)
				)
				(justify left)
			)
		)
		(property "Value" "10k"
			(at 88.9 55.88 0)
			(effects
				(font
					(size 0.9906 0.9906)
				)
				(justify left)
			)
		)
		(property "Footprint" "Resistor_SMD:R_0603_1608Metric"
			(at 90.17 55.88 0)
			(effects
				(font
					(size 1.27 1.27)
				)
				(hide yes)
			)
		)
		(property "Datasheet" "~"
			(at 90.17 55.88 0)
			(effects
				(font
					(size 1.27 1.27)
				)
				(hide yes)
			)
		)
		(property "Description" ""
			(at 90.17 55.88 0)
			(effects
				(font
					(size 1.27 1.27)
				)
				(hide yes)
			)
		)
		(pin "1"
			(uuid "02d0451d-76b2-4e46-b600-92fe40d50f7f")
		)
		(pin "2"
			(uuid "742a5190-3cad-4776-a9c9-54938d7691b5")
		)
		(instances
			(project ""
				(path "/d6d63c7c-d82d-4890-9f75-94cf42dec49c/00000000-0000-0000-0000-00005f0c6676"
					(reference "R9")
					(unit 1)
				)
			)
		)
	)
	(symbol
		(lib_id "power:+5V")
		(at 90.17 50.8 0)
		(unit 1)
		(exclude_from_sim no)
		(in_bom yes)
		(on_board yes)
		(dnp no)
		(uuid "00000000-0000-0000-0000-00005f42815f")
		(property "Reference" "#PWR027"
			(at 90.17 54.61 0)
			(effects
				(font
					(size 1.27 1.27)
				)
				(hide yes)
			)
		)
		(property "Value" "+5V"
			(at 90.17 46.4058 0)
			(effects
				(font
					(size 0.9906 0.9906)
				)
			)
		)
		(property "Footprint" ""
			(at 90.17 50.8 0)
			(effects
				(font
					(size 1.27 1.27)
				)
				(hide yes)
			)
		)
		(property "Datasheet" ""
			(at 90.17 50.8 0)
			(effects
				(font
					(size 1.27 1.27)
				)
				(hide yes)
			)
		)
		(property "Description" ""
			(at 90.17 50.8 0)
			(effects
				(font
					(size 1.27 1.27)
				)
				(hide yes)
			)
		)
		(pin "1"
			(uuid "9d86bac7-1aed-4776-bd6e-dc4c1744578d")
		)
		(instances
			(project ""
				(path "/d6d63c7c-d82d-4890-9f75-94cf42dec49c/00000000-0000-0000-0000-00005f0c6676"
					(reference "#PWR027")
					(unit 1)
				)
			)
		)
	)
	(symbol
		(lib_id "power:+3.3V")
		(at 72.39 50.8 0)
		(unit 1)
		(exclude_from_sim no)
		(in_bom yes)
		(on_board yes)
		(dnp no)
		(uuid "00000000-0000-0000-0000-00005f428165")
		(property "Reference" "#PWR026"
			(at 72.39 54.61 0)
			(effects
				(font
					(size 1.27 1.27)
				)
				(hide yes)
			)
		)
		(property "Value" "+3V3"
			(at 72.771 46.4058 0)
			(effects
				(font
					(size 0.9906 0.9906)
				)
			)
		)
		(property "Footprint" ""
			(at 72.39 50.8 0)
			(effects
				(font
					(size 1.27 1.27)
				)
				(hide yes)
			)
		)
		(property "Datasheet" ""
			(at 72.39 50.8 0)
			(effects
				(font
					(size 1.27 1.27)
				)
				(hide yes)
			)
		)
		(property "Description" ""
			(at 72.39 50.8 0)
			(effects
				(font
					(size 1.27 1.27)
				)
				(hide yes)
			)
		)
		(pin "1"
			(uuid "46981bf4-b1e4-41b5-9b7b-81cec2f30461")
		)
		(instances
			(project ""
				(path "/d6d63c7c-d82d-4890-9f75-94cf42dec49c/00000000-0000-0000-0000-00005f0c6676"
					(reference "#PWR026")
					(unit 1)
				)
			)
		)
	)
	(symbol
		(lib_id "power:+5V")
		(at 97.79 50.8 0)
		(unit 1)
		(exclude_from_sim no)
		(in_bom yes)
		(on_board yes)
		(dnp no)
		(uuid "00000000-0000-0000-0000-00005f428170")
		(property "Reference" "#PWR029"
			(at 97.79 54.61 0)
			(effects
				(font
					(size 1.27 1.27)
				)
				(hide yes)
			)
		)
		(property "Value" "+5V"
			(at 97.79 46.4058 0)
			(effects
				(font
					(size 0.9906 0.9906)
				)
			)
		)
		(property "Footprint" ""
			(at 97.79 50.8 0)
			(effects
				(font
					(size 1.27 1.27)
				)
				(hide yes)
			)
		)
		(property "Datasheet" ""
			(at 97.79 50.8 0)
			(effects
				(font
					(size 1.27 1.27)
				)
				(hide yes)
			)
		)
		(property "Description" ""
			(at 97.79 50.8 0)
			(effects
				(font
					(size 1.27 1.27)
				)
				(hide yes)
			)
		)
		(pin "1"
			(uuid "99c73e29-666f-4069-b544-e952e02fe31c")
		)
		(instances
			(project ""
				(path "/d6d63c7c-d82d-4890-9f75-94cf42dec49c/00000000-0000-0000-0000-00005f0c6676"
					(reference "#PWR029")
					(unit 1)
				)
			)
		)
	)
	(symbol
		(lib_id "power:GND")
		(at 71.12 134.62 0)
		(unit 1)
		(exclude_from_sim no)
		(in_bom yes)
		(on_board yes)
		(dnp no)
		(uuid "00000000-0000-0000-0000-00005f42ecc8")
		(property "Reference" "#PWR025"
			(at 71.12 140.97 0)
			(effects
				(font
					(size 1.27 1.27)
				)
				(hide yes)
			)
		)
		(property "Value" "GND"
			(at 71.247 139.0142 0)
			(effects
				(font
					(size 0.9906 0.9906)
				)
			)
		)
		(property "Footprint" ""
			(at 71.12 134.62 0)
			(effects
				(font
					(size 1.27 1.27)
				)
				(hide yes)
			)
		)
		(property "Datasheet" ""
			(at 71.12 134.62 0)
			(effects
				(font
					(size 1.27 1.27)
				)
				(hide yes)
			)
		)
		(property "Description" ""
			(at 71.12 134.62 0)
			(effects
				(font
					(size 1.27 1.27)
				)
				(hide yes)
			)
		)
		(pin "1"
			(uuid "32e5a0f2-fae9-451b-b8ca-50bcab5b5355")
		)
		(instances
			(project ""
				(path "/d6d63c7c-d82d-4890-9f75-94cf42dec49c/00000000-0000-0000-0000-00005f0c6676"
					(reference "#PWR025")
					(unit 1)
				)
			)
		)
	)
	(symbol
		(lib_id "Device:Q_NMOS_GSD")
		(at 68.58 127 0)
		(unit 1)
		(exclude_from_sim no)
		(in_bom yes)
		(on_board yes)
		(dnp no)
		(uuid "00000000-0000-0000-0000-00005f42ecd4")
		(property "Reference" "Q1"
			(at 73.787 125.8316 0)
			(effects
				(font
					(size 0.9906 0.9906)
				)
				(justify left)
			)
		)
		(property "Value" "Si2302CDS"
			(at 73.787 128.143 0)
			(effects
				(font
					(size 0.9906 0.9906)
				)
				(justify left)
			)
		)
		(property "Footprint" "Package_TO_SOT_SMD:SOT-23"
			(at 73.66 124.46 0)
			(effects
				(font
					(size 1.27 1.27)
				)
				(hide yes)
			)
		)
		(property "Datasheet" "https://eu.mouser.com/datasheet/2/427/si2302cds-1764899.pdf"
			(at 68.58 127 0)
			(effects
				(font
					(size 1.27 1.27)
				)
				(hide yes)
			)
		)
		(property "Description" ""
			(at 68.58 127 0)
			(effects
				(font
					(size 1.27 1.27)
				)
				(hide yes)
			)
		)
		(pin "1"
			(uuid "4382c91a-8694-4f25-bf98-fcbac3c00de2")
		)
		(pin "2"
			(uuid "d800c682-6397-4bce-97bd-5ab0709fe7b2")
		)
		(pin "3"
			(uuid "4f9a761e-fdef-4562-a424-f8b5fdce67a2")
		)
		(instances
			(project ""
				(path "/d6d63c7c-d82d-4890-9f75-94cf42dec49c/00000000-0000-0000-0000-00005f0c6676"
					(reference "Q1")
					(unit 1)
				)
			)
		)
	)
	(symbol
		(lib_id "Device:R_Small")
		(at 58.42 132.08 0)
		(unit 1)
		(exclude_from_sim no)
		(in_bom yes)
		(on_board yes)
		(dnp no)
		(uuid "00000000-0000-0000-0000-00005f42ecda")
		(property "Reference" "R7"
			(at 59.9186 131.1148 0)
			(effects
				(font
					(size 0.9906 0.9906)
				)
				(justify left)
			)
		)
		(property "Value" "10k"
			(at 59.9186 133.0198 0)
			(effects
				(font
					(size 0.9906 0.9906)
				)
				(justify left)
			)
		)
		(property "Footprint" "Resistor_SMD:R_0603_1608Metric"
			(at 58.42 132.08 0)
			(effects
				(font
					(size 1.27 1.27)
				)
				(hide yes)
			)
		)
		(property "Datasheet" "~"
			(at 58.42 132.08 0)
			(effects
				(font
					(size 1.27 1.27)
				)
				(hide yes)
			)
		)
		(property "Description" ""
			(at 58.42 132.08 0)
			(effects
				(font
					(size 1.27 1.27)
				)
				(hide yes)
			)
		)
		(pin "1"
			(uuid "b6eabac1-0600-4990-a426-c4d3b34fe8f9")
		)
		(pin "2"
			(uuid "f057a591-c079-4dc3-8510-32e3871fabbd")
		)
		(instances
			(project ""
				(path "/d6d63c7c-d82d-4890-9f75-94cf42dec49c/00000000-0000-0000-0000-00005f0c6676"
					(reference "R7")
					(unit 1)
				)
			)
		)
	)
	(symbol
		(lib_id "power:GND")
		(at 58.42 134.62 0)
		(unit 1)
		(exclude_from_sim no)
		(in_bom yes)
		(on_board yes)
		(dnp no)
		(uuid "00000000-0000-0000-0000-00005f42ece0")
		(property "Reference" "#PWR023"
			(at 58.42 140.97 0)
			(effects
				(font
					(size 1.27 1.27)
				)
				(hide yes)
			)
		)
		(property "Value" "GND"
			(at 58.547 139.0142 0)
			(effects
				(font
					(size 0.9906 0.9906)
				)
			)
		)
		(property "Footprint" ""
			(at 58.42 134.62 0)
			(effects
				(font
					(size 1.27 1.27)
				)
				(hide yes)
			)
		)
		(property "Datasheet" ""
			(at 58.42 134.62 0)
			(effects
				(font
					(size 1.27 1.27)
				)
				(hide yes)
			)
		)
		(property "Description" ""
			(at 58.42 134.62 0)
			(effects
				(font
					(size 1.27 1.27)
				)
				(hide yes)
			)
		)
		(pin "1"
			(uuid "beb3c2fa-a6c2-42a1-b65f-b23ba120d8fe")
		)
		(instances
			(project ""
				(path "/d6d63c7c-d82d-4890-9f75-94cf42dec49c/00000000-0000-0000-0000-00005f0c6676"
					(reference "#PWR023")
					(unit 1)
				)
			)
		)
	)
	(symbol
		(lib_id "Device:LED")
		(at 71.12 114.3 90)
		(unit 1)
		(exclude_from_sim no)
		(in_bom yes)
		(on_board yes)
		(dnp no)
		(uuid "00000000-0000-0000-0000-00005f42ecec")
		(property "Reference" "D2"
			(at 74.1172 113.5126 90)
			(effects
				(font
					(size 0.9906 0.9906)
				)
				(justify right)
			)
		)
		(property "Value" "L128"
			(at 74.1172 115.4176 90)
			(effects
				(font
					(size 0.9906 0.9906)
				)
				(justify right)
			)
		)
		(property "Footprint" "LEGOS:LED_LUXEON_2835_Handsoldering"
			(at 71.12 114.3 0)
			(effects
				(font
					(size 1.27 1.27)
				)
				(hide yes)
			)
		)
		(property "Datasheet" "https://eu.mouser.com/datasheet/2/602/DS236-luxeon-2835-color-line-datasheet-1596094.pdf"
			(at 71.12 114.3 0)
			(effects
				(font
					(size 1.27 1.27)
				)
				(hide yes)
			)
		)
		(property "Description" ""
			(at 71.12 114.3 0)
			(effects
				(font
					(size 1.27 1.27)
				)
				(hide yes)
			)
		)
		(pin "1"
			(uuid "3a8c7869-e892-424a-adfa-5c2f9c8f80b4")
		)
		(pin "2"
			(uuid "99e7eb05-2e4b-471e-b92f-83ead552199d")
		)
		(instances
			(project ""
				(path "/d6d63c7c-d82d-4890-9f75-94cf42dec49c/00000000-0000-0000-0000-00005f0c6676"
					(reference "D2")
					(unit 1)
				)
			)
		)
	)
	(symbol
		(lib_id "power:GND")
		(at 109.22 134.62 0)
		(unit 1)
		(exclude_from_sim no)
		(in_bom yes)
		(on_board yes)
		(dnp no)
		(uuid "00000000-0000-0000-0000-00005f42ecfa")
		(property "Reference" "#PWR032"
			(at 109.22 140.97 0)
			(effects
				(font
					(size 1.27 1.27)
				)
				(hide yes)
			)
		)
		(property "Value" "GND"
			(at 109.347 139.0142 0)
			(effects
				(font
					(size 0.9906 0.9906)
				)
			)
		)
		(property "Footprint" ""
			(at 109.22 134.62 0)
			(effects
				(font
					(size 1.27 1.27)
				)
				(hide yes)
			)
		)
		(property "Datasheet" ""
			(at 109.22 134.62 0)
			(effects
				(font
					(size 1.27 1.27)
				)
				(hide yes)
			)
		)
		(property "Description" ""
			(at 109.22 134.62 0)
			(effects
				(font
					(size 1.27 1.27)
				)
				(hide yes)
			)
		)
		(pin "1"
			(uuid "031b22c3-aeef-45ec-960e-1b4e352fe8a8")
		)
		(instances
			(project ""
				(path "/d6d63c7c-d82d-4890-9f75-94cf42dec49c/00000000-0000-0000-0000-00005f0c6676"
					(reference "#PWR032")
					(unit 1)
				)
			)
		)
	)
	(symbol
		(lib_id "Device:R_Small")
		(at 96.52 132.08 0)
		(unit 1)
		(exclude_from_sim no)
		(in_bom yes)
		(on_board yes)
		(dnp no)
		(uuid "00000000-0000-0000-0000-00005f42ed06")
		(property "Reference" "R10"
			(at 98.0186 131.1148 0)
			(effects
				(font
					(size 0.9906 0.9906)
				)
				(justify left)
			)
		)
		(property "Value" "10k"
			(at 98.0186 133.0198 0)
			(effects
				(font
					(size 0.9906 0.9906)
				)
				(justify left)
			)
		)
		(property "Footprint" "Resistor_SMD:R_0603_1608Metric"
			(at 96.52 132.08 0)
			(effects
				(font
					(size 1.27 1.27)
				)
				(hide yes)
			)
		)
		(property "Datasheet" "~"
			(at 96.52 132.08 0)
			(effects
				(font
					(size 1.27 1.27)
				)
				(hide yes)
			)
		)
		(property "Description" ""
			(at 96.52 132.08 0)
			(effects
				(font
					(size 1.27 1.27)
				)
				(hide yes)
			)
		)
		(pin "1"
			(uuid "f7ad060b-8d05-49a0-b252-dedfde8fb497")
		)
		(pin "2"
			(uuid "dacfa030-63a2-4fd0-8c39-8f284b58370c")
		)
		(instances
			(project ""
				(path "/d6d63c7c-d82d-4890-9f75-94cf42dec49c/00000000-0000-0000-0000-00005f0c6676"
					(reference "R10")
					(unit 1)
				)
			)
		)
	)
	(symbol
		(lib_id "power:GND")
		(at 96.52 134.62 0)
		(unit 1)
		(exclude_from_sim no)
		(in_bom yes)
		(on_board yes)
		(dnp no)
		(uuid "00000000-0000-0000-0000-00005f42ed0c")
		(property "Reference" "#PWR028"
			(at 96.52 140.97 0)
			(effects
				(font
					(size 1.27 1.27)
				)
				(hide yes)
			)
		)
		(property "Value" "GND"
			(at 96.647 139.0142 0)
			(effects
				(font
					(size 0.9906 0.9906)
				)
			)
		)
		(property "Footprint" ""
			(at 96.52 134.62 0)
			(effects
				(font
					(size 1.27 1.27)
				)
				(hide yes)
			)
		)
		(property "Datasheet" ""
			(at 96.52 134.62 0)
			(effects
				(font
					(size 1.27 1.27)
				)
				(hide yes)
			)
		)
		(property "Description" ""
			(at 96.52 134.62 0)
			(effects
				(font
					(size 1.27 1.27)
				)
				(hide yes)
			)
		)
		(pin "1"
			(uuid "64eaf97d-187e-41cf-b8bc-99022201321b")
		)
		(instances
			(project ""
				(path "/d6d63c7c-d82d-4890-9f75-94cf42dec49c/00000000-0000-0000-0000-00005f0c6676"
					(reference "#PWR028")
					(unit 1)
				)
			)
		)
	)
	(symbol
		(lib_id "Device:LED")
		(at 109.22 114.3 90)
		(unit 1)
		(exclude_from_sim no)
		(in_bom yes)
		(on_board yes)
		(dnp no)
		(uuid "00000000-0000-0000-0000-00005f42ed18")
		(property "Reference" "D3"
			(at 112.2172 113.5126 90)
			(effects
				(font
					(size 0.9906 0.9906)
				)
				(justify right)
			)
		)
		(property "Value" "L128"
			(at 112.2172 115.4176 90)
			(effects
				(font
					(size 0.9906 0.9906)
				)
				(justify right)
			)
		)
		(property "Footprint" "LEGOS:LED_LUXEON_2835_Handsoldering"
			(at 109.22 114.3 0)
			(effects
				(font
					(size 1.27 1.27)
				)
				(hide yes)
			)
		)
		(property "Datasheet" "https://eu.mouser.com/datasheet/2/602/DS236-luxeon-2835-color-line-datasheet-1596094.pdf"
			(at 109.22 114.3 0)
			(effects
				(font
					(size 1.27 1.27)
				)
				(hide yes)
			)
		)
		(property "Description" ""
			(at 109.22 114.3 0)
			(effects
				(font
					(size 1.27 1.27)
				)
				(hide yes)
			)
		)
		(pin "1"
			(uuid "9d16cbba-6533-43a6-9521-5e1e284b2517")
		)
		(pin "2"
			(uuid "f2069228-915a-4bd7-b11b-5b031a5137d7")
		)
		(instances
			(project ""
				(path "/d6d63c7c-d82d-4890-9f75-94cf42dec49c/00000000-0000-0000-0000-00005f0c6676"
					(reference "D3")
					(unit 1)
				)
			)
		)
	)
	(symbol
		(lib_id "Device:Q_NMOS_GSD")
		(at 106.68 127 0)
		(unit 1)
		(exclude_from_sim no)
		(in_bom yes)
		(on_board yes)
		(dnp no)
		(uuid "00000000-0000-0000-0000-00005f42ed28")
		(property "Reference" "Q3"
			(at 111.887 125.8316 0)
			(effects
				(font
					(size 0.9906 0.9906)
				)
				(justify left)
			)
		)
		(property "Value" "Si2302CDS"
			(at 111.887 128.143 0)
			(effects
				(font
					(size 0.9906 0.9906)
				)
				(justify left)
			)
		)
		(property "Footprint" "Package_TO_SOT_SMD:SOT-23"
			(at 111.76 124.46 0)
			(effects
				(font
					(size 1.27 1.27)
				)
				(hide yes)
			)
		)
		(property "Datasheet" "https://eu.mouser.com/datasheet/2/427/si2302cds-1764899.pdf"
			(at 106.68 127 0)
			(effects
				(font
					(size 1.27 1.27)
				)
				(hide yes)
			)
		)
		(property "Description" ""
			(at 106.68 127 0)
			(effects
				(font
					(size 1.27 1.27)
				)
				(hide yes)
			)
		)
		(pin "1"
			(uuid "fd432458-c553-41ef-afeb-c486747029ca")
		)
		(pin "2"
			(uuid "2b3724c4-e629-46d7-9e35-edca13ccb1f2")
		)
		(pin "3"
			(uuid "dcbe551e-8708-4b1e-95a1-330f9ee83017")
		)
		(instances
			(project ""
				(path "/d6d63c7c-d82d-4890-9f75-94cf42dec49c/00000000-0000-0000-0000-00005f0c6676"
					(reference "Q3")
					(unit 1)
				)
			)
		)
	)
	(symbol
		(lib_id "power:+3.3V")
		(at 71.12 99.695 0)
		(unit 1)
		(exclude_from_sim no)
		(in_bom yes)
		(on_board yes)
		(dnp no)
		(uuid "00000000-0000-0000-0000-00005f435ebf")
		(property "Reference" "#PWR024"
			(at 71.12 103.505 0)
			(effects
				(font
					(size 1.27 1.27)
				)
				(hide yes)
			)
		)
		(property "Value" "+3V3"
			(at 71.501 95.3008 0)
			(effects
				(font
					(size 0.9906 0.9906)
				)
			)
		)
		(property "Footprint" ""
			(at 71.12 99.695 0)
			(effects
				(font
					(size 1.27 1.27)
				)
				(hide yes)
			)
		)
		(property "Datasheet" ""
			(at 71.12 99.695 0)
			(effects
				(font
					(size 1.27 1.27)
				)
				(hide yes)
			)
		)
		(property "Description" ""
			(at 71.12 99.695 0)
			(effects
				(font
					(size 1.27 1.27)
				)
				(hide yes)
			)
		)
		(pin "1"
			(uuid "af68e4a4-8c38-45a9-87db-255b253c773c")
		)
		(instances
			(project ""
				(path "/d6d63c7c-d82d-4890-9f75-94cf42dec49c/00000000-0000-0000-0000-00005f0c6676"
					(reference "#PWR024")
					(unit 1)
				)
			)
		)
	)
	(symbol
		(lib_id "power:+3.3V")
		(at 109.22 99.695 0)
		(unit 1)
		(exclude_from_sim no)
		(in_bom yes)
		(on_board yes)
		(dnp no)
		(uuid "00000000-0000-0000-0000-00005f436435")
		(property "Reference" "#PWR031"
			(at 109.22 103.505 0)
			(effects
				(font
					(size 1.27 1.27)
				)
				(hide yes)
			)
		)
		(property "Value" "+3V3"
			(at 109.601 95.3008 0)
			(effects
				(font
					(size 0.9906 0.9906)
				)
			)
		)
		(property "Footprint" ""
			(at 109.22 99.695 0)
			(effects
				(font
					(size 1.27 1.27)
				)
				(hide yes)
			)
		)
		(property "Datasheet" ""
			(at 109.22 99.695 0)
			(effects
				(font
					(size 1.27 1.27)
				)
				(hide yes)
			)
		)
		(property "Description" ""
			(at 109.22 99.695 0)
			(effects
				(font
					(size 1.27 1.27)
				)
				(hide yes)
			)
		)
		(pin "1"
			(uuid "eb796845-8aef-4017-a22b-7ef3bb49a8ee")
		)
		(instances
			(project ""
				(path "/d6d63c7c-d82d-4890-9f75-94cf42dec49c/00000000-0000-0000-0000-00005f0c6676"
					(reference "#PWR031")
					(unit 1)
				)
			)
		)
	)
)
