(module SOT-1220 (layer F.Cu) (tedit 5F0C8263)
  (solder_paste_margin -0.05)
  (attr smd)
  (fp_text reference REF** (at 0 1.9) (layer F.SilkS)
    (effects (font (size 1 1) (thickness 0.15)))
  )
  (fp_text value SOT-1220 (at 0 -0.5) (layer F.Fab)
    (effects (font (size 1 1) (thickness 0.15)))
  )
  (fp_line (start -1.25 -1.15) (end 1.25 -1.15) (layer F.CrtYd) (width 0.05))
  (fp_line (start 1.25 -1.15) (end 1.25 1.15) (layer F.CrtYd) (width 0.05))
  (fp_line (start 1.25 1.15) (end -1.25 1.15) (layer F.CrtYd) (width 0.05))
  (fp_line (start -1.25 1.15) (end -1.25 -1.15) (layer F.CrtYd) (width 0.05))
  (fp_line (start -1.05 -1.05) (end 1.05 -1.05) (layer F.SilkS) (width 0.12))
  (fp_line (start 1.05 -1.05) (end 1.05 1.05) (layer F.SilkS) (width 0.12))
  (fp_line (start 1.05 1.05) (end -1.05 1.05) (layer F.SilkS) (width 0.12))
  (fp_line (start -1.05 1.05) (end -1.05 -1.05) (layer F.SilkS) (width 0.12))
  (fp_line (start -0.8 -1.2) (end -1.2 -1.2) (layer F.SilkS) (width 0.12))
  (fp_line (start -1.2 -1.2) (end -1.2 -0.85) (layer F.SilkS) (width 0.12))
  (pad 1 smd rect (at -0.935 -0.65) (size 0.43 0.35) (layers F.Cu F.Paste F.Mask))
  (pad 7 smd rect (at 0 -0.285) (size 1.1 1.25) (layers F.Cu F.Paste F.Mask)
    (solder_paste_margin -0.1))
  (pad 8 smd rect (at 0 0.775) (size 0.66 0.35) (layers F.Cu F.Paste F.Mask))
  (pad 2 smd rect (at -0.935 0) (size 0.43 0.35) (layers F.Cu F.Paste F.Mask))
  (pad 3 smd rect (at -0.935 0.65) (size 0.43 0.35) (layers F.Cu F.Paste F.Mask))
  (pad 4 smd rect (at 0.935 0.65) (size 0.43 0.35) (layers F.Cu F.Paste F.Mask))
  (pad 5 smd rect (at 0.935 0) (size 0.43 0.35) (layers F.Cu F.Paste F.Mask))
  (pad 6 smd rect (at 0.935 -0.65) (size 0.43 0.35) (layers F.Cu F.Paste F.Mask))
  (model ${KISYS3DMOD}/Package_SON.3dshapes/USON-10_2.5x1.0mm_P0.5mm.wrl
    (at (xyz 0 0 0))
    (scale (xyz 2 0.8 1))
    (rotate (xyz 0 0 0))
  )
)
