(footprint "mouse-bite-3mm-slot" (version 20221018) (generator pcbnew)
  (layer "F.Cu")
  (attr through_hole)
  (fp_text reference "mouse-bite-3mm-slot" (at 0 -2.5) (layer "F.SilkS") hide
      (effects (font (size 1 1) (thickness 0.2)))
    (tstamp c16e1403-ace7-425f-8cd8-41a0ef0c1e87)
  )
  (fp_text value "VAL**" (at 0 2.5) (layer "F.SilkS") hide
      (effects (font (size 1 1) (thickness 0.2)))
    (tstamp f8def7f1-4942-48e6-a34e-798eaa901def)
  )
  (fp_circle (center -3 0) (end -3 -0.06)
    (stroke (width 0.05) (type solid)) (fill none) (layer "Dwgs.User") (tstamp ecf1e018-c727-45f9-afe0-40a3f9a13178))
  (fp_circle (center 3 0) (end 3.06 0)
    (stroke (width 0.05) (type solid)) (fill none) (layer "Dwgs.User") (tstamp 752f1a53-1637-486e-b4e3-e2de7c3a2050))
  (fp_line (start -3 0) (end -3 0)
    (stroke (width 3) (type solid)) (layer "Eco1.User") (tstamp 3b199339-3e22-4577-a743-17c1775f2761))
  (fp_line (start 3 0) (end 3 0)
    (stroke (width 3) (type solid)) (layer "Eco1.User") (tstamp 9d72befc-a458-4b27-8f71-a6087a1290b1))
  (fp_arc (start -3 -1.5) (mid -1.5 0) (end -3 1.5)
    (stroke (width 0.1) (type solid)) (layer "Edge.Cuts") (tstamp 55bbbb48-807a-4a2d-88ea-59f3ec540a24))
  (fp_arc (start 3 1.5) (mid 1.5 0) (end 3 -1.5)
    (stroke (width 0.1) (type solid)) (layer "Edge.Cuts") (tstamp 30e709f0-bf24-4861-9c1a-136d2d2e7ccb))
  (pad "" np_thru_hole circle (at -1.512 -1.5) (size 0.5 0.5) (drill 0.5) (layers "*.Cu" "*.Mask") (tstamp c222f664-6367-4960-9b10-8a2a299d8909))
  (pad "" np_thru_hole circle (at -1.512 1.5) (size 0.5 0.5) (drill 0.5) (layers "*.Cu" "*.Mask") (tstamp a96c5717-e705-42f3-b9e2-b79a5593f2f2))
  (pad "" np_thru_hole circle (at -0.762 1.5) (size 0.5 0.5) (drill 0.5) (layers "*.Cu" "*.Mask") (tstamp 3ddcc784-46ee-46ba-b64f-cf2df8cc4179))
  (pad "" np_thru_hole circle (at -0.75 -1.5) (size 0.5 0.5) (drill 0.5) (layers "*.Cu" "*.Mask") (tstamp cce188c7-df6d-4dde-969a-4e0b4ef49848))
  (pad "" np_thru_hole circle (at 0 -1.5) (size 0.5 0.5) (drill 0.5) (layers "*.Cu" "*.Mask") (tstamp 783e13de-37fb-4ca8-a0ea-b75f04efca8b))
  (pad "" np_thru_hole circle (at 0 1.5) (size 0.5 0.5) (drill 0.5) (layers "*.Cu" "*.Mask") (tstamp db3f389b-6cac-4d32-abe2-3bb794c961e1))
  (pad "" np_thru_hole circle (at 0.75 -1.5) (size 0.5 0.5) (drill 0.5) (layers "*.Cu" "*.Mask") (tstamp 5be0deea-d7b2-4bc5-961b-63b7b561c4fb))
  (pad "" np_thru_hole circle (at 0.75 1.5) (size 0.5 0.5) (drill 0.5) (layers "*.Cu" "*.Mask") (tstamp b7728b89-c384-47ee-9af7-c1390ce9ffcd))
  (pad "" np_thru_hole circle (at 1.524 -1.5) (size 0.5 0.5) (drill 0.5) (layers "*.Cu" "*.Mask") (tstamp e249e00f-e9b5-43cc-afdb-fa3c1c1d82d1))
  (pad "" np_thru_hole circle (at 1.524 1.5) (size 0.5 0.5) (drill 0.5) (layers "*.Cu" "*.Mask") (tstamp 685e28ea-776d-4f66-bf76-696fc555afb4))
)
