(module "drawing" (layer F.Cu)
(fp_text reference Ref** (at 0 0) (layer F.SilkS) hide
(effects (font (size 1.27 1.27) (thickness 0.15)))
)
(fp_text value Val** (at 0 0) (layer F.SilkS) hide
(effects (font (size 1.27 1.27) (thickness 0.15)))
)
  (fp_poly (pts (xy -0.390261 -1.763909) (xy -0.346360 -1.724685) (xy -0.288095 -1.667261) (xy -0.242359 -1.619565) (xy -0.093136 -1.460500) (xy 0.043391 -1.461076) (xy 0.179917 -1.461652) (xy 0.314226 -1.620612)
     (xy 0.388323 -1.703695) (xy 0.441877 -1.752812) (xy 0.476964 -1.769783) (xy 0.483559 -1.769084) (xy 0.517704 -1.759882) (xy 0.582844 -1.743142) (xy 0.668866 -1.721441) (xy 0.744234 -1.702660)
     (xy 0.969885 -1.646723) (xy 0.984829 -1.421320) (xy 0.993024 -1.315532) (xy 1.003221 -1.239014) (xy 1.018660 -1.178721) (xy 1.042581 -1.121607) (xy 1.074002 -1.062207) (xy 1.113253 -0.993289)
     (xy 1.141217 -0.954223) (xy 1.166905 -0.937709) (xy 1.199325 -0.936447) (xy 1.224990 -0.939862) (xy 1.287162 -0.946725) (xy 1.371674 -0.953146) (xy 1.446681 -0.957117) (xy 1.591612 -0.963008)
     (xy 1.694451 -0.719629) (xy 1.733863 -0.624636) (xy 1.766450 -0.542822) (xy 1.788967 -0.482569) (xy 1.798169 -0.452260) (xy 1.798229 -0.451526) (xy 1.782967 -0.428466) (xy 1.741231 -0.387010)
     (xy 1.680404 -0.334169) (xy 1.642206 -0.303359) (xy 1.572065 -0.244843) (xy 1.515248 -0.191172) (xy 1.480050 -0.150480) (xy 1.473161 -0.137584) (xy 1.466269 -0.092804) (xy 1.461813 -0.024393)
     (xy 1.460908 0.021166) (xy 1.460737 0.137583) (xy 1.620729 0.261106) (xy 1.691373 0.317702) (xy 1.748643 0.367434) (xy 1.784421 0.403058) (xy 1.791933 0.413846) (xy 1.789542 0.443187)
     (xy 1.775919 0.502545) (xy 1.754121 0.582091) (xy 1.727203 0.671991) (xy 1.698218 0.762415) (xy 1.670222 0.843531) (xy 1.646269 0.905506) (xy 1.629414 0.938509) (xy 1.628636 0.939419)
     (xy 1.602739 0.943812) (xy 1.545213 0.943054) (xy 1.466324 0.938068) (xy 1.376337 0.929776) (xy 1.285519 0.919099) (xy 1.204137 0.906959) (xy 1.151886 0.896615) (xy 1.121434 0.898850)
     (xy 1.086352 0.923819) (xy 1.039535 0.977300) (xy 1.017455 1.005950) (xy 0.927054 1.125685) (xy 0.954458 1.340717) (xy 0.965629 1.431134) (xy 0.974041 1.504577) (xy 0.978672 1.551796)
     (xy 0.979116 1.564305) (xy 0.959311 1.576043) (xy 0.908942 1.599270) (xy 0.836974 1.630332) (xy 0.752374 1.665574) (xy 0.664111 1.701343) (xy 0.581150 1.733986) (xy 0.512460 1.759847)
     (xy 0.467006 1.775272) (xy 0.454693 1.778000) (xy 0.426220 1.763342) (xy 0.382973 1.725966) (xy 0.356697 1.698625) (xy 0.298488 1.631317) (xy 0.240091 1.559694) (xy 0.224722 1.539875)
     (xy 0.188388 1.495601) (xy 0.155586 1.471872) (xy 0.111209 1.462301) (xy 0.040152 1.460500) (xy -0.090332 1.460500) (xy -0.246313 1.608666) (xy -0.315618 1.671222) (xy -0.377078 1.720773)
     (xy -0.422380 1.750925) (xy -0.439272 1.757092) (xy -0.473325 1.750523) (xy -0.537598 1.732501) (xy -0.622471 1.705885) (xy -0.706293 1.677717) (xy -0.936336 1.598083) (xy -0.915022 1.169943)
     (xy -0.998908 1.071804) (xy -1.082794 0.973666) (xy -1.580551 0.973666) (xy -1.689859 0.721678) (xy -1.731148 0.623408) (xy -1.765295 0.536259) (xy -1.789019 0.469037) (xy -1.799041 0.430547)
     (xy -1.799166 0.428263) (xy -1.781349 0.392317) (xy -1.729772 0.337977) (xy -1.647247 0.268168) (xy -1.639656 0.262209) (xy -1.567559 0.201858) (xy -1.509737 0.145859) (xy -1.474310 0.102411)
     (xy -1.467651 0.088457) (xy -1.462754 0.037504) (xy -1.463340 0.021166) (xy -0.813972 0.021166) (xy -0.806684 0.164740) (xy -0.782781 0.280574) (xy -0.737350 0.381611) (xy -0.665477 0.480795)
     (xy -0.620317 0.531359) (xy -0.502170 0.639690) (xy -0.378102 0.714428) (xy -0.239372 0.758976) (xy -0.077236 0.776733) (xy 0.010584 0.776764) (xy 0.119220 0.771941) (xy 0.199650 0.762640)
     (xy 0.265960 0.746237) (xy 0.332235 0.720108) (xy 0.344345 0.714587) (xy 0.428501 0.666241) (xy 0.518438 0.599898) (xy 0.578478 0.546035) (xy 0.695738 0.402185) (xy 0.774438 0.247698)
     (xy 0.815424 0.087411) (xy 0.819539 -0.073836) (xy 0.787628 -0.231205) (xy 0.720533 -0.379857) (xy 0.619100 -0.514953) (xy 0.484173 -0.631655) (xy 0.360279 -0.704806) (xy 0.292981 -0.736392)
     (xy 0.236992 -0.756291) (xy 0.178584 -0.767163) (xy 0.104032 -0.771665) (xy 0.011029 -0.772470) (xy -0.093147 -0.771006) (xy -0.168619 -0.765191) (xy -0.228971 -0.752697) (xy -0.287783 -0.731197)
     (xy -0.323452 -0.715131) (xy -0.439212 -0.646174) (xy -0.555077 -0.551537) (xy -0.658878 -0.442926) (xy -0.738448 -0.332046) (xy -0.756596 -0.298426) (xy -0.784838 -0.235753) (xy -0.802124 -0.179259)
     (xy -0.810974 -0.114901) (xy -0.813909 -0.028642) (xy -0.813972 0.021166) (xy -1.463340 0.021166) (xy -1.465259 -0.032313) (xy -1.468220 -0.059710) (xy -1.474333 -0.100543) (xy -1.483707 -0.133601)
     (xy -1.501445 -0.165330) (xy -1.532649 -0.202178) (xy -1.582419 -0.250592) (xy -1.655857 -0.317017) (xy -1.709825 -0.365021) (xy -1.799056 -0.444291) (xy -1.690377 -0.724854) (xy -1.650967 -0.825901)
     (xy -1.616880 -0.911998) (xy -1.591046 -0.975840) (xy -1.576397 -1.010124) (xy -1.574416 -1.013836) (xy -1.551742 -1.014940) (xy -1.496047 -1.011383) (xy -1.416302 -1.003868) (xy -1.342591 -0.995643)
     (xy -1.118047 -0.969032) (xy -1.044120 -1.040141) (xy -0.994830 -1.091628) (xy -0.956812 -1.138479) (xy -0.947461 -1.153069) (xy -0.935869 -1.198304) (xy -0.929953 -1.272199) (xy -0.929849 -1.361444)
     (xy -0.935690 -1.452730) (xy -0.943855 -1.513417) (xy -0.955021 -1.576917) (xy -0.694469 -1.677510) (xy -0.595967 -1.714968) (xy -0.511181 -1.746139) (xy -0.448170 -1.768137) (xy -0.414993 -1.778078)
     (xy -0.412750 -1.778365) (xy -0.390261 -1.763909) )(layer F.SilkS) (width  0.010000)
  )
)