(kicad_sch
	(version 20231120)
	(generator "eeschema")
	(generator_version "8.0")
	(uuid "2decc4ec-b62e-418a-ab5d-5fc9da62a42f")
	(paper "A4")
	(title_block
		(title "Hospital")
		(date "2022-08-16")
		(rev "2.0")
		(company "Institute for Automation of Complex Power Systems - E.ON ERC - RWTH Aachen University")
		(comment 1 "Designer: D.Wienands, S.Melcher, L.Jeske, D.Moll, M.Nowak")
		(comment 2 "Supervisor: C. Guarnieri Calò Carducci, J.Klimt")
	)
	(lib_symbols
		(symbol "Connector:TestPoint"
			(pin_numbers hide)
			(pin_names
				(offset 0.762) hide)
			(exclude_from_sim no)
			(in_bom yes)
			(on_board yes)
			(property "Reference" "TP"
				(at 0 6.858 0)
				(effects
					(font
						(size 1.27 1.27)
					)
				)
			)
			(property "Value" "TestPoint"
				(at 0 5.08 0)
				(effects
					(font
						(size 1.27 1.27)
					)
				)
			)
			(property "Footprint" ""
				(at 5.08 0 0)
				(effects
					(font
						(size 1.27 1.27)
					)
					(hide yes)
				)
			)
			(property "Datasheet" "~"
				(at 5.08 0 0)
				(effects
					(font
						(size 1.27 1.27)
					)
					(hide yes)
				)
			)
			(property "Description" "test point"
				(at 0 0 0)
				(effects
					(font
						(size 1.27 1.27)
					)
					(hide yes)
				)
			)
			(property "ki_keywords" "test point tp"
				(at 0 0 0)
				(effects
					(font
						(size 1.27 1.27)
					)
					(hide yes)
				)
			)
			(property "ki_fp_filters" "Pin* Test*"
				(at 0 0 0)
				(effects
					(font
						(size 1.27 1.27)
					)
					(hide yes)
				)
			)
			(symbol "TestPoint_0_1"
				(circle
					(center 0 3.302)
					(radius 0.762)
					(stroke
						(width 0)
						(type default)
					)
					(fill
						(type none)
					)
				)
			)
			(symbol "TestPoint_1_1"
				(pin passive line
					(at 0 0 90)
					(length 2.54)
					(name "1"
						(effects
							(font
								(size 1.27 1.27)
							)
						)
					)
					(number "1"
						(effects
							(font
								(size 1.27 1.27)
							)
						)
					)
				)
			)
		)
		(symbol "Device:C_Small"
			(pin_numbers hide)
			(pin_names
				(offset 0.254) hide)
			(exclude_from_sim no)
			(in_bom yes)
			(on_board yes)
			(property "Reference" "C"
				(at 0.254 1.778 0)
				(effects
					(font
						(size 1.27 1.27)
					)
					(justify left)
				)
			)
			(property "Value" "C_Small"
				(at 0.254 -2.032 0)
				(effects
					(font
						(size 1.27 1.27)
					)
					(justify left)
				)
			)
			(property "Footprint" ""
				(at 0 0 0)
				(effects
					(font
						(size 1.27 1.27)
					)
					(hide yes)
				)
			)
			(property "Datasheet" "~"
				(at 0 0 0)
				(effects
					(font
						(size 1.27 1.27)
					)
					(hide yes)
				)
			)
			(property "Description" "Unpolarized capacitor, small symbol"
				(at 0 0 0)
				(effects
					(font
						(size 1.27 1.27)
					)
					(hide yes)
				)
			)
			(property "ki_keywords" "capacitor cap"
				(at 0 0 0)
				(effects
					(font
						(size 1.27 1.27)
					)
					(hide yes)
				)
			)
			(property "ki_fp_filters" "C_*"
				(at 0 0 0)
				(effects
					(font
						(size 1.27 1.27)
					)
					(hide yes)
				)
			)
			(symbol "C_Small_0_1"
				(polyline
					(pts
						(xy -1.524 -0.508) (xy 1.524 -0.508)
					)
					(stroke
						(width 0.3302)
						(type default)
					)
					(fill
						(type none)
					)
				)
				(polyline
					(pts
						(xy -1.524 0.508) (xy 1.524 0.508)
					)
					(stroke
						(width 0.3048)
						(type default)
					)
					(fill
						(type none)
					)
				)
			)
			(symbol "C_Small_1_1"
				(pin passive line
					(at 0 2.54 270)
					(length 2.032)
					(name "~"
						(effects
							(font
								(size 1.27 1.27)
							)
						)
					)
					(number "1"
						(effects
							(font
								(size 1.27 1.27)
							)
						)
					)
				)
				(pin passive line
					(at 0 -2.54 90)
					(length 2.032)
					(name "~"
						(effects
							(font
								(size 1.27 1.27)
							)
						)
					)
					(number "2"
						(effects
							(font
								(size 1.27 1.27)
							)
						)
					)
				)
			)
		)
		(symbol "Device:R_Small"
			(pin_numbers hide)
			(pin_names
				(offset 0.254) hide)
			(exclude_from_sim no)
			(in_bom yes)
			(on_board yes)
			(property "Reference" "R"
				(at 0.762 0.508 0)
				(effects
					(font
						(size 1.27 1.27)
					)
					(justify left)
				)
			)
			(property "Value" "R_Small"
				(at 0.762 -1.016 0)
				(effects
					(font
						(size 1.27 1.27)
					)
					(justify left)
				)
			)
			(property "Footprint" ""
				(at 0 0 0)
				(effects
					(font
						(size 1.27 1.27)
					)
					(hide yes)
				)
			)
			(property "Datasheet" "~"
				(at 0 0 0)
				(effects
					(font
						(size 1.27 1.27)
					)
					(hide yes)
				)
			)
			(property "Description" "Resistor, small symbol"
				(at 0 0 0)
				(effects
					(font
						(size 1.27 1.27)
					)
					(hide yes)
				)
			)
			(property "ki_keywords" "R resistor"
				(at 0 0 0)
				(effects
					(font
						(size 1.27 1.27)
					)
					(hide yes)
				)
			)
			(property "ki_fp_filters" "R_*"
				(at 0 0 0)
				(effects
					(font
						(size 1.27 1.27)
					)
					(hide yes)
				)
			)
			(symbol "R_Small_0_1"
				(rectangle
					(start -0.762 1.778)
					(end 0.762 -1.778)
					(stroke
						(width 0.2032)
						(type default)
					)
					(fill
						(type none)
					)
				)
			)
			(symbol "R_Small_1_1"
				(pin passive line
					(at 0 2.54 270)
					(length 0.762)
					(name "~"
						(effects
							(font
								(size 1.27 1.27)
							)
						)
					)
					(number "1"
						(effects
							(font
								(size 1.27 1.27)
							)
						)
					)
				)
				(pin passive line
					(at 0 -2.54 90)
					(length 0.762)
					(name "~"
						(effects
							(font
								(size 1.27 1.27)
							)
						)
					)
					(number "2"
						(effects
							(font
								(size 1.27 1.27)
							)
						)
					)
				)
			)
		)
		(symbol "LEGOS:NCx5652"
			(pin_names
				(offset 0.127)
			)
			(exclude_from_sim no)
			(in_bom yes)
			(on_board yes)
			(property "Reference" "U"
				(at 6.35 20.32 0)
				(effects
					(font
						(size 1.27 1.27)
					)
					(justify left)
				)
			)
			(property "Value" "NCx5652"
				(at -8.89 20.32 0)
				(effects
					(font
						(size 1.27 1.27)
					)
					(justify left)
				)
			)
			(property "Footprint" "LEGOS:UDFN-12_3x3mm_P0.5mm"
				(at -29.21 -24.13 0)
				(effects
					(font
						(size 1.27 1.27)
					)
					(justify left)
					(hide yes)
				)
			)
			(property "Datasheet" "https://www.mouser.de/datasheet/2/308/1/NCS5652_D-2317288.pdf"
				(at -11.43 -26.67 0)
				(effects
					(font
						(size 1.27 1.27)
					)
					(hide yes)
				)
			)
			(property "Description" "200MHz, CMOS, Operational amplifier, with shutdown, SOT-23-6"
				(at 0 0 0)
				(effects
					(font
						(size 1.27 1.27)
					)
					(hide yes)
				)
			)
			(property "ki_keywords" "operational amplifier opamp shutdown high-speed"
				(at 0 0 0)
				(effects
					(font
						(size 1.27 1.27)
					)
					(hide yes)
				)
			)
			(property "ki_fp_filters" "SOT?23*"
				(at 0 0 0)
				(effects
					(font
						(size 1.27 1.27)
					)
					(hide yes)
				)
			)
			(symbol "NCx5652_0_1"
				(rectangle
					(start -7.62 19.05)
					(end 7.62 -21.59)
					(stroke
						(width 0)
						(type default)
					)
					(fill
						(type background)
					)
				)
				(polyline
					(pts
						(xy -5.08 -1.27) (xy 5.08 -6.35) (xy -5.08 -11.43) (xy -5.08 -1.27)
					)
					(stroke
						(width 0.254)
						(type default)
					)
					(fill
						(type background)
					)
				)
				(polyline
					(pts
						(xy -5.08 13.97) (xy 5.08 8.89) (xy -5.08 3.81) (xy -5.08 13.97)
					)
					(stroke
						(width 0.254)
						(type default)
					)
					(fill
						(type background)
					)
				)
			)
			(symbol "NCx5652_1_1"
				(pin input line
					(at -12.7 11.43 0)
					(length 7.62)
					(name "1-"
						(effects
							(font
								(size 1.27 1.27)
							)
						)
					)
					(number "1"
						(effects
							(font
								(size 1.27 1.27)
							)
						)
					)
				)
				(pin power_in line
					(at 10.16 16.51 180)
					(length 2.54)
					(name "VC1"
						(effects
							(font
								(size 1.27 1.27)
							)
						)
					)
					(number "10"
						(effects
							(font
								(size 1.27 1.27)
							)
						)
					)
				)
				(pin output line
					(at 10.16 8.89 180)
					(length 7)
					(name "1OUT"
						(effects
							(font
								(size 1.27 1.27)
							)
						)
					)
					(number "11"
						(effects
							(font
								(size 1.27 1.27)
							)
						)
					)
				)
				(pin power_in line
					(at -12.7 -16.51 0)
					(length 5.08)
					(name "GND"
						(effects
							(font
								(size 1.27 1.27)
							)
						)
					)
					(number "12"
						(effects
							(font
								(size 1.27 1.27)
							)
						)
					)
				)
				(pin power_in line
					(at -12.7 -19.05 0)
					(length 5.08)
					(name "GND"
						(effects
							(font
								(size 1.27 1.27)
							)
						)
					)
					(number "13"
						(effects
							(font
								(size 1.27 1.27)
							)
						)
					)
				)
				(pin input line
					(at -12.7 6.35 0)
					(length 7.62)
					(name "1+"
						(effects
							(font
								(size 1.27 1.27)
							)
						)
					)
					(number "2"
						(effects
							(font
								(size 1.27 1.27)
							)
						)
					)
				)
				(pin input line
					(at -12.7 1.27 0)
					(length 5.08)
					(name "~{DISABLE}/TFlag"
						(effects
							(font
								(size 0.762 0.762)
							)
						)
					)
					(number "3"
						(effects
							(font
								(size 1.27 1.27)
							)
						)
					)
				)
				(pin input line
					(at -12.7 -3.81 0)
					(length 7.62)
					(name "2+"
						(effects
							(font
								(size 1.27 1.27)
							)
						)
					)
					(number "4"
						(effects
							(font
								(size 1.27 1.27)
							)
						)
					)
				)
				(pin input line
					(at -12.7 -8.89 0)
					(length 7.62)
					(name "2-"
						(effects
							(font
								(size 1.27 1.27)
							)
						)
					)
					(number "5"
						(effects
							(font
								(size 1.27 1.27)
							)
						)
					)
				)
				(pin power_in line
					(at -12.7 -13.97 0)
					(length 5.08)
					(name "GND"
						(effects
							(font
								(size 1.27 1.27)
							)
						)
					)
					(number "6"
						(effects
							(font
								(size 1.27 1.27)
							)
						)
					)
				)
				(pin output line
					(at 10.16 -6.35 180)
					(length 7)
					(name "2OUT"
						(effects
							(font
								(size 1.27 1.27)
							)
						)
					)
					(number "7"
						(effects
							(font
								(size 1.27 1.27)
							)
						)
					)
				)
				(pin power_in line
					(at 10.16 -1.27 180)
					(length 2.54)
					(name "VC2"
						(effects
							(font
								(size 1.27 1.27)
							)
						)
					)
					(number "8"
						(effects
							(font
								(size 1.27 1.27)
							)
						)
					)
				)
				(pin power_in line
					(at -12.7 16.51 0)
					(length 5.08)
					(name "VCC"
						(effects
							(font
								(size 1.27 1.27)
							)
						)
					)
					(number "9"
						(effects
							(font
								(size 1.27 1.27)
							)
						)
					)
				)
			)
		)
	)
	(junction
		(at 129.54 76.2)
		(diameter 0)
		(color 0 0 0 0)
		(uuid "0949f530-c97a-4b89-b76f-bb85e87d28cb")
	)
	(junction
		(at 129.54 50.8)
		(diameter 0)
		(color 0 0 0 0)
		(uuid "2ec4ff4a-a0c8-41c5-bd20-e4f10e45bcc7")
	)
	(junction
		(at 102.87 50.8)
		(diameter 0)
		(color 0 0 0 0)
		(uuid "2f3fad5c-7d86-4f96-9711-f770a331260f")
	)
	(junction
		(at 48.26 142.24)
		(diameter 0)
		(color 0 0 0 0)
		(uuid "52e9612e-fdd7-4352-b380-aa434b786d1f")
	)
	(junction
		(at 74.93 78.74)
		(diameter 0)
		(color 0 0 0 0)
		(uuid "62b50a3b-2ec3-47ae-abf1-b2e5e7879cec")
	)
	(junction
		(at 58.42 142.24)
		(diameter 0)
		(color 0 0 0 0)
		(uuid "6ca355e0-174d-47a9-aa38-b44ff684f933")
	)
	(junction
		(at 58.42 152.4)
		(diameter 0)
		(color 0 0 0 0)
		(uuid "7337f487-6ce7-495b-892b-2b09cfcaadf0")
	)
	(junction
		(at 129.54 60.96)
		(diameter 0)
		(color 0 0 0 0)
		(uuid "8d5b91a9-e6a7-444a-befa-ba264547d20a")
	)
	(junction
		(at 129.54 66.04)
		(diameter 0)
		(color 0 0 0 0)
		(uuid "995e5d49-fcc5-4322-88fe-a985d0fa4928")
	)
	(junction
		(at 102.87 66.04)
		(diameter 0)
		(color 0 0 0 0)
		(uuid "9d3dbd0b-ab12-45e3-8e32-d86ad155ef26")
	)
	(junction
		(at 105.41 43.18)
		(diameter 0)
		(color 0 0 0 0)
		(uuid "ccf45e25-852c-4211-9cd8-b58ecff3a587")
	)
	(junction
		(at 107.95 66.04)
		(diameter 0)
		(color 0 0 0 0)
		(uuid "f27eb6fe-a28a-4f55-9f98-b1f5557260d8")
	)
	(junction
		(at 74.93 76.2)
		(diameter 0)
		(color 0 0 0 0)
		(uuid "f2c02e3f-a964-40e5-8330-6ae32ce5688d")
	)
	(junction
		(at 62.23 63.5)
		(diameter 0)
		(color 0 0 0 0)
		(uuid "f43a02a3-5259-4a42-b938-df09f486070e")
	)
	(junction
		(at 107.95 50.8)
		(diameter 0)
		(color 0 0 0 0)
		(uuid "f633351b-b8e4-4638-8b47-f8b5284e2e69")
	)
	(junction
		(at 83.82 142.24)
		(diameter 0)
		(color 0 0 0 0)
		(uuid "f7895f09-9ef0-4395-beab-1e1b570c9ce6")
	)
	(wire
		(pts
			(xy 62.23 63.5) (xy 77.47 63.5)
		)
		(stroke
			(width 0)
			(type default)
		)
		(uuid "00466151-a662-4e1b-b253-52dd8b89f442")
	)
	(wire
		(pts
			(xy 129.54 60.96) (xy 107.95 60.96)
		)
		(stroke
			(width 0)
			(type default)
		)
		(uuid "0193a3c7-f35e-4fee-bd0e-efa62d95fcbe")
	)
	(polyline
		(pts
			(xy 165.1 157.48) (xy 119.38 157.48)
		)
		(stroke
			(width 0)
			(type default)
		)
		(uuid "01970976-f553-4198-92dd-53b154554677")
	)
	(wire
		(pts
			(xy 72.39 53.34) (xy 77.47 53.34)
		)
		(stroke
			(width 0)
			(type default)
		)
		(uuid "01f3235a-004f-495f-88b6-2938dff02190")
	)
	(wire
		(pts
			(xy 59.69 63.5) (xy 62.23 63.5)
		)
		(stroke
			(width 0)
			(type default)
		)
		(uuid "0288256e-1b8a-4c21-b9d6-691eb9f667f1")
	)
	(wire
		(pts
			(xy 74.93 78.74) (xy 74.93 76.2)
		)
		(stroke
			(width 0)
			(type default)
		)
		(uuid "04bf0d97-b163-41fd-a73a-a3a9ad0860ed")
	)
	(wire
		(pts
			(xy 83.82 144.78) (xy 83.82 142.24)
		)
		(stroke
			(width 0)
			(type default)
		)
		(uuid "126d9da0-675f-4fd8-95dd-d10ccf16dd9c")
	)
	(wire
		(pts
			(xy 100.33 66.04) (xy 102.87 66.04)
		)
		(stroke
			(width 0)
			(type default)
		)
		(uuid "14ac1c3e-df82-43bb-955d-2906b7604429")
	)
	(wire
		(pts
			(xy 102.87 50.8) (xy 107.95 50.8)
		)
		(stroke
			(width 0)
			(type default)
		)
		(uuid "168d7114-3e2c-4398-9edc-3d86fef58d7a")
	)
	(wire
		(pts
			(xy 107.95 66.04) (xy 129.54 66.04)
		)
		(stroke
			(width 0)
			(type default)
		)
		(uuid "1cf5e58b-7053-4d69-bfd5-2eb962c1fe97")
	)
	(wire
		(pts
			(xy 102.87 38.1) (xy 102.87 50.8)
		)
		(stroke
			(width 0)
			(type default)
		)
		(uuid "1f9c7720-7bd3-43a7-8bb1-fe74780391d6")
	)
	(polyline
		(pts
			(xy 177.8 119.38) (xy 260.35 119.38)
		)
		(stroke
			(width 0)
			(type default)
		)
		(uuid "232619a5-78b9-42bd-adf0-20931eb2cf7a")
	)
	(wire
		(pts
			(xy 102.87 66.04) (xy 102.87 78.74)
		)
		(stroke
			(width 0)
			(type default)
		)
		(uuid "2430ad1f-f23c-49b2-ba35-668724e268d3")
	)
	(polyline
		(pts
			(xy 162.56 74.93) (xy 162.56 92.71)
		)
		(stroke
			(width 0)
			(type default)
		)
		(uuid "2e203cdd-a219-421e-8d78-7ddf2d844002")
	)
	(wire
		(pts
			(xy 67.31 78.74) (xy 74.93 78.74)
		)
		(stroke
			(width 0)
			(type default)
		)
		(uuid "2e885cf2-8d49-42ef-bdb8-4a0d823d2677")
	)
	(wire
		(pts
			(xy 74.93 78.74) (xy 77.47 78.74)
		)
		(stroke
			(width 0)
			(type default)
		)
		(uuid "2fef480a-f651-4a7e-b59c-61548a238138")
	)
	(wire
		(pts
			(xy 107.95 60.96) (xy 107.95 58.42)
		)
		(stroke
			(width 0)
			(type default)
		)
		(uuid "3158a304-cbcb-4764-9555-acd9b4cd1dc9")
	)
	(polyline
		(pts
			(xy 106.68 119.38) (xy 106.68 154.94)
		)
		(stroke
			(width 0)
			(type default)
		)
		(uuid "3663e3ed-bdbb-4de6-b602-384a31ae3b48")
	)
	(wire
		(pts
			(xy 129.54 50.8) (xy 129.54 53.34)
		)
		(stroke
			(width 0)
			(type default)
		)
		(uuid "428e8c74-2b70-499a-8aef-117f910d723c")
	)
	(wire
		(pts
			(xy 72.39 58.42) (xy 77.47 58.42)
		)
		(stroke
			(width 0)
			(type default)
		)
		(uuid "45376e80-4b4e-4f70-922b-e4fd05ce0cd6")
	)
	(wire
		(pts
			(xy 55.88 142.24) (xy 58.42 142.24)
		)
		(stroke
			(width 0)
			(type default)
		)
		(uuid "45ab2f2a-2f2a-479d-bb11-25a51db5ce46")
	)
	(polyline
		(pts
			(xy 162.56 92.71) (xy 187.96 92.71)
		)
		(stroke
			(width 0)
			(type default)
		)
		(uuid "46d09c9b-ffaa-422d-878e-58b0e1e648ae")
	)
	(wire
		(pts
			(xy 69.85 68.58) (xy 77.47 68.58)
		)
		(stroke
			(width 0)
			(type default)
		)
		(uuid "496e86db-cb59-4b71-a53e-1af63a45d623")
	)
	(polyline
		(pts
			(xy 187.96 92.71) (xy 187.96 74.93)
		)
		(stroke
			(width 0)
			(type default)
		)
		(uuid "53372fe7-1bb6-43f1-8d89-f1222a149593")
	)
	(wire
		(pts
			(xy 45.72 142.24) (xy 48.26 142.24)
		)
		(stroke
			(width 0)
			(type default)
		)
		(uuid "578e7e90-e8f4-4e00-9e88-483ead110888")
	)
	(wire
		(pts
			(xy 58.42 142.24) (xy 60.96 142.24)
		)
		(stroke
			(width 0)
			(type default)
		)
		(uuid "5aab9f56-779a-4be9-9272-6f47e49cdd52")
	)
	(wire
		(pts
			(xy 129.54 66.04) (xy 132.08 66.04)
		)
		(stroke
			(width 0)
			(type default)
		)
		(uuid "5b0d0c0a-ca0e-4197-ba3e-3cdc7467686b")
	)
	(wire
		(pts
			(xy 100.33 60.96) (xy 105.41 60.96)
		)
		(stroke
			(width 0)
			(type default)
		)
		(uuid "5d799ce6-5ca9-4178-bc23-f089a18db015")
	)
	(polyline
		(pts
			(xy 260.35 139.7) (xy 260.35 119.38)
		)
		(stroke
			(width 0)
			(type default)
		)
		(uuid "5e76c6a8-31fd-49b1-8446-96f341a5c715")
	)
	(wire
		(pts
			(xy 124.46 134.62) (xy 124.46 137.16)
		)
		(stroke
			(width 0)
			(type default)
		)
		(uuid "5e8f25ca-2edc-48cd-aa28-8a22321c106b")
	)
	(wire
		(pts
			(xy 107.95 50.8) (xy 107.95 53.34)
		)
		(stroke
			(width 0)
			(type default)
		)
		(uuid "5eaf28e5-dad8-4d0c-97c4-2ddd03686161")
	)
	(polyline
		(pts
			(xy 149.86 92.71) (xy 35.56 92.71)
		)
		(stroke
			(width 0)
			(type default)
		)
		(uuid "5efef5b8-435f-4891-9b6b-c95725fb6c3b")
	)
	(wire
		(pts
			(xy 48.26 142.24) (xy 48.26 144.78)
		)
		(stroke
			(width 0)
			(type default)
		)
		(uuid "62e3088f-6ed7-4b9f-87d4-c00e07e41845")
	)
	(wire
		(pts
			(xy 107.95 76.2) (xy 107.95 73.66)
		)
		(stroke
			(width 0)
			(type default)
		)
		(uuid "69ea8229-6e8b-441d-9f43-dce4201f71f5")
	)
	(wire
		(pts
			(xy 102.87 66.04) (xy 107.95 66.04)
		)
		(stroke
			(width 0)
			(type default)
		)
		(uuid "6cbf542d-b551-48b8-a4e3-092575c6376b")
	)
	(wire
		(pts
			(xy 74.93 73.66) (xy 77.47 73.66)
		)
		(stroke
			(width 0)
			(type default)
		)
		(uuid "6d1bcbd7-0ba9-4816-a686-7821f61865f7")
	)
	(wire
		(pts
			(xy 184.15 88.9) (xy 184.15 86.36)
		)
		(stroke
			(width 0)
			(type default)
		)
		(uuid "729ed772-05f5-46aa-93b7-99b9a83d207f")
	)
	(wire
		(pts
			(xy 105.41 60.96) (xy 105.41 43.18)
		)
		(stroke
			(width 0)
			(type default)
		)
		(uuid "75150a16-d163-401d-bd95-4deedeac3960")
	)
	(polyline
		(pts
			(xy 177.8 119.38) (xy 177.8 139.7)
		)
		(stroke
			(width 0)
			(type default)
		)
		(uuid "75bdfbaf-5102-412c-823e-567f23a8d19d")
	)
	(wire
		(pts
			(xy 58.42 152.4) (xy 58.42 149.86)
		)
		(stroke
			(width 0)
			(type default)
		)
		(uuid "777c8462-e8e6-4da4-9168-a86f332d5524")
	)
	(wire
		(pts
			(xy 184.15 81.28) (xy 184.15 78.74)
		)
		(stroke
			(width 0)
			(type default)
		)
		(uuid "78c1e122-8836-4a89-b5fa-c8850d693725")
	)
	(wire
		(pts
			(xy 105.41 43.18) (xy 100.33 43.18)
		)
		(stroke
			(width 0)
			(type default)
		)
		(uuid "7d7f9138-7a91-4042-9503-b608589b49fa")
	)
	(polyline
		(pts
			(xy 177.8 139.7) (xy 260.35 139.7)
		)
		(stroke
			(width 0)
			(type default)
		)
		(uuid "7fb4a725-34ee-40e6-8db7-90a45eeca6b2")
	)
	(polyline
		(pts
			(xy 74.93 24.13) (xy 149.86 24.13)
		)
		(stroke
			(width 0)
			(type default)
		)
		(uuid "8218674e-8bc1-4134-830f-31259653c405")
	)
	(wire
		(pts
			(xy 176.53 78.74) (xy 184.15 78.74)
		)
		(stroke
			(width 0)
			(type default)
		)
		(uuid "83c5a1fa-f5c2-4449-b6be-767a00555748")
	)
	(wire
		(pts
			(xy 129.54 58.42) (xy 129.54 60.96)
		)
		(stroke
			(width 0)
			(type default)
		)
		(uuid "83cb112d-bc95-4a0e-8dda-fcfeb77d7804")
	)
	(polyline
		(pts
			(xy 119.38 119.38) (xy 119.38 157.48)
		)
		(stroke
			(width 0)
			(type default)
		)
		(uuid "8856a3b9-c0a4-4e5e-a4db-c60ee069fb94")
	)
	(wire
		(pts
			(xy 134.62 76.2) (xy 129.54 76.2)
		)
		(stroke
			(width 0)
			(type default)
		)
		(uuid "89e7c957-b989-4abd-b820-284543d74ae3")
	)
	(wire
		(pts
			(xy 107.95 66.04) (xy 107.95 68.58)
		)
		(stroke
			(width 0)
			(type default)
		)
		(uuid "8c94b2e4-d635-40b8-887c-c2cda0a82b0a")
	)
	(wire
		(pts
			(xy 144.78 134.62) (xy 144.78 137.16)
		)
		(stroke
			(width 0)
			(type default)
		)
		(uuid "8d887282-ed79-45d2-bbfd-b140ef65444d")
	)
	(wire
		(pts
			(xy 134.62 60.96) (xy 129.54 60.96)
		)
		(stroke
			(width 0)
			(type default)
		)
		(uuid "8e8588a4-da6e-4020-b93b-00ac3c70a002")
	)
	(wire
		(pts
			(xy 69.85 86.36) (xy 102.87 86.36)
		)
		(stroke
			(width 0)
			(type default)
		)
		(uuid "8eaf9d7c-1427-4510-85da-6d541c356a7b")
	)
	(wire
		(pts
			(xy 124.46 142.24) (xy 124.46 144.78)
		)
		(stroke
			(width 0)
			(type default)
		)
		(uuid "8ee8b5fb-c435-45a6-889e-cbc2a9edb8eb")
	)
	(wire
		(pts
			(xy 83.82 142.24) (xy 88.9 142.24)
		)
		(stroke
			(width 0)
			(type default)
		)
		(uuid "907f9974-ef11-47c2-9457-2be079d2a511")
	)
	(wire
		(pts
			(xy 83.82 152.4) (xy 83.82 149.86)
		)
		(stroke
			(width 0)
			(type default)
		)
		(uuid "90913f8b-dcbf-48d1-b46c-293709cc076c")
	)
	(wire
		(pts
			(xy 102.87 30.48) (xy 102.87 33.02)
		)
		(stroke
			(width 0)
			(type default)
		)
		(uuid "969e318d-669b-480d-9af9-0b62bc6c7235")
	)
	(wire
		(pts
			(xy 62.23 63.5) (xy 62.23 66.04)
		)
		(stroke
			(width 0)
			(type default)
		)
		(uuid "97121d3a-5397-4c09-8014-14dd4e81d076")
	)
	(wire
		(pts
			(xy 69.85 43.18) (xy 77.47 43.18)
		)
		(stroke
			(width 0)
			(type default)
		)
		(uuid "9b0305d4-b3ae-4a58-a206-3b738e8e0189")
	)
	(wire
		(pts
			(xy 58.42 152.4) (xy 83.82 152.4)
		)
		(stroke
			(width 0)
			(type default)
		)
		(uuid "9c561d72-7b96-4d5b-a476-199e3a73318b")
	)
	(polyline
		(pts
			(xy 35.56 24.13) (xy 74.93 24.13)
		)
		(stroke
			(width 0)
			(type default)
		)
		(uuid "a020bdcc-a763-4b54-bb9c-3a6da873f1e3")
	)
	(wire
		(pts
			(xy 100.33 50.8) (xy 102.87 50.8)
		)
		(stroke
			(width 0)
			(type default)
		)
		(uuid "a08baeac-2d57-4105-9a35-3723ee5daa66")
	)
	(wire
		(pts
			(xy 129.54 66.04) (xy 129.54 68.58)
		)
		(stroke
			(width 0)
			(type default)
		)
		(uuid "a14f54db-b6ed-4cf2-ad14-3846c22fc547")
	)
	(wire
		(pts
			(xy 72.39 30.48) (xy 102.87 30.48)
		)
		(stroke
			(width 0)
			(type default)
		)
		(uuid "a7d9732a-e3cb-4527-9a83-b55025a34b45")
	)
	(wire
		(pts
			(xy 144.78 142.24) (xy 144.78 144.78)
		)
		(stroke
			(width 0)
			(type default)
		)
		(uuid "a7e3a86b-d9d7-431d-a728-fce2399abf42")
	)
	(wire
		(pts
			(xy 129.54 73.66) (xy 129.54 76.2)
		)
		(stroke
			(width 0)
			(type default)
		)
		(uuid "aa6ec023-c47b-4cc0-aa50-240fa4d8f787")
	)
	(wire
		(pts
			(xy 48.26 142.24) (xy 50.8 142.24)
		)
		(stroke
			(width 0)
			(type default)
		)
		(uuid "b51101a9-cb54-4ed1-9ebe-f8229be7e812")
	)
	(polyline
		(pts
			(xy 165.1 157.48) (xy 165.1 119.38)
		)
		(stroke
			(width 0)
			(type default)
		)
		(uuid "c49db90d-034e-4c57-bb94-ac9f58ef8ad5")
	)
	(wire
		(pts
			(xy 102.87 86.36) (xy 102.87 83.82)
		)
		(stroke
			(width 0)
			(type default)
		)
		(uuid "c71ce215-8b04-4e5b-87ee-68ff3f7fc163")
	)
	(polyline
		(pts
			(xy 35.56 92.71) (xy 35.56 24.13)
		)
		(stroke
			(width 0)
			(type default)
		)
		(uuid "c7d26859-bb2b-475e-ba7a-77b0a4e1095b")
	)
	(wire
		(pts
			(xy 176.53 88.9) (xy 184.15 88.9)
		)
		(stroke
			(width 0)
			(type default)
		)
		(uuid "cd35247d-4eb5-48d2-98b1-534f345a3b4a")
	)
	(wire
		(pts
			(xy 74.93 76.2) (xy 74.93 73.66)
		)
		(stroke
			(width 0)
			(type default)
		)
		(uuid "d2020647-60eb-469b-a51e-3543d886e439")
	)
	(wire
		(pts
			(xy 69.85 68.58) (xy 69.85 86.36)
		)
		(stroke
			(width 0)
			(type default)
		)
		(uuid "d2e9df35-caac-46a5-a87f-daf928aa6527")
	)
	(polyline
		(pts
			(xy 35.56 119.38) (xy 106.68 119.38)
		)
		(stroke
			(width 0)
			(type default)
		)
		(uuid "d6b1b022-c03a-43ae-ac26-a53f7a19eea7")
	)
	(wire
		(pts
			(xy 74.93 76.2) (xy 77.47 76.2)
		)
		(stroke
			(width 0)
			(type default)
		)
		(uuid "d787b05f-a6c3-4074-8700-e846782afe81")
	)
	(polyline
		(pts
			(xy 149.86 92.71) (xy 149.86 24.13)
		)
		(stroke
			(width 0)
			(type default)
		)
		(uuid "d83d15ed-9a38-4bf4-a776-aea2bbe24630")
	)
	(wire
		(pts
			(xy 129.54 76.2) (xy 107.95 76.2)
		)
		(stroke
			(width 0)
			(type default)
		)
		(uuid "db1e4c85-29d0-4099-91cf-ef2f2222ff98")
	)
	(polyline
		(pts
			(xy 35.56 119.38) (xy 35.56 154.94)
		)
		(stroke
			(width 0)
			(type default)
		)
		(uuid "dd30ca5d-7e9c-41f8-9ffe-889c7a9bc281")
	)
	(wire
		(pts
			(xy 129.54 50.8) (xy 132.08 50.8)
		)
		(stroke
			(width 0)
			(type default)
		)
		(uuid "dd3a8869-748e-48ad-86df-c694733cbee4")
	)
	(polyline
		(pts
			(xy 165.1 119.38) (xy 119.38 119.38)
		)
		(stroke
			(width 0)
			(type default)
		)
		(uuid "ddf036d2-0460-49a4-a575-2da6656a0717")
	)
	(wire
		(pts
			(xy 58.42 142.24) (xy 58.42 144.78)
		)
		(stroke
			(width 0)
			(type default)
		)
		(uuid "e38a9f83-dd8e-4581-8337-aec38cd63b43")
	)
	(wire
		(pts
			(xy 105.41 43.18) (xy 113.03 43.18)
		)
		(stroke
			(width 0)
			(type default)
		)
		(uuid "ec35dac2-9562-4946-a8eb-63adee03c4e3")
	)
	(wire
		(pts
			(xy 72.39 30.48) (xy 72.39 48.26)
		)
		(stroke
			(width 0)
			(type default)
		)
		(uuid "ecfb1457-3c9a-4698-8abc-765b89642339")
	)
	(wire
		(pts
			(xy 53.34 152.4) (xy 58.42 152.4)
		)
		(stroke
			(width 0)
			(type default)
		)
		(uuid "edb76fea-c668-4ebd-88ad-1f375900cf5e")
	)
	(polyline
		(pts
			(xy 106.68 157.48) (xy 35.56 157.48)
		)
		(stroke
			(width 0)
			(type default)
		)
		(uuid "eff25efe-2862-491f-b078-fca582db3925")
	)
	(polyline
		(pts
			(xy 187.96 74.93) (xy 162.56 74.93)
		)
		(stroke
			(width 0)
			(type default)
		)
		(uuid "f70a84b7-b22d-465d-b03c-89c9b7ed8ef6")
	)
	(wire
		(pts
			(xy 77.47 48.26) (xy 72.39 48.26)
		)
		(stroke
			(width 0)
			(type default)
		)
		(uuid "f94956a3-9d0f-415b-bd4b-2688e784f08a")
	)
	(wire
		(pts
			(xy 107.95 50.8) (xy 129.54 50.8)
		)
		(stroke
			(width 0)
			(type default)
		)
		(uuid "fba033fb-2312-40ee-be56-51250de0c697")
	)
	(wire
		(pts
			(xy 83.82 142.24) (xy 66.04 142.24)
		)
		(stroke
			(width 0)
			(type default)
		)
		(uuid "fbc688da-88a8-459b-b9e6-ea77dc84b693")
	)
	(text "Voltage Follower to follow ESP's DAC Voltage\nI_Load = V_DAC / 8.2R\nVCC Connected to 5V for full Voltage Output Span (VCC-1.2V)\nVC1/VC2 Connected to Current Measurement of INA209\nIf TFlag Read as Low -> Overtemperature\nIf Disable is written Low -> Disabled Output"
		(exclude_from_sim no)
		(at 35.56 106.68 0)
		(effects
			(font
				(size 1.27 1.27)
			)
			(justify left bottom)
		)
		(uuid "06a720fd-36fa-4f0c-aaa5-c82f4c449a10")
	)
	(text "Adjustable Current Load"
		(exclude_from_sim no)
		(at 35.56 22.86 0)
		(effects
			(font
				(size 2 2)
			)
			(justify left bottom)
		)
		(uuid "10c72e8b-d3df-4edf-a8c8-ceaa953a8e74")
	)
	(text "Connections\n\nLOAD_VCC  =>  5V\nLOAD_SUPPLY => Supply to be loaded => VBUS behind Current Measurement\nLOAD_INPUT => DAC Input Voltage to be followed\nLOAD_DISABLE => Reads GND if Overtemp, Write GND to Disable\nLOAD_GND => GND"
		(exclude_from_sim no)
		(at 180.34 137.16 0)
		(effects
			(font
				(size 1.27 1.27)
			)
			(justify left bottom)
		)
		(uuid "10ea6946-4e89-4a8c-b737-5f9bc62c8fce")
	)
	(text "Bypass Caps"
		(exclude_from_sim no)
		(at 119.38 118.11 0)
		(effects
			(font
				(size 1.27 1.27)
			)
			(justify left bottom)
		)
		(uuid "2d8dc49b-12fb-4073-bbf1-083e2ff1ff18")
	)
	(text "VIN = 3V ; I_Load = 0.4A\n=> R_Load = 7,5R\n=> P_Load = 1,5W"
		(exclude_from_sim no)
		(at 119.38 100.33 0)
		(effects
			(font
				(size 1.27 1.27)
			)
			(justify left bottom)
		)
		(uuid "7daa2337-581f-4bb7-b3e1-e828674a559b")
	)
	(text "3V Voltage Divider and LP Filter"
		(exclude_from_sim no)
		(at 35.56 118.11 0)
		(effects
			(font
				(size 1.27 1.27)
			)
			(justify left bottom)
		)
		(uuid "8d655a06-f044-4e8d-881d-fffde78db5f9")
	)
	(text "3V Divider because in simulations the output transistors can get saturated, resulting in limited output current. can be briged\nLP filter with cutoff at ~350Hz in case the DAC of the ESP32 is noisy"
		(exclude_from_sim no)
		(at 35.56 163.83 0)
		(effects
			(font
				(size 1.27 1.27)
			)
			(justify left bottom)
		)
		(uuid "f684cd0e-e117-4665-b6d7-be2525b5a05d")
	)
	(label "LOAD_SET_FILTERED"
		(at 88.9 142.24 0)
		(fields_autoplaced yes)
		(effects
			(font
				(size 1 1)
			)
			(justify left bottom)
		)
		(uuid "8c94bda1-6ace-4eb6-b73b-f4bc47b68994")
	)
	(label "LOAD_R1"
		(at 118.11 50.8 0)
		(fields_autoplaced yes)
		(effects
			(font
				(size 1 1)
			)
			(justify left bottom)
		)
		(uuid "a29a4376-7a55-481f-a493-eb9d98aa08ee")
	)
	(label "LOAD_SET_FILTERED"
		(at 59.69 63.5 180)
		(fields_autoplaced yes)
		(effects
			(font
				(size 1 1)
			)
			(justify right bottom)
		)
		(uuid "a3819fe7-431c-4866-9d6c-25e5506ceaf9")
	)
	(label "LOAD_SET_FILTERED"
		(at 72.39 53.34 180)
		(fields_autoplaced yes)
		(effects
			(font
				(size 1 1)
			)
			(justify right bottom)
		)
		(uuid "b8b6eec3-4732-4e23-9831-c3de7830e2a6")
	)
	(label "LOAD_R2"
		(at 118.11 66.04 0)
		(fields_autoplaced yes)
		(effects
			(font
				(size 1 1)
			)
			(justify left bottom)
		)
		(uuid "cca23d0a-8f6e-4d83-8008-aa07eb9dfd5d")
	)
	(hierarchical_label "LOAD_SUPPLY"
		(shape input)
		(at 124.46 134.62 90)
		(fields_autoplaced yes)
		(effects
			(font
				(size 1 1)
			)
			(justify left)
		)
		(uuid "337132b3-d16a-401a-bb4d-f9eb000eac06")
	)
	(hierarchical_label "LOAD_GND"
		(shape output)
		(at 53.34 152.4 180)
		(fields_autoplaced yes)
		(effects
			(font
				(size 1 1)
			)
			(justify right)
		)
		(uuid "49b68530-89ec-44e1-9786-5614620663b9")
	)
	(hierarchical_label "LOAD_GND"
		(shape output)
		(at 124.46 144.78 270)
		(fields_autoplaced yes)
		(effects
			(font
				(size 1 1)
			)
			(justify right)
		)
		(uuid "4fa6e42f-b659-4a46-9607-8e99594cf17c")
	)
	(hierarchical_label "LOAD_GND"
		(shape output)
		(at 134.62 60.96 0)
		(fields_autoplaced yes)
		(effects
			(font
				(size 1 1)
			)
			(justify left)
		)
		(uuid "50af11a8-77f8-4683-a1ed-e03c22795156")
	)
	(hierarchical_label "LOAD_GND"
		(shape output)
		(at 144.78 144.78 270)
		(fields_autoplaced yes)
		(effects
			(font
				(size 1 1)
			)
			(justify right)
		)
		(uuid "59bc2531-2b68-4b72-8502-8e5092747817")
	)
	(hierarchical_label "LOAD_SUPPLY"
		(shape input)
		(at 113.03 43.18 0)
		(fields_autoplaced yes)
		(effects
			(font
				(size 1 1)
			)
			(justify left)
		)
		(uuid "6a3ef02e-2e06-451a-b3eb-cc96cdac25ce")
	)
	(hierarchical_label "LOAD_~{DISABLE}"
		(shape tri_state)
		(at 72.39 58.42 180)
		(fields_autoplaced yes)
		(effects
			(font
				(size 1 1)
			)
			(justify right)
		)
		(uuid "7bf1ca7b-69f4-4fcc-8fa3-b4e73b55e15f")
	)
	(hierarchical_label "LOAD_VCC"
		(shape input)
		(at 144.78 134.62 90)
		(fields_autoplaced yes)
		(effects
			(font
				(size 1 1)
			)
			(justify left)
		)
		(uuid "98e98fc9-9279-442b-b2fd-d40e8a9c2d1e")
	)
	(hierarchical_label "LOAD_VCC"
		(shape input)
		(at 176.53 78.74 180)
		(fields_autoplaced yes)
		(effects
			(font
				(size 1 1)
			)
			(justify right)
		)
		(uuid "c42268c1-9d7e-47ae-9ccd-95165814f3bd")
	)
	(hierarchical_label "LOAD_VCC"
		(shape input)
		(at 69.85 43.18 180)
		(fields_autoplaced yes)
		(effects
			(font
				(size 1 1)
			)
			(justify right)
		)
		(uuid "cb97e98b-9000-40a6-9a6d-5cc3992215d5")
	)
	(hierarchical_label "LOAD_SET"
		(shape input)
		(at 45.72 142.24 180)
		(fields_autoplaced yes)
		(effects
			(font
				(size 1 1)
			)
			(justify right)
		)
		(uuid "cc6cf96b-64ab-4a25-978d-e132b2280b5d")
	)
	(hierarchical_label "LOAD_GND"
		(shape output)
		(at 67.31 78.74 180)
		(fields_autoplaced yes)
		(effects
			(font
				(size 1 1)
			)
			(justify right)
		)
		(uuid "ccd2458b-2ac9-480f-8ff8-348fe6938efb")
	)
	(hierarchical_label "LOAD_GND"
		(shape output)
		(at 134.62 76.2 0)
		(fields_autoplaced yes)
		(effects
			(font
				(size 1 1)
			)
			(justify left)
		)
		(uuid "cd446b95-1b02-4491-8d09-027c142d8c9b")
	)
	(hierarchical_label "LOAD_~{DISABLE}"
		(shape tri_state)
		(at 176.53 88.9 180)
		(fields_autoplaced yes)
		(effects
			(font
				(size 1 1)
			)
			(justify right)
		)
		(uuid "d65c8112-7e25-4fba-9530-6425ff0831d5")
	)
	(symbol
		(lib_id "Device:R_Small")
		(at 63.5 142.24 270)
		(mirror x)
		(unit 1)
		(exclude_from_sim no)
		(in_bom yes)
		(on_board yes)
		(dnp no)
		(uuid "12407f78-cbb9-4a09-8ff6-6472a247d932")
		(property "Reference" "VL_R7"
			(at 63.5 140.97 0)
			(effects
				(font
					(size 0.9906 0.9906)
				)
				(justify left bottom)
			)
		)
		(property "Value" "10kOhm 1/8W 1% 0805"
			(at 62.23 140.97 0)
			(effects
				(font
					(size 0.9906 0.9906)
				)
				(justify left bottom)
			)
		)
		(property "Footprint" "Resistor_SMD:R_0805_2012Metric"
			(at 63.5 142.24 0)
			(effects
				(font
					(size 1.27 1.27)
				)
				(hide yes)
			)
		)
		(property "Datasheet" "https://www.mouser.de/datasheet/2/427/crcwce3-1762584.pdf"
			(at 63.5 142.24 0)
			(effects
				(font
					(size 1.27 1.27)
				)
				(hide yes)
			)
		)
		(property "Description" ""
			(at 63.5 142.24 0)
			(effects
				(font
					(size 1.27 1.27)
				)
				(hide yes)
			)
		)
		(property "Mfr" "CRCW080510K0FKEAC"
			(at 60.96 140.97 0)
			(effects
				(font
					(size 1 1)
				)
				(justify left bottom)
			)
		)
		(pin "1"
			(uuid "b459b217-29c2-4ebc-8c41-9537e44f56c2")
		)
		(pin "2"
			(uuid "215706f6-31dd-4d46-acf4-f80a4166a40c")
		)
		(instances
			(project ""
				(path "/1cd06601-5f31-4c60-a631-5f52abbac22a/eca0bae5-c70a-4cd0-bded-86b363574270"
					(reference "VL_R7")
					(unit 1)
				)
			)
			(project ""
				(path "/8ca3e20d-bcc7-4c5e-9deb-562dfed9fecb/3965c8e3-f0fc-4cdb-8abb-6c0f973b294f"
					(reference "VL_R7")
					(unit 1)
				)
			)
			(project "house"
				(path "/c550b25f-ec05-46b5-ace8-c62c72299fc2/6e70007e-969b-4aeb-a6e5-d75c865ef30e"
					(reference "VL_R3")
					(unit 1)
				)
			)
			(project ""
				(path "/d3c11c8f-a73d-4211-934b-a6da255728ad/18bbf347-68a5-46f5-910e-3352e0a39732"
					(reference "VL_R3")
					(unit 1)
				)
			)
			(project ""
				(path "/d6d63c7c-d82d-4890-9f75-94cf42dec49c/fe74b7e4-8a65-459a-a8f2-156a180a03ca"
					(reference "VL_R?")
					(unit 1)
				)
			)
		)
	)
	(symbol
		(lib_id "Device:R_Small")
		(at 102.87 35.56 0)
		(unit 1)
		(exclude_from_sim no)
		(in_bom yes)
		(on_board yes)
		(dnp no)
		(uuid "20ed208f-a14d-4d38-8200-30843a751899")
		(property "Reference" "VL_R1"
			(at 104.14 35.56 0)
			(effects
				(font
					(size 0.9906 0.9906)
				)
				(justify left bottom)
			)
		)
		(property "Value" "10kOhm 1/8W 1% 0805"
			(at 104.14 36.83 0)
			(effects
				(font
					(size 0.9906 0.9906)
				)
				(justify left bottom)
			)
		)
		(property "Footprint" "Resistor_SMD:R_0805_2012Metric"
			(at 102.87 35.56 0)
			(effects
				(font
					(size 1.27 1.27)
				)
				(hide yes)
			)
		)
		(property "Datasheet" "https://www.mouser.de/datasheet/2/427/crcwce3-1762584.pdf"
			(at 102.87 35.56 0)
			(effects
				(font
					(size 1.27 1.27)
				)
				(hide yes)
			)
		)
		(property "Description" ""
			(at 102.87 35.56 0)
			(effects
				(font
					(size 1.27 1.27)
				)
				(hide yes)
			)
		)
		(property "Mfr" "CRCW080510K0FKEAC"
			(at 104.14 38.1 0)
			(effects
				(font
					(size 1 1)
				)
				(justify left bottom)
			)
		)
		(pin "1"
			(uuid "c7c0206c-2378-45a1-b375-0291971105b8")
		)
		(pin "2"
			(uuid "699c2bd5-62e4-449a-8ef2-bbe74efa5c91")
		)
		(instances
			(project ""
				(path "/1cd06601-5f31-4c60-a631-5f52abbac22a/eca0bae5-c70a-4cd0-bded-86b363574270"
					(reference "VL_R1")
					(unit 1)
				)
			)
			(project ""
				(path "/8ca3e20d-bcc7-4c5e-9deb-562dfed9fecb/3965c8e3-f0fc-4cdb-8abb-6c0f973b294f"
					(reference "VL_R1")
					(unit 1)
				)
			)
			(project "house"
				(path "/c550b25f-ec05-46b5-ace8-c62c72299fc2/6e70007e-969b-4aeb-a6e5-d75c865ef30e"
					(reference "VL_R4")
					(unit 1)
				)
			)
			(project ""
				(path "/d3c11c8f-a73d-4211-934b-a6da255728ad/18bbf347-68a5-46f5-910e-3352e0a39732"
					(reference "VL_R4")
					(unit 1)
				)
			)
			(project ""
				(path "/d6d63c7c-d82d-4890-9f75-94cf42dec49c/fe74b7e4-8a65-459a-a8f2-156a180a03ca"
					(reference "VL_R?")
					(unit 1)
				)
			)
		)
	)
	(symbol
		(lib_id "LEGOS:NCx5652")
		(at 90.17 59.69 0)
		(unit 1)
		(exclude_from_sim no)
		(in_bom yes)
		(on_board yes)
		(dnp no)
		(uuid "2b3734ad-32ef-4d20-a9f3-88526111e4ff")
		(property "Reference" "VL_U1"
			(at 96.52 39.37 0)
			(effects
				(font
					(size 1.27 1.27)
				)
			)
		)
		(property "Value" "NCx5652"
			(at 85.09 39.37 0)
			(effects
				(font
					(size 1.27 1.27)
				)
			)
		)
		(property "Footprint" "LEGOS:UDFN-12_3x3mm_P0.5mm"
			(at 60.96 83.82 0)
			(effects
				(font
					(size 1.27 1.27)
				)
				(justify left)
				(hide yes)
			)
		)
		(property "Datasheet" "https://www.mouser.de/datasheet/2/308/1/NCS5652_D-2317288.pdf"
			(at 78.74 86.36 0)
			(effects
				(font
					(size 1.27 1.27)
				)
				(hide yes)
			)
		)
		(property "Description" ""
			(at 90.17 59.69 0)
			(effects
				(font
					(size 1.27 1.27)
				)
				(hide yes)
			)
		)
		(property "Mfr" "NCS5652MUTWG"
			(at 90.17 59.69 0)
			(effects
				(font
					(size 1.27 1.27)
				)
				(hide yes)
			)
		)
		(pin "1"
			(uuid "3656bad5-cec7-4f3c-8341-7141154d816d")
		)
		(pin "10"
			(uuid "b83f85a8-0b74-4419-ab85-4953951c9e11")
		)
		(pin "11"
			(uuid "967b898b-cfb7-48cd-9701-bc681a3e0413")
		)
		(pin "12"
			(uuid "81a9bc3a-ae7d-40b6-9cc8-39fefc39cbfd")
		)
		(pin "13"
			(uuid "e820c3f9-53ba-49d3-a0ac-627de4a06718")
		)
		(pin "2"
			(uuid "4d9de36a-091c-473a-bb7a-f5caae5e135a")
		)
		(pin "3"
			(uuid "7cef6fe7-5d74-4f64-b5ac-d1c69ee3d371")
		)
		(pin "4"
			(uuid "d46f01e3-5c0a-4adc-84a7-8aedec42be2d")
		)
		(pin "5"
			(uuid "77b460ab-a4d9-4c91-8cc4-040cab9f89b5")
		)
		(pin "6"
			(uuid "2025f094-6fa8-483e-b5a9-0f9fd055bc8d")
		)
		(pin "7"
			(uuid "9fca5c2d-eb39-416a-bbc9-3f91bba79cf0")
		)
		(pin "8"
			(uuid "ff11dcc7-6b90-4d9f-a80b-71024651bbce")
		)
		(pin "9"
			(uuid "4a74a925-1f3c-4f37-ad4f-8725a02373d0")
		)
		(instances
			(project ""
				(path "/1cd06601-5f31-4c60-a631-5f52abbac22a/eca0bae5-c70a-4cd0-bded-86b363574270"
					(reference "VL_U1")
					(unit 1)
				)
			)
			(project ""
				(path "/8ca3e20d-bcc7-4c5e-9deb-562dfed9fecb/3965c8e3-f0fc-4cdb-8abb-6c0f973b294f"
					(reference "VL_U1")
					(unit 1)
				)
			)
			(project "house"
				(path "/c550b25f-ec05-46b5-ace8-c62c72299fc2/6e70007e-969b-4aeb-a6e5-d75c865ef30e"
					(reference "VL_U1")
					(unit 1)
				)
			)
			(project ""
				(path "/d3c11c8f-a73d-4211-934b-a6da255728ad/18bbf347-68a5-46f5-910e-3352e0a39732"
					(reference "VL_U1")
					(unit 1)
				)
			)
			(project ""
				(path "/d6d63c7c-d82d-4890-9f75-94cf42dec49c/fe74b7e4-8a65-459a-a8f2-156a180a03ca"
					(reference "VL_U?")
					(unit 1)
				)
			)
		)
	)
	(symbol
		(lib_id "Connector:TestPoint")
		(at 48.26 144.78 180)
		(unit 1)
		(exclude_from_sim no)
		(in_bom yes)
		(on_board yes)
		(dnp no)
		(uuid "3a773e36-7c5d-42cb-8e50-d1551d689170")
		(property "Reference" "VL_TP1"
			(at 48.26 149.86 0)
			(effects
				(font
					(size 1 1)
				)
				(justify bottom)
			)
		)
		(property "Value" "TestPoint"
			(at 48.26 148.59 0)
			(effects
				(font
					(size 1 1)
				)
				(justify bottom)
			)
		)
		(property "Footprint" "TestPoint:TestPoint_Pad_D2.0mm"
			(at 43.18 144.78 0)
			(effects
				(font
					(size 1.27 1.27)
				)
				(hide yes)
			)
		)
		(property "Datasheet" "~"
			(at 43.18 144.78 0)
			(effects
				(font
					(size 1.27 1.27)
				)
				(hide yes)
			)
		)
		(property "Description" ""
			(at 48.26 144.78 0)
			(effects
				(font
					(size 1.27 1.27)
				)
				(hide yes)
			)
		)
		(pin "1"
			(uuid "1a0996f6-cdbd-4507-a04c-d773eee262f4")
		)
		(instances
			(project ""
				(path "/1cd06601-5f31-4c60-a631-5f52abbac22a/eca0bae5-c70a-4cd0-bded-86b363574270"
					(reference "VL_TP1")
					(unit 1)
				)
			)
			(project ""
				(path "/8ca3e20d-bcc7-4c5e-9deb-562dfed9fecb/3965c8e3-f0fc-4cdb-8abb-6c0f973b294f"
					(reference "VL_TP1")
					(unit 1)
				)
			)
			(project "house"
				(path "/c550b25f-ec05-46b5-ace8-c62c72299fc2/6e70007e-969b-4aeb-a6e5-d75c865ef30e"
					(reference "VL_TP1")
					(unit 1)
				)
			)
			(project ""
				(path "/d3c11c8f-a73d-4211-934b-a6da255728ad/18bbf347-68a5-46f5-910e-3352e0a39732"
					(reference "VL_TP1")
					(unit 1)
				)
			)
			(project ""
				(path "/d6d63c7c-d82d-4890-9f75-94cf42dec49c/fe74b7e4-8a65-459a-a8f2-156a180a03ca"
					(reference "VL_TP?")
					(unit 1)
				)
			)
		)
	)
	(symbol
		(lib_id "Device:C_Small")
		(at 107.95 55.88 180)
		(unit 1)
		(exclude_from_sim no)
		(in_bom yes)
		(on_board yes)
		(dnp no)
		(uuid "443f52cd-8d8b-4fc2-9437-0117113a67da")
		(property "Reference" "VL_C1"
			(at 110.49 55.88 0)
			(effects
				(font
					(size 0.9906 0.9906)
				)
				(justify right top)
			)
		)
		(property "Value" "100nF 50V 10% 0805"
			(at 110.49 57.15 0)
			(effects
				(font
					(size 0.9906 0.9906)
				)
				(justify right top)
			)
		)
		(property "Footprint" "Capacitor_SMD:C_0805_2012Metric"
			(at 107.95 55.88 0)
			(effects
				(font
					(size 1.27 1.27)
				)
				(hide yes)
			)
		)
		(property "Datasheet" "https://www.mouser.de/datasheet/2/585/MLCC-1837944.pdf"
			(at 107.95 55.88 0)
			(effects
				(font
					(size 1.27 1.27)
				)
				(hide yes)
			)
		)
		(property "Description" ""
			(at 107.95 55.88 0)
			(effects
				(font
					(size 1.27 1.27)
				)
				(hide yes)
			)
		)
		(property "Mfr" "CL21B104KBFNNNG"
			(at 110.49 58.42 0)
			(effects
				(font
					(size 1 1)
				)
				(justify right top)
			)
		)
		(pin "1"
			(uuid "451a06f9-27f8-4179-ae02-11a3792e3a22")
		)
		(pin "2"
			(uuid "f2b6404b-a0e6-45d6-9a16-a3a799ef968d")
		)
		(instances
			(project ""
				(path "/1cd06601-5f31-4c60-a631-5f52abbac22a/eca0bae5-c70a-4cd0-bded-86b363574270"
					(reference "VL_C1")
					(unit 1)
				)
			)
			(project ""
				(path "/8ca3e20d-bcc7-4c5e-9deb-562dfed9fecb/3965c8e3-f0fc-4cdb-8abb-6c0f973b294f"
					(reference "VL_C1")
					(unit 1)
				)
			)
			(project "house"
				(path "/c550b25f-ec05-46b5-ace8-c62c72299fc2/6e70007e-969b-4aeb-a6e5-d75c865ef30e"
					(reference "VL_C2")
					(unit 1)
				)
			)
			(project ""
				(path "/d3c11c8f-a73d-4211-934b-a6da255728ad/18bbf347-68a5-46f5-910e-3352e0a39732"
					(reference "VL_C2")
					(unit 1)
				)
			)
			(project ""
				(path "/d6d63c7c-d82d-4890-9f75-94cf42dec49c/fe74b7e4-8a65-459a-a8f2-156a180a03ca"
					(reference "VL_C?")
					(unit 1)
				)
			)
		)
	)
	(symbol
		(lib_id "Device:R_Small")
		(at 129.54 71.12 0)
		(mirror x)
		(unit 1)
		(exclude_from_sim no)
		(in_bom yes)
		(on_board yes)
		(dnp no)
		(uuid "44dcd9ef-5883-4ba0-b1db-967c13ebe388")
		(property "Reference" "VL_R3"
			(at 130.81 71.12 0)
			(effects
				(font
					(size 0.9906 0.9906)
				)
				(justify left top)
			)
		)
		(property "Value" "7.5Ohm 2W 1% 2512"
			(at 130.81 72.39 0)
			(effects
				(font
					(size 0.9906 0.9906)
				)
				(justify left top)
			)
		)
		(property "Footprint" "Resistor_SMD:R_2512_6332Metric_Pad1.40x3.35mm_HandSolder"
			(at 129.54 71.12 0)
			(effects
				(font
					(size 1.27 1.27)
				)
				(hide yes)
			)
		)
		(property "Datasheet" "https://www.mouser.de/datasheet/2/447/PYu_RC_Group_51_RoHS_L_11-1984063.pdf"
			(at 129.54 71.12 0)
			(effects
				(font
					(size 1.27 1.27)
				)
				(hide yes)
			)
		)
		(property "Description" ""
			(at 129.54 71.12 0)
			(effects
				(font
					(size 1.27 1.27)
				)
				(hide yes)
			)
		)
		(property "Mfr" "RC2512FK-7W7R5L"
			(at 130.81 73.66 0)
			(effects
				(font
					(size 1 1)
				)
				(justify left top)
			)
		)
		(pin "1"
			(uuid "0765ae49-ce48-418c-9aa3-20aabfd4f54f")
		)
		(pin "2"
			(uuid "2f7ecdf8-5e7f-42fd-831b-e6560194e4e5")
		)
		(instances
			(project ""
				(path "/1cd06601-5f31-4c60-a631-5f52abbac22a/eca0bae5-c70a-4cd0-bded-86b363574270"
					(reference "VL_R3")
					(unit 1)
				)
			)
			(project ""
				(path "/8ca3e20d-bcc7-4c5e-9deb-562dfed9fecb/3965c8e3-f0fc-4cdb-8abb-6c0f973b294f"
					(reference "VL_R3")
					(unit 1)
				)
			)
			(project "house"
				(path "/c550b25f-ec05-46b5-ace8-c62c72299fc2/6e70007e-969b-4aeb-a6e5-d75c865ef30e"
					(reference "VL_R7")
					(unit 1)
				)
			)
			(project ""
				(path "/d3c11c8f-a73d-4211-934b-a6da255728ad/18bbf347-68a5-46f5-910e-3352e0a39732"
					(reference "VL_R7")
					(unit 1)
				)
			)
			(project ""
				(path "/d6d63c7c-d82d-4890-9f75-94cf42dec49c/fe74b7e4-8a65-459a-a8f2-156a180a03ca"
					(reference "VL_R?")
					(unit 1)
				)
			)
		)
	)
	(symbol
		(lib_id "Device:R_Small")
		(at 129.54 55.88 0)
		(mirror x)
		(unit 1)
		(exclude_from_sim no)
		(in_bom yes)
		(on_board yes)
		(dnp no)
		(uuid "58bdba25-12a9-4d09-8ce9-776b8f05c779")
		(property "Reference" "VL_R2"
			(at 130.81 55.88 0)
			(effects
				(font
					(size 0.9906 0.9906)
				)
				(justify left top)
			)
		)
		(property "Value" "7.5Ohm 2W 1% 2512"
			(at 130.81 57.15 0)
			(effects
				(font
					(size 0.9906 0.9906)
				)
				(justify left top)
			)
		)
		(property "Footprint" "Resistor_SMD:R_2512_6332Metric_Pad1.40x3.35mm_HandSolder"
			(at 129.54 55.88 0)
			(effects
				(font
					(size 1.27 1.27)
				)
				(hide yes)
			)
		)
		(property "Datasheet" "https://www.mouser.de/datasheet/2/447/PYu_RC_Group_51_RoHS_L_11-1984063.pdf"
			(at 129.54 55.88 0)
			(effects
				(font
					(size 1.27 1.27)
				)
				(hide yes)
			)
		)
		(property "Description" ""
			(at 129.54 55.88 0)
			(effects
				(font
					(size 1.27 1.27)
				)
				(hide yes)
			)
		)
		(property "Mfr" "RC2512FK-7W7R5L"
			(at 130.81 58.42 0)
			(effects
				(font
					(size 1 1)
				)
				(justify left top)
			)
		)
		(pin "1"
			(uuid "00d36d35-1017-4c83-9f8a-93c9f0c5a4bd")
		)
		(pin "2"
			(uuid "2acaa014-44b3-445e-9eba-68415d8adab5")
		)
		(instances
			(project ""
				(path "/1cd06601-5f31-4c60-a631-5f52abbac22a/eca0bae5-c70a-4cd0-bded-86b363574270"
					(reference "VL_R2")
					(unit 1)
				)
			)
			(project ""
				(path "/8ca3e20d-bcc7-4c5e-9deb-562dfed9fecb/3965c8e3-f0fc-4cdb-8abb-6c0f973b294f"
					(reference "VL_R2")
					(unit 1)
				)
			)
			(project "house"
				(path "/c550b25f-ec05-46b5-ace8-c62c72299fc2/6e70007e-969b-4aeb-a6e5-d75c865ef30e"
					(reference "VL_R6")
					(unit 1)
				)
			)
			(project ""
				(path "/d3c11c8f-a73d-4211-934b-a6da255728ad/18bbf347-68a5-46f5-910e-3352e0a39732"
					(reference "VL_R6")
					(unit 1)
				)
			)
			(project ""
				(path "/d6d63c7c-d82d-4890-9f75-94cf42dec49c/fe74b7e4-8a65-459a-a8f2-156a180a03ca"
					(reference "VL_R?")
					(unit 1)
				)
			)
		)
	)
	(symbol
		(lib_id "Connector:TestPoint")
		(at 132.08 66.04 270)
		(unit 1)
		(exclude_from_sim no)
		(in_bom yes)
		(on_board yes)
		(dnp no)
		(fields_autoplaced yes)
		(uuid "5f836220-4506-4c2b-8490-f59ed334f8f1")
		(property "Reference" "VL_TP4"
			(at 137.16 64.7699 90)
			(effects
				(font
					(size 1.27 1.27)
				)
				(justify left)
			)
		)
		(property "Value" "TestPoint"
			(at 137.16 67.3099 90)
			(effects
				(font
					(size 1.27 1.27)
				)
				(justify left)
			)
		)
		(property "Footprint" "TestPoint:TestPoint_Pad_D2.0mm"
			(at 132.08 71.12 0)
			(effects
				(font
					(size 1.27 1.27)
				)
				(hide yes)
			)
		)
		(property "Datasheet" "~"
			(at 132.08 71.12 0)
			(effects
				(font
					(size 1.27 1.27)
				)
				(hide yes)
			)
		)
		(property "Description" ""
			(at 132.08 66.04 0)
			(effects
				(font
					(size 1.27 1.27)
				)
				(hide yes)
			)
		)
		(pin "1"
			(uuid "e59549f2-3db0-45ec-9249-287e80d0e382")
		)
		(instances
			(project ""
				(path "/1cd06601-5f31-4c60-a631-5f52abbac22a/eca0bae5-c70a-4cd0-bded-86b363574270"
					(reference "VL_TP4")
					(unit 1)
				)
			)
			(project ""
				(path "/8ca3e20d-bcc7-4c5e-9deb-562dfed9fecb/3965c8e3-f0fc-4cdb-8abb-6c0f973b294f"
					(reference "VL_TP4")
					(unit 1)
				)
			)
			(project "house"
				(path "/c550b25f-ec05-46b5-ace8-c62c72299fc2/6e70007e-969b-4aeb-a6e5-d75c865ef30e"
					(reference "VL_TP4")
					(unit 1)
				)
			)
			(project ""
				(path "/d3c11c8f-a73d-4211-934b-a6da255728ad/18bbf347-68a5-46f5-910e-3352e0a39732"
					(reference "VL_TP4")
					(unit 1)
				)
			)
			(project ""
				(path "/d6d63c7c-d82d-4890-9f75-94cf42dec49c/fe74b7e4-8a65-459a-a8f2-156a180a03ca"
					(reference "VL_TP?")
					(unit 1)
				)
			)
		)
	)
	(symbol
		(lib_id "Device:C_Small")
		(at 107.95 71.12 180)
		(unit 1)
		(exclude_from_sim no)
		(in_bom yes)
		(on_board yes)
		(dnp no)
		(uuid "8eff6397-4ca1-4ae5-be55-43585c97b7e0")
		(property "Reference" "VL_C2"
			(at 110.49 71.12 0)
			(effects
				(font
					(size 0.9906 0.9906)
				)
				(justify right top)
			)
		)
		(property "Value" "100nF 50V 10% 0805"
			(at 110.49 72.39 0)
			(effects
				(font
					(size 0.9906 0.9906)
				)
				(justify right top)
			)
		)
		(property "Footprint" "Capacitor_SMD:C_0805_2012Metric"
			(at 107.95 71.12 0)
			(effects
				(font
					(size 1.27 1.27)
				)
				(hide yes)
			)
		)
		(property "Datasheet" "https://www.mouser.de/datasheet/2/585/MLCC-1837944.pdf"
			(at 107.95 71.12 0)
			(effects
				(font
					(size 1.27 1.27)
				)
				(hide yes)
			)
		)
		(property "Description" ""
			(at 107.95 71.12 0)
			(effects
				(font
					(size 1.27 1.27)
				)
				(hide yes)
			)
		)
		(property "Mfr" "CL21B104KBFNNNG"
			(at 110.49 73.66 0)
			(effects
				(font
					(size 1 1)
				)
				(justify right top)
			)
		)
		(pin "1"
			(uuid "2eb7406f-a75a-4451-ab1e-0036db16bd59")
		)
		(pin "2"
			(uuid "b4c4e5cf-a227-400a-85ff-c0e8490dd4d4")
		)
		(instances
			(project ""
				(path "/1cd06601-5f31-4c60-a631-5f52abbac22a/eca0bae5-c70a-4cd0-bded-86b363574270"
					(reference "VL_C2")
					(unit 1)
				)
			)
			(project ""
				(path "/8ca3e20d-bcc7-4c5e-9deb-562dfed9fecb/3965c8e3-f0fc-4cdb-8abb-6c0f973b294f"
					(reference "VL_C2")
					(unit 1)
				)
			)
			(project "house"
				(path "/c550b25f-ec05-46b5-ace8-c62c72299fc2/6e70007e-969b-4aeb-a6e5-d75c865ef30e"
					(reference "VL_C3")
					(unit 1)
				)
			)
			(project ""
				(path "/d3c11c8f-a73d-4211-934b-a6da255728ad/18bbf347-68a5-46f5-910e-3352e0a39732"
					(reference "VL_C3")
					(unit 1)
				)
			)
			(project ""
				(path "/d6d63c7c-d82d-4890-9f75-94cf42dec49c/fe74b7e4-8a65-459a-a8f2-156a180a03ca"
					(reference "VL_C?")
					(unit 1)
				)
			)
		)
	)
	(symbol
		(lib_id "Connector:TestPoint")
		(at 132.08 50.8 270)
		(unit 1)
		(exclude_from_sim no)
		(in_bom yes)
		(on_board yes)
		(dnp no)
		(fields_autoplaced yes)
		(uuid "9ce7026a-f8d1-43ae-8518-a9b7497c68b2")
		(property "Reference" "VL_TP3"
			(at 137.16 49.5299 90)
			(effects
				(font
					(size 1.27 1.27)
				)
				(justify left)
			)
		)
		(property "Value" "TestPoint"
			(at 137.16 52.0699 90)
			(effects
				(font
					(size 1.27 1.27)
				)
				(justify left)
			)
		)
		(property "Footprint" "TestPoint:TestPoint_Pad_D2.0mm"
			(at 132.08 55.88 0)
			(effects
				(font
					(size 1.27 1.27)
				)
				(hide yes)
			)
		)
		(property "Datasheet" "~"
			(at 132.08 55.88 0)
			(effects
				(font
					(size 1.27 1.27)
				)
				(hide yes)
			)
		)
		(property "Description" ""
			(at 132.08 50.8 0)
			(effects
				(font
					(size 1.27 1.27)
				)
				(hide yes)
			)
		)
		(pin "1"
			(uuid "0efed12d-6784-4c29-8c4d-a0e10928ccbc")
		)
		(instances
			(project ""
				(path "/1cd06601-5f31-4c60-a631-5f52abbac22a/eca0bae5-c70a-4cd0-bded-86b363574270"
					(reference "VL_TP3")
					(unit 1)
				)
			)
			(project ""
				(path "/8ca3e20d-bcc7-4c5e-9deb-562dfed9fecb/3965c8e3-f0fc-4cdb-8abb-6c0f973b294f"
					(reference "VL_TP3")
					(unit 1)
				)
			)
			(project "house"
				(path "/c550b25f-ec05-46b5-ace8-c62c72299fc2/6e70007e-969b-4aeb-a6e5-d75c865ef30e"
					(reference "VL_TP3")
					(unit 1)
				)
			)
			(project ""
				(path "/d3c11c8f-a73d-4211-934b-a6da255728ad/18bbf347-68a5-46f5-910e-3352e0a39732"
					(reference "VL_TP3")
					(unit 1)
				)
			)
			(project ""
				(path "/d6d63c7c-d82d-4890-9f75-94cf42dec49c/fe74b7e4-8a65-459a-a8f2-156a180a03ca"
					(reference "VL_TP?")
					(unit 1)
				)
			)
		)
	)
	(symbol
		(lib_id "Device:R_Small")
		(at 53.34 142.24 270)
		(mirror x)
		(unit 1)
		(exclude_from_sim no)
		(in_bom yes)
		(on_board yes)
		(dnp no)
		(uuid "a0f18e79-c173-4d23-b78e-ae323164e1f9")
		(property "Reference" "VL_R5"
			(at 53.34 140.97 0)
			(effects
				(font
					(size 0.9906 0.9906)
				)
				(justify left bottom)
			)
		)
		(property "Value" "10kOhm 1/8W 1% 0805"
			(at 52.07 140.97 0)
			(effects
				(font
					(size 0.9906 0.9906)
				)
				(justify left bottom)
			)
		)
		(property "Footprint" "Resistor_SMD:R_0805_2012Metric"
			(at 53.34 142.24 0)
			(effects
				(font
					(size 1.27 1.27)
				)
				(hide yes)
			)
		)
		(property "Datasheet" "https://www.mouser.de/datasheet/2/427/crcwce3-1762584.pdf"
			(at 53.34 142.24 0)
			(effects
				(font
					(size 1.27 1.27)
				)
				(hide yes)
			)
		)
		(property "Description" ""
			(at 53.34 142.24 0)
			(effects
				(font
					(size 1.27 1.27)
				)
				(hide yes)
			)
		)
		(property "Mfr" "CRCW080510K0FKEAC"
			(at 50.8 140.97 0)
			(effects
				(font
					(size 1 1)
				)
				(justify left bottom)
			)
		)
		(pin "1"
			(uuid "3fe6ea06-7f6d-4861-b3b7-b15972d75689")
		)
		(pin "2"
			(uuid "8a408d2b-8abd-4b09-baaa-49c064f48a2a")
		)
		(instances
			(project ""
				(path "/1cd06601-5f31-4c60-a631-5f52abbac22a/eca0bae5-c70a-4cd0-bded-86b363574270"
					(reference "VL_R5")
					(unit 1)
				)
			)
			(project ""
				(path "/8ca3e20d-bcc7-4c5e-9deb-562dfed9fecb/3965c8e3-f0fc-4cdb-8abb-6c0f973b294f"
					(reference "VL_R5")
					(unit 1)
				)
			)
			(project "house"
				(path "/c550b25f-ec05-46b5-ace8-c62c72299fc2/6e70007e-969b-4aeb-a6e5-d75c865ef30e"
					(reference "VL_R1")
					(unit 1)
				)
			)
			(project ""
				(path "/d3c11c8f-a73d-4211-934b-a6da255728ad/18bbf347-68a5-46f5-910e-3352e0a39732"
					(reference "VL_R1")
					(unit 1)
				)
			)
			(project ""
				(path "/d6d63c7c-d82d-4890-9f75-94cf42dec49c/fe74b7e4-8a65-459a-a8f2-156a180a03ca"
					(reference "VL_R?")
					(unit 1)
				)
			)
		)
	)
	(symbol
		(lib_id "Device:R_Small")
		(at 102.87 81.28 0)
		(unit 1)
		(exclude_from_sim no)
		(in_bom yes)
		(on_board yes)
		(dnp no)
		(uuid "a52c1f08-270c-478f-b615-4c913076553e")
		(property "Reference" "VL_R4"
			(at 104.14 81.28 0)
			(effects
				(font
					(size 0.9906 0.9906)
				)
				(justify left bottom)
			)
		)
		(property "Value" "10kOhm 1/8W 1% 0805"
			(at 104.14 82.55 0)
			(effects
				(font
					(size 0.9906 0.9906)
				)
				(justify left bottom)
			)
		)
		(property "Footprint" "Resistor_SMD:R_0805_2012Metric"
			(at 102.87 81.28 0)
			(effects
				(font
					(size 1.27 1.27)
				)
				(hide yes)
			)
		)
		(property "Datasheet" "https://www.mouser.de/datasheet/2/427/crcwce3-1762584.pdf"
			(at 102.87 81.28 0)
			(effects
				(font
					(size 1.27 1.27)
				)
				(hide yes)
			)
		)
		(property "Description" ""
			(at 102.87 81.28 0)
			(effects
				(font
					(size 1.27 1.27)
				)
				(hide yes)
			)
		)
		(property "Mfr" "CRCW080510K0FKEAC"
			(at 104.14 83.82 0)
			(effects
				(font
					(size 1 1)
				)
				(justify left bottom)
			)
		)
		(pin "1"
			(uuid "b9dbe4d4-da1f-4d86-9464-7f77ed4e5adf")
		)
		(pin "2"
			(uuid "2d7ca0a5-2275-4b3c-b8d1-10609922f28b")
		)
		(instances
			(project ""
				(path "/1cd06601-5f31-4c60-a631-5f52abbac22a/eca0bae5-c70a-4cd0-bded-86b363574270"
					(reference "VL_R4")
					(unit 1)
				)
			)
			(project ""
				(path "/8ca3e20d-bcc7-4c5e-9deb-562dfed9fecb/3965c8e3-f0fc-4cdb-8abb-6c0f973b294f"
					(reference "VL_R4")
					(unit 1)
				)
			)
			(project "house"
				(path "/c550b25f-ec05-46b5-ace8-c62c72299fc2/6e70007e-969b-4aeb-a6e5-d75c865ef30e"
					(reference "VL_R5")
					(unit 1)
				)
			)
			(project ""
				(path "/d3c11c8f-a73d-4211-934b-a6da255728ad/18bbf347-68a5-46f5-910e-3352e0a39732"
					(reference "VL_R5")
					(unit 1)
				)
			)
			(project ""
				(path "/d6d63c7c-d82d-4890-9f75-94cf42dec49c/fe74b7e4-8a65-459a-a8f2-156a180a03ca"
					(reference "VL_R?")
					(unit 1)
				)
			)
		)
	)
	(symbol
		(lib_id "Connector:TestPoint")
		(at 62.23 66.04 0)
		(mirror x)
		(unit 1)
		(exclude_from_sim no)
		(in_bom yes)
		(on_board yes)
		(dnp no)
		(fields_autoplaced yes)
		(uuid "ad0243e8-28ff-4afa-b165-8cbe89f1f883")
		(property "Reference" "VL_TP2"
			(at 59.69 68.0719 0)
			(effects
				(font
					(size 1.27 1.27)
				)
				(justify right)
			)
		)
		(property "Value" "TestPoint"
			(at 59.69 70.6119 0)
			(effects
				(font
					(size 1.27 1.27)
				)
				(justify right)
			)
		)
		(property "Footprint" "TestPoint:TestPoint_Pad_D2.0mm"
			(at 67.31 66.04 0)
			(effects
				(font
					(size 1.27 1.27)
				)
				(hide yes)
			)
		)
		(property "Datasheet" "~"
			(at 67.31 66.04 0)
			(effects
				(font
					(size 1.27 1.27)
				)
				(hide yes)
			)
		)
		(property "Description" ""
			(at 62.23 66.04 0)
			(effects
				(font
					(size 1.27 1.27)
				)
				(hide yes)
			)
		)
		(pin "1"
			(uuid "1962352c-6782-47a4-9cb8-b1d01f62a8f0")
		)
		(instances
			(project ""
				(path "/1cd06601-5f31-4c60-a631-5f52abbac22a/eca0bae5-c70a-4cd0-bded-86b363574270"
					(reference "VL_TP2")
					(unit 1)
				)
			)
			(project ""
				(path "/8ca3e20d-bcc7-4c5e-9deb-562dfed9fecb/3965c8e3-f0fc-4cdb-8abb-6c0f973b294f"
					(reference "VL_TP2")
					(unit 1)
				)
			)
			(project "house"
				(path "/c550b25f-ec05-46b5-ace8-c62c72299fc2/6e70007e-969b-4aeb-a6e5-d75c865ef30e"
					(reference "VL_TP2")
					(unit 1)
				)
			)
			(project ""
				(path "/d3c11c8f-a73d-4211-934b-a6da255728ad/18bbf347-68a5-46f5-910e-3352e0a39732"
					(reference "VL_TP2")
					(unit 1)
				)
			)
			(project ""
				(path "/d6d63c7c-d82d-4890-9f75-94cf42dec49c/fe74b7e4-8a65-459a-a8f2-156a180a03ca"
					(reference "VL_TP?")
					(unit 1)
				)
			)
		)
	)
	(symbol
		(lib_id "Device:C_Small")
		(at 83.82 147.32 180)
		(unit 1)
		(exclude_from_sim no)
		(in_bom yes)
		(on_board yes)
		(dnp no)
		(uuid "b07d2bfc-e976-4fa0-bf80-2eb3bef1c5ed")
		(property "Reference" "VL_C3"
			(at 86.36 147.32 0)
			(effects
				(font
					(size 0.9906 0.9906)
				)
				(justify right top)
			)
		)
		(property "Value" "100nF 50V 10% 0805"
			(at 86.36 148.59 0)
			(effects
				(font
					(size 0.9906 0.9906)
				)
				(justify right top)
			)
		)
		(property "Footprint" "Capacitor_SMD:C_0805_2012Metric"
			(at 83.82 147.32 0)
			(effects
				(font
					(size 1.27 1.27)
				)
				(hide yes)
			)
		)
		(property "Datasheet" "https://www.mouser.de/datasheet/2/585/MLCC-1837944.pdf"
			(at 83.82 147.32 0)
			(effects
				(font
					(size 1.27 1.27)
				)
				(hide yes)
			)
		)
		(property "Description" ""
			(at 83.82 147.32 0)
			(effects
				(font
					(size 1.27 1.27)
				)
				(hide yes)
			)
		)
		(property "Mfr" "CL21B104KBFNNNG"
			(at 86.36 149.86 0)
			(effects
				(font
					(size 1 1)
				)
				(justify right top)
			)
		)
		(pin "1"
			(uuid "08115f84-567a-45e5-acbc-3b111bf60a88")
		)
		(pin "2"
			(uuid "e651c99b-2aa5-458c-8845-89616ae06d53")
		)
		(instances
			(project ""
				(path "/1cd06601-5f31-4c60-a631-5f52abbac22a/eca0bae5-c70a-4cd0-bded-86b363574270"
					(reference "VL_C3")
					(unit 1)
				)
			)
			(project ""
				(path "/8ca3e20d-bcc7-4c5e-9deb-562dfed9fecb/3965c8e3-f0fc-4cdb-8abb-6c0f973b294f"
					(reference "VL_C3")
					(unit 1)
				)
			)
			(project "house"
				(path "/c550b25f-ec05-46b5-ace8-c62c72299fc2/6e70007e-969b-4aeb-a6e5-d75c865ef30e"
					(reference "VL_C1")
					(unit 1)
				)
			)
			(project ""
				(path "/d3c11c8f-a73d-4211-934b-a6da255728ad/18bbf347-68a5-46f5-910e-3352e0a39732"
					(reference "VL_C1")
					(unit 1)
				)
			)
			(project ""
				(path "/d6d63c7c-d82d-4890-9f75-94cf42dec49c/fe74b7e4-8a65-459a-a8f2-156a180a03ca"
					(reference "VL_C?")
					(unit 1)
				)
			)
		)
	)
	(symbol
		(lib_id "Device:C_Small")
		(at 124.46 139.7 180)
		(unit 1)
		(exclude_from_sim no)
		(in_bom yes)
		(on_board yes)
		(dnp no)
		(uuid "d6dcd30e-655c-4852-ae57-f98fee155bb2")
		(property "Reference" "VL_C4"
			(at 127 139.7 0)
			(effects
				(font
					(size 0.9906 0.9906)
				)
				(justify right top)
			)
		)
		(property "Value" "1uF 50V 10% 0805"
			(at 127 140.97 0)
			(effects
				(font
					(size 0.9906 0.9906)
				)
				(justify right top)
			)
		)
		(property "Footprint" "Capacitor_SMD:C_0805_2012Metric"
			(at 124.46 139.7 0)
			(effects
				(font
					(size 1.27 1.27)
				)
				(hide yes)
			)
		)
		(property "Datasheet" "https://www.mouser.de/datasheet/2/585/MLCC-1837944.pdf"
			(at 124.46 139.7 0)
			(effects
				(font
					(size 1.27 1.27)
				)
				(hide yes)
			)
		)
		(property "Description" ""
			(at 124.46 139.7 0)
			(effects
				(font
					(size 1.27 1.27)
				)
				(hide yes)
			)
		)
		(property "Mfr" "CL21B105KBFNNNG"
			(at 127 142.24 0)
			(effects
				(font
					(size 1 1)
				)
				(justify right top)
			)
		)
		(pin "1"
			(uuid "721b7a34-7b53-43f2-832c-68d710aa7298")
		)
		(pin "2"
			(uuid "1702497a-d49f-4f9e-8804-2b43bad0f7e6")
		)
		(instances
			(project ""
				(path "/1cd06601-5f31-4c60-a631-5f52abbac22a/eca0bae5-c70a-4cd0-bded-86b363574270"
					(reference "VL_C4")
					(unit 1)
				)
			)
			(project ""
				(path "/8ca3e20d-bcc7-4c5e-9deb-562dfed9fecb/3965c8e3-f0fc-4cdb-8abb-6c0f973b294f"
					(reference "VL_C4")
					(unit 1)
				)
			)
			(project "house"
				(path "/c550b25f-ec05-46b5-ace8-c62c72299fc2/6e70007e-969b-4aeb-a6e5-d75c865ef30e"
					(reference "VL_C4")
					(unit 1)
				)
			)
			(project ""
				(path "/d3c11c8f-a73d-4211-934b-a6da255728ad/18bbf347-68a5-46f5-910e-3352e0a39732"
					(reference "VL_C4")
					(unit 1)
				)
			)
			(project ""
				(path "/d6d63c7c-d82d-4890-9f75-94cf42dec49c/fe74b7e4-8a65-459a-a8f2-156a180a03ca"
					(reference "VL_C?")
					(unit 1)
				)
			)
		)
	)
	(symbol
		(lib_id "Device:R_Small")
		(at 184.15 83.82 0)
		(mirror y)
		(unit 1)
		(exclude_from_sim no)
		(in_bom yes)
		(on_board yes)
		(dnp no)
		(uuid "dce3be69-f421-4b26-8d26-da10c39416ad")
		(property "Reference" "VL_R8"
			(at 182.88 83.82 0)
			(effects
				(font
					(size 0.9906 0.9906)
				)
				(justify left bottom)
			)
		)
		(property "Value" "10kOhm 1/8W 1% 0805"
			(at 182.88 85.09 0)
			(effects
				(font
					(size 0.9906 0.9906)
				)
				(justify left bottom)
			)
		)
		(property "Footprint" "Resistor_SMD:R_0805_2012Metric"
			(at 184.15 83.82 0)
			(effects
				(font
					(size 1.27 1.27)
				)
				(hide yes)
			)
		)
		(property "Datasheet" "https://www.mouser.de/datasheet/2/427/crcwce3-1762584.pdf"
			(at 184.15 83.82 0)
			(effects
				(font
					(size 1.27 1.27)
				)
				(hide yes)
			)
		)
		(property "Description" ""
			(at 184.15 83.82 0)
			(effects
				(font
					(size 1.27 1.27)
				)
				(hide yes)
			)
		)
		(property "Mfr" "CRCW080510K0FKEAC"
			(at 182.88 86.36 0)
			(effects
				(font
					(size 1 1)
				)
				(justify left bottom)
			)
		)
		(pin "1"
			(uuid "ea8c7380-cf20-495b-89d4-e8327d8df0e2")
		)
		(pin "2"
			(uuid "e880f853-ee99-4b2d-93ed-efbbcfae65fe")
		)
		(instances
			(project ""
				(path "/1cd06601-5f31-4c60-a631-5f52abbac22a/eca0bae5-c70a-4cd0-bded-86b363574270"
					(reference "VL_R8")
					(unit 1)
				)
			)
			(project ""
				(path "/8ca3e20d-bcc7-4c5e-9deb-562dfed9fecb/3965c8e3-f0fc-4cdb-8abb-6c0f973b294f"
					(reference "VL_R8")
					(unit 1)
				)
			)
			(project "house"
				(path "/c550b25f-ec05-46b5-ace8-c62c72299fc2/6e70007e-969b-4aeb-a6e5-d75c865ef30e"
					(reference "VL_R8")
					(unit 1)
				)
			)
			(project ""
				(path "/d3c11c8f-a73d-4211-934b-a6da255728ad/18bbf347-68a5-46f5-910e-3352e0a39732"
					(reference "VL_R8")
					(unit 1)
				)
			)
			(project ""
				(path "/d6d63c7c-d82d-4890-9f75-94cf42dec49c/fe74b7e4-8a65-459a-a8f2-156a180a03ca"
					(reference "VL_R?")
					(unit 1)
				)
			)
		)
	)
	(symbol
		(lib_id "Device:C_Small")
		(at 144.78 139.7 180)
		(unit 1)
		(exclude_from_sim no)
		(in_bom yes)
		(on_board yes)
		(dnp no)
		(uuid "e53f9354-e114-465e-8f9d-25cd86d8a3af")
		(property "Reference" "VL_C5"
			(at 147.32 139.7 0)
			(effects
				(font
					(size 0.9906 0.9906)
				)
				(justify right top)
			)
		)
		(property "Value" "1uF 50V 10% 0805"
			(at 147.32 140.97 0)
			(effects
				(font
					(size 0.9906 0.9906)
				)
				(justify right top)
			)
		)
		(property "Footprint" "Capacitor_SMD:C_0805_2012Metric"
			(at 144.78 139.7 0)
			(effects
				(font
					(size 1.27 1.27)
				)
				(hide yes)
			)
		)
		(property "Datasheet" "https://www.mouser.de/datasheet/2/585/MLCC-1837944.pdf"
			(at 144.78 139.7 0)
			(effects
				(font
					(size 1.27 1.27)
				)
				(hide yes)
			)
		)
		(property "Description" ""
			(at 144.78 139.7 0)
			(effects
				(font
					(size 1.27 1.27)
				)
				(hide yes)
			)
		)
		(property "Mfr" "CL21B105KBFNNNG"
			(at 147.32 142.24 0)
			(effects
				(font
					(size 1 1)
				)
				(justify right top)
			)
		)
		(pin "1"
			(uuid "79af802e-ae91-4a8e-a000-b24868acd870")
		)
		(pin "2"
			(uuid "72b96353-8975-47dc-b7ef-13b871bf27a9")
		)
		(instances
			(project ""
				(path "/1cd06601-5f31-4c60-a631-5f52abbac22a/eca0bae5-c70a-4cd0-bded-86b363574270"
					(reference "VL_C5")
					(unit 1)
				)
			)
			(project ""
				(path "/8ca3e20d-bcc7-4c5e-9deb-562dfed9fecb/3965c8e3-f0fc-4cdb-8abb-6c0f973b294f"
					(reference "VL_C5")
					(unit 1)
				)
			)
			(project "house"
				(path "/c550b25f-ec05-46b5-ace8-c62c72299fc2/6e70007e-969b-4aeb-a6e5-d75c865ef30e"
					(reference "VL_C5")
					(unit 1)
				)
			)
			(project ""
				(path "/d3c11c8f-a73d-4211-934b-a6da255728ad/18bbf347-68a5-46f5-910e-3352e0a39732"
					(reference "VL_C5")
					(unit 1)
				)
			)
			(project ""
				(path "/d6d63c7c-d82d-4890-9f75-94cf42dec49c/fe74b7e4-8a65-459a-a8f2-156a180a03ca"
					(reference "VL_C?")
					(unit 1)
				)
			)
		)
	)
	(symbol
		(lib_id "Device:R_Small")
		(at 58.42 147.32 0)
		(unit 1)
		(exclude_from_sim no)
		(in_bom yes)
		(on_board yes)
		(dnp no)
		(uuid "e951d95e-8072-4f7e-bb63-231df0bccee6")
		(property "Reference" "VL_R6"
			(at 59.69 147.32 0)
			(effects
				(font
					(size 0.9906 0.9906)
				)
				(justify left bottom)
			)
		)
		(property "Value" "100kOhm 1/8W 0.5% 0805"
			(at 59.69 148.59 0)
			(effects
				(font
					(size 0.9906 0.9906)
				)
				(justify left bottom)
			)
		)
		(property "Footprint" "Resistor_SMD:R_0805_2012Metric"
			(at 58.42 147.32 0)
			(effects
				(font
					(size 1.27 1.27)
				)
				(hide yes)
			)
		)
		(property "Datasheet" "https://www.mouser.de/datasheet/2/427/dcrcwpe3-1762218.pdf"
			(at 58.42 147.32 0)
			(effects
				(font
					(size 1.27 1.27)
				)
				(hide yes)
			)
		)
		(property "Description" ""
			(at 58.42 147.32 0)
			(effects
				(font
					(size 1.27 1.27)
				)
				(hide yes)
			)
		)
		(property "Mfr" "CRCW0805100KDHEAP"
			(at 59.69 149.86 0)
			(effects
				(font
					(size 1 1)
				)
				(justify left bottom)
			)
		)
		(pin "1"
			(uuid "69c7698f-d1a5-4c1e-bb4e-390a692efc40")
		)
		(pin "2"
			(uuid "69755fff-a04d-4839-b667-0edb545ce707")
		)
		(instances
			(project ""
				(path "/1cd06601-5f31-4c60-a631-5f52abbac22a/eca0bae5-c70a-4cd0-bded-86b363574270"
					(reference "VL_R6")
					(unit 1)
				)
			)
			(project ""
				(path "/8ca3e20d-bcc7-4c5e-9deb-562dfed9fecb/3965c8e3-f0fc-4cdb-8abb-6c0f973b294f"
					(reference "VL_R6")
					(unit 1)
				)
			)
			(project "house"
				(path "/c550b25f-ec05-46b5-ace8-c62c72299fc2/6e70007e-969b-4aeb-a6e5-d75c865ef30e"
					(reference "VL_R2")
					(unit 1)
				)
			)
			(project ""
				(path "/d3c11c8f-a73d-4211-934b-a6da255728ad/18bbf347-68a5-46f5-910e-3352e0a39732"
					(reference "VL_R2")
					(unit 1)
				)
			)
			(project ""
				(path "/d6d63c7c-d82d-4890-9f75-94cf42dec49c/fe74b7e4-8a65-459a-a8f2-156a180a03ca"
					(reference "VL_R?")
					(unit 1)
				)
			)
		)
	)
)
