(kicad_sch
	(version 20231120)
	(generator "eeschema")
	(generator_version "8.0")
	(uuid "baa8f335-6bfc-4b06-9f88-1bd9b36ff7f7")
	(paper "A4")
	(title_block
		(company "Institute for Automation of Complex Power Systems - E.ON ERC - RWTH Aachen University")
		(comment 1 "Designer: C. Guarnieri Calò Carducci, J.Klimt")
	)
	(lib_symbols
		(symbol "Device:C_Small"
			(pin_numbers hide)
			(pin_names
				(offset 0.254) hide)
			(exclude_from_sim no)
			(in_bom yes)
			(on_board yes)
			(property "Reference" "C"
				(at 0.254 1.778 0)
				(effects
					(font
						(size 1.27 1.27)
					)
					(justify left)
				)
			)
			(property "Value" "C_Small"
				(at 0.254 -2.032 0)
				(effects
					(font
						(size 1.27 1.27)
					)
					(justify left)
				)
			)
			(property "Footprint" ""
				(at 0 0 0)
				(effects
					(font
						(size 1.27 1.27)
					)
					(hide yes)
				)
			)
			(property "Datasheet" "~"
				(at 0 0 0)
				(effects
					(font
						(size 1.27 1.27)
					)
					(hide yes)
				)
			)
			(property "Description" "Unpolarized capacitor, small symbol"
				(at 0 0 0)
				(effects
					(font
						(size 1.27 1.27)
					)
					(hide yes)
				)
			)
			(property "ki_keywords" "capacitor cap"
				(at 0 0 0)
				(effects
					(font
						(size 1.27 1.27)
					)
					(hide yes)
				)
			)
			(property "ki_fp_filters" "C_*"
				(at 0 0 0)
				(effects
					(font
						(size 1.27 1.27)
					)
					(hide yes)
				)
			)
			(symbol "C_Small_0_1"
				(polyline
					(pts
						(xy -1.524 -0.508) (xy 1.524 -0.508)
					)
					(stroke
						(width 0.3302)
						(type default)
					)
					(fill
						(type none)
					)
				)
				(polyline
					(pts
						(xy -1.524 0.508) (xy 1.524 0.508)
					)
					(stroke
						(width 0.3048)
						(type default)
					)
					(fill
						(type none)
					)
				)
			)
			(symbol "C_Small_1_1"
				(pin passive line
					(at 0 2.54 270)
					(length 2.032)
					(name "~"
						(effects
							(font
								(size 1.27 1.27)
							)
						)
					)
					(number "1"
						(effects
							(font
								(size 1.27 1.27)
							)
						)
					)
				)
				(pin passive line
					(at 0 -2.54 90)
					(length 2.032)
					(name "~"
						(effects
							(font
								(size 1.27 1.27)
							)
						)
					)
					(number "2"
						(effects
							(font
								(size 1.27 1.27)
							)
						)
					)
				)
			)
		)
		(symbol "Device:LED_Small"
			(pin_numbers hide)
			(pin_names
				(offset 0.254) hide)
			(exclude_from_sim no)
			(in_bom yes)
			(on_board yes)
			(property "Reference" "D"
				(at -1.27 3.175 0)
				(effects
					(font
						(size 1.27 1.27)
					)
					(justify left)
				)
			)
			(property "Value" "LED_Small"
				(at -4.445 -2.54 0)
				(effects
					(font
						(size 1.27 1.27)
					)
					(justify left)
				)
			)
			(property "Footprint" ""
				(at 0 0 90)
				(effects
					(font
						(size 1.27 1.27)
					)
					(hide yes)
				)
			)
			(property "Datasheet" "~"
				(at 0 0 90)
				(effects
					(font
						(size 1.27 1.27)
					)
					(hide yes)
				)
			)
			(property "Description" "Light emitting diode, small symbol"
				(at 0 0 0)
				(effects
					(font
						(size 1.27 1.27)
					)
					(hide yes)
				)
			)
			(property "ki_keywords" "LED diode light-emitting-diode"
				(at 0 0 0)
				(effects
					(font
						(size 1.27 1.27)
					)
					(hide yes)
				)
			)
			(property "ki_fp_filters" "LED* LED_SMD:* LED_THT:*"
				(at 0 0 0)
				(effects
					(font
						(size 1.27 1.27)
					)
					(hide yes)
				)
			)
			(symbol "LED_Small_0_1"
				(polyline
					(pts
						(xy -0.762 -1.016) (xy -0.762 1.016)
					)
					(stroke
						(width 0.254)
						(type default)
					)
					(fill
						(type none)
					)
				)
				(polyline
					(pts
						(xy 1.016 0) (xy -0.762 0)
					)
					(stroke
						(width 0)
						(type default)
					)
					(fill
						(type none)
					)
				)
				(polyline
					(pts
						(xy 0.762 -1.016) (xy -0.762 0) (xy 0.762 1.016) (xy 0.762 -1.016)
					)
					(stroke
						(width 0.254)
						(type default)
					)
					(fill
						(type none)
					)
				)
				(polyline
					(pts
						(xy 0 0.762) (xy -0.508 1.27) (xy -0.254 1.27) (xy -0.508 1.27) (xy -0.508 1.016)
					)
					(stroke
						(width 0)
						(type default)
					)
					(fill
						(type none)
					)
				)
				(polyline
					(pts
						(xy 0.508 1.27) (xy 0 1.778) (xy 0.254 1.778) (xy 0 1.778) (xy 0 1.524)
					)
					(stroke
						(width 0)
						(type default)
					)
					(fill
						(type none)
					)
				)
			)
			(symbol "LED_Small_1_1"
				(pin passive line
					(at -2.54 0 0)
					(length 1.778)
					(name "K"
						(effects
							(font
								(size 1.27 1.27)
							)
						)
					)
					(number "1"
						(effects
							(font
								(size 1.27 1.27)
							)
						)
					)
				)
				(pin passive line
					(at 2.54 0 180)
					(length 1.778)
					(name "A"
						(effects
							(font
								(size 1.27 1.27)
							)
						)
					)
					(number "2"
						(effects
							(font
								(size 1.27 1.27)
							)
						)
					)
				)
			)
		)
		(symbol "Device:Q_NMOS_GSD"
			(pin_names
				(offset 0) hide)
			(exclude_from_sim no)
			(in_bom yes)
			(on_board yes)
			(property "Reference" "Q"
				(at 5.08 1.27 0)
				(effects
					(font
						(size 1.27 1.27)
					)
					(justify left)
				)
			)
			(property "Value" "Q_NMOS_GSD"
				(at 5.08 -1.27 0)
				(effects
					(font
						(size 1.27 1.27)
					)
					(justify left)
				)
			)
			(property "Footprint" ""
				(at 5.08 2.54 0)
				(effects
					(font
						(size 1.27 1.27)
					)
					(hide yes)
				)
			)
			(property "Datasheet" "~"
				(at 0 0 0)
				(effects
					(font
						(size 1.27 1.27)
					)
					(hide yes)
				)
			)
			(property "Description" "N-MOSFET transistor, gate/source/drain"
				(at 0 0 0)
				(effects
					(font
						(size 1.27 1.27)
					)
					(hide yes)
				)
			)
			(property "ki_keywords" "transistor NMOS N-MOS N-MOSFET"
				(at 0 0 0)
				(effects
					(font
						(size 1.27 1.27)
					)
					(hide yes)
				)
			)
			(symbol "Q_NMOS_GSD_0_1"
				(polyline
					(pts
						(xy 0.254 0) (xy -2.54 0)
					)
					(stroke
						(width 0)
						(type default)
					)
					(fill
						(type none)
					)
				)
				(polyline
					(pts
						(xy 0.254 1.905) (xy 0.254 -1.905)
					)
					(stroke
						(width 0.254)
						(type default)
					)
					(fill
						(type none)
					)
				)
				(polyline
					(pts
						(xy 0.762 -1.27) (xy 0.762 -2.286)
					)
					(stroke
						(width 0.254)
						(type default)
					)
					(fill
						(type none)
					)
				)
				(polyline
					(pts
						(xy 0.762 0.508) (xy 0.762 -0.508)
					)
					(stroke
						(width 0.254)
						(type default)
					)
					(fill
						(type none)
					)
				)
				(polyline
					(pts
						(xy 0.762 2.286) (xy 0.762 1.27)
					)
					(stroke
						(width 0.254)
						(type default)
					)
					(fill
						(type none)
					)
				)
				(polyline
					(pts
						(xy 2.54 2.54) (xy 2.54 1.778)
					)
					(stroke
						(width 0)
						(type default)
					)
					(fill
						(type none)
					)
				)
				(polyline
					(pts
						(xy 2.54 -2.54) (xy 2.54 0) (xy 0.762 0)
					)
					(stroke
						(width 0)
						(type default)
					)
					(fill
						(type none)
					)
				)
				(polyline
					(pts
						(xy 0.762 -1.778) (xy 3.302 -1.778) (xy 3.302 1.778) (xy 0.762 1.778)
					)
					(stroke
						(width 0)
						(type default)
					)
					(fill
						(type none)
					)
				)
				(polyline
					(pts
						(xy 1.016 0) (xy 2.032 0.381) (xy 2.032 -0.381) (xy 1.016 0)
					)
					(stroke
						(width 0)
						(type default)
					)
					(fill
						(type outline)
					)
				)
				(polyline
					(pts
						(xy 2.794 0.508) (xy 2.921 0.381) (xy 3.683 0.381) (xy 3.81 0.254)
					)
					(stroke
						(width 0)
						(type default)
					)
					(fill
						(type none)
					)
				)
				(polyline
					(pts
						(xy 3.302 0.381) (xy 2.921 -0.254) (xy 3.683 -0.254) (xy 3.302 0.381)
					)
					(stroke
						(width 0)
						(type default)
					)
					(fill
						(type none)
					)
				)
				(circle
					(center 1.651 0)
					(radius 2.794)
					(stroke
						(width 0.254)
						(type default)
					)
					(fill
						(type none)
					)
				)
				(circle
					(center 2.54 -1.778)
					(radius 0.254)
					(stroke
						(width 0)
						(type default)
					)
					(fill
						(type outline)
					)
				)
				(circle
					(center 2.54 1.778)
					(radius 0.254)
					(stroke
						(width 0)
						(type default)
					)
					(fill
						(type outline)
					)
				)
			)
			(symbol "Q_NMOS_GSD_1_1"
				(pin input line
					(at -5.08 0 0)
					(length 2.54)
					(name "G"
						(effects
							(font
								(size 1.27 1.27)
							)
						)
					)
					(number "1"
						(effects
							(font
								(size 1.27 1.27)
							)
						)
					)
				)
				(pin passive line
					(at 2.54 -5.08 90)
					(length 2.54)
					(name "S"
						(effects
							(font
								(size 1.27 1.27)
							)
						)
					)
					(number "2"
						(effects
							(font
								(size 1.27 1.27)
							)
						)
					)
				)
				(pin passive line
					(at 2.54 5.08 270)
					(length 2.54)
					(name "D"
						(effects
							(font
								(size 1.27 1.27)
							)
						)
					)
					(number "3"
						(effects
							(font
								(size 1.27 1.27)
							)
						)
					)
				)
			)
		)
		(symbol "Device:R_Small"
			(pin_numbers hide)
			(pin_names
				(offset 0.254) hide)
			(exclude_from_sim no)
			(in_bom yes)
			(on_board yes)
			(property "Reference" "R"
				(at 0.762 0.508 0)
				(effects
					(font
						(size 1.27 1.27)
					)
					(justify left)
				)
			)
			(property "Value" "R_Small"
				(at 0.762 -1.016 0)
				(effects
					(font
						(size 1.27 1.27)
					)
					(justify left)
				)
			)
			(property "Footprint" ""
				(at 0 0 0)
				(effects
					(font
						(size 1.27 1.27)
					)
					(hide yes)
				)
			)
			(property "Datasheet" "~"
				(at 0 0 0)
				(effects
					(font
						(size 1.27 1.27)
					)
					(hide yes)
				)
			)
			(property "Description" "Resistor, small symbol"
				(at 0 0 0)
				(effects
					(font
						(size 1.27 1.27)
					)
					(hide yes)
				)
			)
			(property "ki_keywords" "R resistor"
				(at 0 0 0)
				(effects
					(font
						(size 1.27 1.27)
					)
					(hide yes)
				)
			)
			(property "ki_fp_filters" "R_*"
				(at 0 0 0)
				(effects
					(font
						(size 1.27 1.27)
					)
					(hide yes)
				)
			)
			(symbol "R_Small_0_1"
				(rectangle
					(start -0.762 1.778)
					(end 0.762 -1.778)
					(stroke
						(width 0.2032)
						(type default)
					)
					(fill
						(type none)
					)
				)
			)
			(symbol "R_Small_1_1"
				(pin passive line
					(at 0 2.54 270)
					(length 0.762)
					(name "~"
						(effects
							(font
								(size 1.27 1.27)
							)
						)
					)
					(number "1"
						(effects
							(font
								(size 1.27 1.27)
							)
						)
					)
				)
				(pin passive line
					(at 0 -2.54 90)
					(length 0.762)
					(name "~"
						(effects
							(font
								(size 1.27 1.27)
							)
						)
					)
					(number "2"
						(effects
							(font
								(size 1.27 1.27)
							)
						)
					)
				)
			)
		)
		(symbol "power:+5V"
			(power)
			(pin_names
				(offset 0)
			)
			(exclude_from_sim no)
			(in_bom yes)
			(on_board yes)
			(property "Reference" "#PWR"
				(at 0 -3.81 0)
				(effects
					(font
						(size 1.27 1.27)
					)
					(hide yes)
				)
			)
			(property "Value" "+5V"
				(at 0 3.556 0)
				(effects
					(font
						(size 1.27 1.27)
					)
				)
			)
			(property "Footprint" ""
				(at 0 0 0)
				(effects
					(font
						(size 1.27 1.27)
					)
					(hide yes)
				)
			)
			(property "Datasheet" ""
				(at 0 0 0)
				(effects
					(font
						(size 1.27 1.27)
					)
					(hide yes)
				)
			)
			(property "Description" "Power symbol creates a global label with name \"+5V\""
				(at 0 0 0)
				(effects
					(font
						(size 1.27 1.27)
					)
					(hide yes)
				)
			)
			(property "ki_keywords" "global power"
				(at 0 0 0)
				(effects
					(font
						(size 1.27 1.27)
					)
					(hide yes)
				)
			)
			(symbol "+5V_0_1"
				(polyline
					(pts
						(xy -0.762 1.27) (xy 0 2.54)
					)
					(stroke
						(width 0)
						(type default)
					)
					(fill
						(type none)
					)
				)
				(polyline
					(pts
						(xy 0 0) (xy 0 2.54)
					)
					(stroke
						(width 0)
						(type default)
					)
					(fill
						(type none)
					)
				)
				(polyline
					(pts
						(xy 0 2.54) (xy 0.762 1.27)
					)
					(stroke
						(width 0)
						(type default)
					)
					(fill
						(type none)
					)
				)
			)
			(symbol "+5V_1_1"
				(pin power_in line
					(at 0 0 90)
					(length 0) hide
					(name "+5V"
						(effects
							(font
								(size 1.27 1.27)
							)
						)
					)
					(number "1"
						(effects
							(font
								(size 1.27 1.27)
							)
						)
					)
				)
			)
		)
		(symbol "power:GND"
			(power)
			(pin_names
				(offset 0)
			)
			(exclude_from_sim no)
			(in_bom yes)
			(on_board yes)
			(property "Reference" "#PWR"
				(at 0 -6.35 0)
				(effects
					(font
						(size 1.27 1.27)
					)
					(hide yes)
				)
			)
			(property "Value" "GND"
				(at 0 -3.81 0)
				(effects
					(font
						(size 1.27 1.27)
					)
				)
			)
			(property "Footprint" ""
				(at 0 0 0)
				(effects
					(font
						(size 1.27 1.27)
					)
					(hide yes)
				)
			)
			(property "Datasheet" ""
				(at 0 0 0)
				(effects
					(font
						(size 1.27 1.27)
					)
					(hide yes)
				)
			)
			(property "Description" "Power symbol creates a global label with name \"GND\" , ground"
				(at 0 0 0)
				(effects
					(font
						(size 1.27 1.27)
					)
					(hide yes)
				)
			)
			(property "ki_keywords" "global power"
				(at 0 0 0)
				(effects
					(font
						(size 1.27 1.27)
					)
					(hide yes)
				)
			)
			(symbol "GND_0_1"
				(polyline
					(pts
						(xy 0 0) (xy 0 -1.27) (xy 1.27 -1.27) (xy 0 -2.54) (xy -1.27 -1.27) (xy 0 -1.27)
					)
					(stroke
						(width 0)
						(type default)
					)
					(fill
						(type none)
					)
				)
			)
			(symbol "GND_1_1"
				(pin power_in line
					(at 0 0 270)
					(length 0) hide
					(name "GND"
						(effects
							(font
								(size 1.27 1.27)
							)
						)
					)
					(number "1"
						(effects
							(font
								(size 1.27 1.27)
							)
						)
					)
				)
			)
		)
	)
	(junction
		(at 175.26 69.85)
		(diameter 0)
		(color 0 0 0 0)
		(uuid "4038e731-87aa-4886-888d-49fca37629be")
	)
	(junction
		(at 116.205 70.485)
		(diameter 0)
		(color 0 0 0 0)
		(uuid "8c7ec424-ef09-42ee-9e18-a536b61ca833")
	)
	(junction
		(at 106.045 90.805)
		(diameter 0)
		(color 0 0 0 0)
		(uuid "a4fd01ca-843d-4acb-9e34-3cf346de6a87")
	)
	(junction
		(at 64.135 69.85)
		(diameter 0)
		(color 0 0 0 0)
		(uuid "e54312a4-cd78-48c1-9d61-bbc5a999b144")
	)
	(junction
		(at 165.1 90.17)
		(diameter 0)
		(color 0 0 0 0)
		(uuid "e966be89-4b22-48ae-a77d-5e8eedc09c0d")
	)
	(junction
		(at 53.975 90.17)
		(diameter 0)
		(color 0 0 0 0)
		(uuid "ef4eacd4-4f26-4f2a-81b7-27eeb15036af")
	)
	(wire
		(pts
			(xy 175.26 95.25) (xy 175.26 99.06)
		)
		(stroke
			(width 0)
			(type default)
		)
		(uuid "05f506e7-5585-4e67-8a0c-8968384da9d0")
	)
	(wire
		(pts
			(xy 116.205 84.455) (xy 116.205 85.725)
		)
		(stroke
			(width 0)
			(type default)
		)
		(uuid "09e5dcaa-eb86-41b4-9503-335d9faa9d56")
	)
	(wire
		(pts
			(xy 106.045 90.805) (xy 106.045 93.345)
		)
		(stroke
			(width 0)
			(type default)
		)
		(uuid "11ab27b8-e89b-46e1-a08d-bfeb14e1f6f0")
	)
	(wire
		(pts
			(xy 106.045 90.805) (xy 103.505 90.805)
		)
		(stroke
			(width 0)
			(type default)
		)
		(uuid "31e591c7-049e-493b-bf9e-e249605f226f")
	)
	(wire
		(pts
			(xy 64.135 95.25) (xy 64.135 99.06)
		)
		(stroke
			(width 0)
			(type default)
		)
		(uuid "35b0aa75-8377-421f-a054-20150ca93a11")
	)
	(wire
		(pts
			(xy 165.1 69.85) (xy 165.1 72.39)
		)
		(stroke
			(width 0)
			(type default)
		)
		(uuid "38f7abf8-18c9-48a4-a372-07ebbe392d17")
	)
	(wire
		(pts
			(xy 175.26 69.85) (xy 165.1 69.85)
		)
		(stroke
			(width 0)
			(type default)
		)
		(uuid "3f60abab-ff89-44e3-aa79-f412b4ad63c7")
	)
	(wire
		(pts
			(xy 108.585 90.805) (xy 106.045 90.805)
		)
		(stroke
			(width 0)
			(type default)
		)
		(uuid "4e9d0686-7fa3-4a82-8bf2-212bf73e3933")
	)
	(wire
		(pts
			(xy 64.135 69.85) (xy 64.135 72.39)
		)
		(stroke
			(width 0)
			(type default)
		)
		(uuid "568ed275-e047-4057-8a79-9aa1084f24ed")
	)
	(wire
		(pts
			(xy 64.135 77.47) (xy 64.135 78.74)
		)
		(stroke
			(width 0)
			(type default)
		)
		(uuid "5797f69b-93dd-44a7-9f23-c7beacfcb670")
	)
	(wire
		(pts
			(xy 165.1 97.79) (xy 165.1 99.06)
		)
		(stroke
			(width 0)
			(type default)
		)
		(uuid "5d3fc573-7bd7-4753-a88c-db0579f95966")
	)
	(wire
		(pts
			(xy 165.1 90.17) (xy 165.1 92.71)
		)
		(stroke
			(width 0)
			(type default)
		)
		(uuid "5da88d26-8989-4b5e-b097-453c75c9af12")
	)
	(wire
		(pts
			(xy 116.205 67.945) (xy 116.205 70.485)
		)
		(stroke
			(width 0)
			(type default)
		)
		(uuid "5eb45f73-c7db-464a-95bb-d6556e1f9ea8")
	)
	(wire
		(pts
			(xy 167.64 90.17) (xy 165.1 90.17)
		)
		(stroke
			(width 0)
			(type default)
		)
		(uuid "63064138-18a7-4d53-9ed6-7c945e252c55")
	)
	(wire
		(pts
			(xy 53.975 90.17) (xy 51.435 90.17)
		)
		(stroke
			(width 0)
			(type default)
		)
		(uuid "6414cbe1-2fb3-4a93-83a1-b3c14830e9b1")
	)
	(wire
		(pts
			(xy 64.135 67.31) (xy 64.135 69.85)
		)
		(stroke
			(width 0)
			(type default)
		)
		(uuid "71acc148-be29-4fd3-8aa3-1f3887f5ee2f")
	)
	(wire
		(pts
			(xy 53.975 69.85) (xy 53.975 72.39)
		)
		(stroke
			(width 0)
			(type default)
		)
		(uuid "72b88881-73d6-4f3b-9863-900d83fcebcc")
	)
	(wire
		(pts
			(xy 175.26 77.47) (xy 175.26 78.74)
		)
		(stroke
			(width 0)
			(type default)
		)
		(uuid "774255db-45df-4ac9-9a5f-b913177e442e")
	)
	(wire
		(pts
			(xy 53.975 90.17) (xy 53.975 92.71)
		)
		(stroke
			(width 0)
			(type default)
		)
		(uuid "7857ee6b-034d-4bd6-8212-ba11c13874d2")
	)
	(wire
		(pts
			(xy 64.135 69.85) (xy 53.975 69.85)
		)
		(stroke
			(width 0)
			(type default)
		)
		(uuid "7d34634d-7bae-41bb-93ab-314fa0ded918")
	)
	(wire
		(pts
			(xy 64.135 83.82) (xy 64.135 85.09)
		)
		(stroke
			(width 0)
			(type default)
		)
		(uuid "940d7d2a-53c8-4a1b-bf97-e60f057b80fe")
	)
	(wire
		(pts
			(xy 56.515 90.17) (xy 53.975 90.17)
		)
		(stroke
			(width 0)
			(type default)
		)
		(uuid "986e3aec-908b-4140-beb1-e87936b17961")
	)
	(wire
		(pts
			(xy 106.045 70.485) (xy 106.045 73.025)
		)
		(stroke
			(width 0)
			(type default)
		)
		(uuid "9cb80893-ac7f-4270-afde-b37c81e1b88b")
	)
	(wire
		(pts
			(xy 116.205 78.105) (xy 116.205 79.375)
		)
		(stroke
			(width 0)
			(type default)
		)
		(uuid "a3706e47-814a-4487-b8ac-3030d428f126")
	)
	(wire
		(pts
			(xy 175.26 67.31) (xy 175.26 69.85)
		)
		(stroke
			(width 0)
			(type default)
		)
		(uuid "ae86213c-8404-42cf-accc-19004aea2d70")
	)
	(wire
		(pts
			(xy 116.205 95.885) (xy 116.205 99.695)
		)
		(stroke
			(width 0)
			(type default)
		)
		(uuid "c2701a0c-bac3-473d-8891-79c15447f23a")
	)
	(wire
		(pts
			(xy 165.1 90.17) (xy 162.56 90.17)
		)
		(stroke
			(width 0)
			(type default)
		)
		(uuid "c2e23048-04a0-4a58-bff6-640f28b6d007")
	)
	(wire
		(pts
			(xy 116.205 70.485) (xy 106.045 70.485)
		)
		(stroke
			(width 0)
			(type default)
		)
		(uuid "d7c2b37c-8f3c-483d-98d8-e409a9c1b05d")
	)
	(wire
		(pts
			(xy 175.26 83.82) (xy 175.26 85.09)
		)
		(stroke
			(width 0)
			(type default)
		)
		(uuid "deca5f92-c7c9-4608-bfa2-89ef958ddaa8")
	)
	(wire
		(pts
			(xy 106.045 98.425) (xy 106.045 99.695)
		)
		(stroke
			(width 0)
			(type default)
		)
		(uuid "e227a36a-8b75-4313-bda6-cc89ad1da958")
	)
	(wire
		(pts
			(xy 116.205 70.485) (xy 116.205 73.025)
		)
		(stroke
			(width 0)
			(type default)
		)
		(uuid "e4f35ff8-ea39-4d57-9057-e3c792c963ae")
	)
	(wire
		(pts
			(xy 53.975 97.79) (xy 53.975 99.06)
		)
		(stroke
			(width 0)
			(type default)
		)
		(uuid "f5a77450-e534-40c3-a7a7-23e9bb203d36")
	)
	(wire
		(pts
			(xy 175.26 69.85) (xy 175.26 72.39)
		)
		(stroke
			(width 0)
			(type default)
		)
		(uuid "f8466e18-86ee-4480-8671-1fcd13090683")
	)
	(text "20 mA max current"
		(exclude_from_sim no)
		(at 61.595 85.09 0)
		(effects
			(font
				(size 0.9906 0.9906)
			)
			(justify right bottom)
		)
		(uuid "0d2bac28-9cc7-4c87-ba24-66a6a7a7f789")
	)
	(text "Red LED"
		(exclude_from_sim no)
		(at 133.985 83.185 0)
		(effects
			(font
				(size 1.27 1.27)
			)
			(justify left bottom)
		)
		(uuid "0db735a5-8b3b-4aed-bab2-03389b91a222")
	)
	(text "Red LED"
		(exclude_from_sim no)
		(at 81.915 82.55 0)
		(effects
			(font
				(size 1.27 1.27)
			)
			(justify left bottom)
		)
		(uuid "3ed15ace-1899-4f7b-8828-3dd2fc381e75")
	)
	(text "20 mA max current"
		(exclude_from_sim no)
		(at 113.665 85.725 0)
		(effects
			(font
				(size 0.9906 0.9906)
			)
			(justify right bottom)
		)
		(uuid "60a6c394-7247-4317-8504-0ae7f03920a6")
	)
	(text "20 mA max current"
		(exclude_from_sim no)
		(at 172.72 85.09 0)
		(effects
			(font
				(size 0.9906 0.9906)
			)
			(justify right bottom)
		)
		(uuid "9a938da6-02e9-43e0-be90-92b27d075d55")
	)
	(text "Amber LED"
		(exclude_from_sim no)
		(at 193.04 82.55 0)
		(effects
			(font
				(size 1.27 1.27)
			)
			(justify left bottom)
		)
		(uuid "baab55a5-2e7c-431d-ac68-f5d3588a01b6")
	)
	(hierarchical_label "red_led_A"
		(shape input)
		(at 51.435 90.17 180)
		(fields_autoplaced yes)
		(effects
			(font
				(size 1.27 1.27)
			)
			(justify right)
		)
		(uuid "07e6cf3a-ab56-4bfc-b8e9-cc15721c6d36")
	)
	(hierarchical_label "red_led_B"
		(shape input)
		(at 103.505 90.805 180)
		(fields_autoplaced yes)
		(effects
			(font
				(size 1.27 1.27)
			)
			(justify right)
		)
		(uuid "18cf971a-d34d-4f75-9b4a-080b1aa34075")
	)
	(hierarchical_label "orange_led"
		(shape input)
		(at 162.56 90.17 180)
		(fields_autoplaced yes)
		(effects
			(font
				(size 1.27 1.27)
			)
			(justify right)
		)
		(uuid "eadcced3-a451-4669-b297-6b5f2b60cda5")
	)
	(symbol
		(lib_id "power:+5V")
		(at 116.205 67.945 0)
		(mirror y)
		(unit 1)
		(exclude_from_sim no)
		(in_bom yes)
		(on_board yes)
		(dnp no)
		(uuid "00000000-0000-0000-0000-000061b1cea8")
		(property "Reference" "#PWR070"
			(at 116.205 71.755 0)
			(effects
				(font
					(size 1.27 1.27)
				)
				(hide yes)
			)
		)
		(property "Value" "+5V"
			(at 115.824 63.5508 0)
			(effects
				(font
					(size 1.27 1.27)
				)
			)
		)
		(property "Footprint" ""
			(at 116.205 67.945 0)
			(effects
				(font
					(size 1.27 1.27)
				)
				(hide yes)
			)
		)
		(property "Datasheet" ""
			(at 116.205 67.945 0)
			(effects
				(font
					(size 1.27 1.27)
				)
				(hide yes)
			)
		)
		(property "Description" ""
			(at 116.205 67.945 0)
			(effects
				(font
					(size 1.27 1.27)
				)
				(hide yes)
			)
		)
		(pin "1"
			(uuid "77c9ec27-36e9-424b-8f56-997f685f9c8b")
		)
		(instances
			(project "branch_high_voltage"
				(path "/dbca94a9-194b-1234-8e89-e62dd00d8253/00000000-0000-0000-0000-000061b1a559"
					(reference "#PWR070")
					(unit 1)
				)
			)
		)
	)
	(symbol
		(lib_id "Device:C_Small")
		(at 106.045 75.565 0)
		(mirror x)
		(unit 1)
		(exclude_from_sim no)
		(in_bom yes)
		(on_board yes)
		(dnp no)
		(uuid "00000000-0000-0000-0000-000061b1ceb0")
		(property "Reference" "C11"
			(at 104.775 74.295 0)
			(effects
				(font
					(size 1.27 1.27)
				)
				(justify right)
			)
		)
		(property "Value" "1u"
			(at 104.775 76.835 0)
			(effects
				(font
					(size 1.27 1.27)
				)
				(justify right)
			)
		)
		(property "Footprint" "Capacitor_SMD:C_0603_1608Metric"
			(at 106.045 75.565 0)
			(effects
				(font
					(size 1.27 1.27)
				)
				(hide yes)
			)
		)
		(property "Datasheet" "~"
			(at 106.045 75.565 0)
			(effects
				(font
					(size 1.27 1.27)
				)
				(hide yes)
			)
		)
		(property "Description" ""
			(at 106.045 75.565 0)
			(effects
				(font
					(size 1.27 1.27)
				)
				(hide yes)
			)
		)
		(property "Mfr" " 963-GMK105CC6105KV-F "
			(at 106.045 75.565 0)
			(effects
				(font
					(size 1.27 1.27)
				)
				(hide yes)
			)
		)
		(pin "1"
			(uuid "9e59127b-e362-4787-b083-7d116eebd2c8")
		)
		(pin "2"
			(uuid "f28fd3a7-1896-441e-bc27-99331cac3506")
		)
		(instances
			(project "branch_high_voltage"
				(path "/dbca94a9-194b-1234-8e89-e62dd00d8253/00000000-0000-0000-0000-000061b1a559"
					(reference "C11")
					(unit 1)
				)
			)
		)
	)
	(symbol
		(lib_id "power:GND")
		(at 106.045 78.105 0)
		(unit 1)
		(exclude_from_sim no)
		(in_bom yes)
		(on_board yes)
		(dnp no)
		(uuid "00000000-0000-0000-0000-000061b1ceb7")
		(property "Reference" "#PWR073"
			(at 106.045 84.455 0)
			(effects
				(font
					(size 1.27 1.27)
				)
				(hide yes)
			)
		)
		(property "Value" "GND"
			(at 106.172 82.4992 0)
			(effects
				(font
					(size 1.27 1.27)
				)
			)
		)
		(property "Footprint" ""
			(at 106.045 78.105 0)
			(effects
				(font
					(size 1.27 1.27)
				)
				(hide yes)
			)
		)
		(property "Datasheet" ""
			(at 106.045 78.105 0)
			(effects
				(font
					(size 1.27 1.27)
				)
				(hide yes)
			)
		)
		(property "Description" ""
			(at 106.045 78.105 0)
			(effects
				(font
					(size 1.27 1.27)
				)
				(hide yes)
			)
		)
		(pin "1"
			(uuid "6a5bc881-a259-4eda-af0f-0d436840aec8")
		)
		(instances
			(project "branch_high_voltage"
				(path "/dbca94a9-194b-1234-8e89-e62dd00d8253/00000000-0000-0000-0000-000061b1a559"
					(reference "#PWR073")
					(unit 1)
				)
			)
		)
	)
	(symbol
		(lib_id "power:GND")
		(at 116.205 99.695 0)
		(unit 1)
		(exclude_from_sim no)
		(in_bom yes)
		(on_board yes)
		(dnp no)
		(uuid "00000000-0000-0000-0000-000061b1cec2")
		(property "Reference" "#PWR079"
			(at 116.205 106.045 0)
			(effects
				(font
					(size 1.27 1.27)
				)
				(hide yes)
			)
		)
		(property "Value" "GND"
			(at 116.332 104.0892 0)
			(effects
				(font
					(size 1.27 1.27)
				)
			)
		)
		(property "Footprint" ""
			(at 116.205 99.695 0)
			(effects
				(font
					(size 1.27 1.27)
				)
				(hide yes)
			)
		)
		(property "Datasheet" ""
			(at 116.205 99.695 0)
			(effects
				(font
					(size 1.27 1.27)
				)
				(hide yes)
			)
		)
		(property "Description" ""
			(at 116.205 99.695 0)
			(effects
				(font
					(size 1.27 1.27)
				)
				(hide yes)
			)
		)
		(pin "1"
			(uuid "b48a512a-61c9-458c-afd3-dec8fa69f1d7")
		)
		(instances
			(project "branch_high_voltage"
				(path "/dbca94a9-194b-1234-8e89-e62dd00d8253/00000000-0000-0000-0000-000061b1a559"
					(reference "#PWR079")
					(unit 1)
				)
			)
		)
	)
	(symbol
		(lib_id "Device:R_Small")
		(at 106.045 95.885 0)
		(mirror y)
		(unit 1)
		(exclude_from_sim no)
		(in_bom yes)
		(on_board yes)
		(dnp no)
		(uuid "00000000-0000-0000-0000-000061b1cec8")
		(property "Reference" "R20"
			(at 104.5464 94.7166 0)
			(effects
				(font
					(size 1.27 1.27)
				)
				(justify left)
			)
		)
		(property "Value" "4.7k"
			(at 104.5464 97.028 0)
			(effects
				(font
					(size 1.27 1.27)
				)
				(justify left)
			)
		)
		(property "Footprint" "Resistor_SMD:R_0603_1608Metric"
			(at 106.045 95.885 0)
			(effects
				(font
					(size 1.27 1.27)
				)
				(hide yes)
			)
		)
		(property "Datasheet" "~"
			(at 106.045 95.885 0)
			(effects
				(font
					(size 1.27 1.27)
				)
				(hide yes)
			)
		)
		(property "Description" ""
			(at 106.045 95.885 0)
			(effects
				(font
					(size 1.27 1.27)
				)
				(hide yes)
			)
		)
		(property "Mfr" "RG1005P-472-D-T10"
			(at 106.045 95.885 0)
			(effects
				(font
					(size 1.27 1.27)
				)
				(hide yes)
			)
		)
		(pin "1"
			(uuid "7d356c29-53fd-4c49-93dd-4067c840327f")
		)
		(pin "2"
			(uuid "6196cc58-0414-4297-83fa-d68db628a410")
		)
		(instances
			(project "branch_high_voltage"
				(path "/dbca94a9-194b-1234-8e89-e62dd00d8253/00000000-0000-0000-0000-000061b1a559"
					(reference "R20")
					(unit 1)
				)
			)
		)
	)
	(symbol
		(lib_id "power:GND")
		(at 106.045 99.695 0)
		(unit 1)
		(exclude_from_sim no)
		(in_bom yes)
		(on_board yes)
		(dnp no)
		(uuid "00000000-0000-0000-0000-000061b1cecf")
		(property "Reference" "#PWR078"
			(at 106.045 106.045 0)
			(effects
				(font
					(size 1.27 1.27)
				)
				(hide yes)
			)
		)
		(property "Value" "GND"
			(at 106.172 104.0892 0)
			(effects
				(font
					(size 1.27 1.27)
				)
			)
		)
		(property "Footprint" ""
			(at 106.045 99.695 0)
			(effects
				(font
					(size 1.27 1.27)
				)
				(hide yes)
			)
		)
		(property "Datasheet" ""
			(at 106.045 99.695 0)
			(effects
				(font
					(size 1.27 1.27)
				)
				(hide yes)
			)
		)
		(property "Description" ""
			(at 106.045 99.695 0)
			(effects
				(font
					(size 1.27 1.27)
				)
				(hide yes)
			)
		)
		(pin "1"
			(uuid "9fe8118a-8925-47e7-b0b5-8357088b02c3")
		)
		(instances
			(project "branch_high_voltage"
				(path "/dbca94a9-194b-1234-8e89-e62dd00d8253/00000000-0000-0000-0000-000061b1a559"
					(reference "#PWR078")
					(unit 1)
				)
			)
		)
	)
	(symbol
		(lib_id "Device:Q_NMOS_GSD")
		(at 113.665 90.805 0)
		(unit 1)
		(exclude_from_sim no)
		(in_bom yes)
		(on_board yes)
		(dnp no)
		(uuid "00000000-0000-0000-0000-000061b1ceda")
		(property "Reference" "Q3"
			(at 118.872 89.6366 0)
			(effects
				(font
					(size 1.27 1.27)
				)
				(justify left)
			)
		)
		(property "Value" "2N7002WT1G"
			(at 118.872 91.948 0)
			(effects
				(font
					(size 1.27 1.27)
				)
				(justify left)
			)
		)
		(property "Footprint" "Package_TO_SOT_SMD:SOT-323_SC-70"
			(at 118.745 88.265 0)
			(effects
				(font
					(size 1.27 1.27)
				)
				(hide yes)
			)
		)
		(property "Datasheet" "https://www.mouser.de/datasheet/2/308/2N7002W_D-1710338.pdf"
			(at 113.665 90.805 0)
			(effects
				(font
					(size 1.27 1.27)
				)
				(hide yes)
			)
		)
		(property "Description" ""
			(at 113.665 90.805 0)
			(effects
				(font
					(size 1.27 1.27)
				)
				(hide yes)
			)
		)
		(property "Mfr" "2N7002WT1G"
			(at 113.665 90.805 0)
			(effects
				(font
					(size 1.27 1.27)
				)
				(hide yes)
			)
		)
		(pin "1"
			(uuid "c48f9c85-da5e-48e2-9f79-8983681574a2")
		)
		(pin "2"
			(uuid "2dab1cae-4723-4527-be81-30d818263bf4")
		)
		(pin "3"
			(uuid "ed0e5810-9fb8-4dc1-b7d7-84f6c441e8ab")
		)
		(instances
			(project "branch_high_voltage"
				(path "/dbca94a9-194b-1234-8e89-e62dd00d8253/00000000-0000-0000-0000-000061b1a559"
					(reference "Q3")
					(unit 1)
				)
			)
		)
	)
	(symbol
		(lib_id "Device:LED_Small")
		(at 116.205 81.915 270)
		(mirror x)
		(unit 1)
		(exclude_from_sim no)
		(in_bom yes)
		(on_board yes)
		(dnp no)
		(uuid "00000000-0000-0000-0000-000061b1cee0")
		(property "Reference" "D23"
			(at 118.6942 80.7466 90)
			(effects
				(font
					(size 1.27 1.27)
				)
				(justify left)
			)
		)
		(property "Value" "IN-S124ARUR"
			(at 118.6942 83.058 90)
			(effects
				(font
					(size 1.27 1.27)
				)
				(justify left)
			)
		)
		(property "Footprint" "LEGOS:LED_1204_3212Metric_ReverseMount_Hole1.8x2.4mm"
			(at 116.205 81.915 90)
			(effects
				(font
					(size 1.27 1.27)
				)
				(hide yes)
			)
		)
		(property "Datasheet" "http://inolux-corp.com/datasheet/SMDLED/Mono%20Color%20Reverse%20Mount/IN-S124AR%20Series_V1.0.pdf"
			(at 116.205 81.915 90)
			(effects
				(font
					(size 1.27 1.27)
				)
				(hide yes)
			)
		)
		(property "Description" ""
			(at 116.205 81.915 0)
			(effects
				(font
					(size 1.27 1.27)
				)
				(hide yes)
			)
		)
		(property "Mfr" "IN-S124ARUR"
			(at 116.205 81.915 0)
			(effects
				(font
					(size 1.27 1.27)
				)
				(hide yes)
			)
		)
		(pin "1"
			(uuid "89aa3521-a6b4-4c5e-8b4a-34bfc93a94b7")
		)
		(pin "2"
			(uuid "106c7bd4-1811-4ec7-ae55-0632dea21b95")
		)
		(instances
			(project "branch_high_voltage"
				(path "/dbca94a9-194b-1234-8e89-e62dd00d8253/00000000-0000-0000-0000-000061b1a559"
					(reference "D23")
					(unit 1)
				)
			)
		)
	)
	(symbol
		(lib_id "Device:R_Small")
		(at 116.205 75.565 0)
		(mirror y)
		(unit 1)
		(exclude_from_sim no)
		(in_bom yes)
		(on_board yes)
		(dnp no)
		(uuid "00000000-0000-0000-0000-000061b1cee6")
		(property "Reference" "R17"
			(at 114.7064 74.3966 0)
			(effects
				(font
					(size 1.27 1.27)
				)
				(justify left)
			)
		)
		(property "Value" "150"
			(at 114.7064 76.708 0)
			(effects
				(font
					(size 1.27 1.27)
				)
				(justify left)
			)
		)
		(property "Footprint" "Resistor_SMD:R_0603_1608Metric"
			(at 116.205 75.565 0)
			(effects
				(font
					(size 1.27 1.27)
				)
				(hide yes)
			)
		)
		(property "Datasheet" "~"
			(at 116.205 75.565 0)
			(effects
				(font
					(size 1.27 1.27)
				)
				(hide yes)
			)
		)
		(property "Description" ""
			(at 116.205 75.565 0)
			(effects
				(font
					(size 1.27 1.27)
				)
				(hide yes)
			)
		)
		(property "Mfr" "RG1005P-151-B-T10"
			(at 116.205 75.565 0)
			(effects
				(font
					(size 1.27 1.27)
				)
				(hide yes)
			)
		)
		(pin "1"
			(uuid "8ffdef80-38c1-4dbe-8f5a-7ad1aa6fdd34")
		)
		(pin "2"
			(uuid "e22d9d07-ae35-41ec-b24c-9fb4262a00a5")
		)
		(instances
			(project "branch_high_voltage"
				(path "/dbca94a9-194b-1234-8e89-e62dd00d8253/00000000-0000-0000-0000-000061b1a559"
					(reference "R17")
					(unit 1)
				)
			)
		)
	)
	(symbol
		(lib_id "power:+5V")
		(at 175.26 67.31 0)
		(mirror y)
		(unit 1)
		(exclude_from_sim no)
		(in_bom yes)
		(on_board yes)
		(dnp no)
		(uuid "00000000-0000-0000-0000-000061b23f9d")
		(property "Reference" "#PWR069"
			(at 175.26 71.12 0)
			(effects
				(font
					(size 1.27 1.27)
				)
				(hide yes)
			)
		)
		(property "Value" "+5V"
			(at 174.879 62.9158 0)
			(effects
				(font
					(size 1.27 1.27)
				)
			)
		)
		(property "Footprint" ""
			(at 175.26 67.31 0)
			(effects
				(font
					(size 1.27 1.27)
				)
				(hide yes)
			)
		)
		(property "Datasheet" ""
			(at 175.26 67.31 0)
			(effects
				(font
					(size 1.27 1.27)
				)
				(hide yes)
			)
		)
		(property "Description" ""
			(at 175.26 67.31 0)
			(effects
				(font
					(size 1.27 1.27)
				)
				(hide yes)
			)
		)
		(pin "1"
			(uuid "35bbe235-92b9-4499-bcb1-1e9086cb18b0")
		)
		(instances
			(project "branch_high_voltage"
				(path "/dbca94a9-194b-1234-8e89-e62dd00d8253/00000000-0000-0000-0000-000061b1a559"
					(reference "#PWR069")
					(unit 1)
				)
			)
		)
	)
	(symbol
		(lib_id "Device:C_Small")
		(at 165.1 74.93 0)
		(mirror x)
		(unit 1)
		(exclude_from_sim no)
		(in_bom yes)
		(on_board yes)
		(dnp no)
		(uuid "00000000-0000-0000-0000-000061b23fa5")
		(property "Reference" "C10"
			(at 163.83 73.66 0)
			(effects
				(font
					(size 1.27 1.27)
				)
				(justify right)
			)
		)
		(property "Value" "1u"
			(at 163.83 76.2 0)
			(effects
				(font
					(size 1.27 1.27)
				)
				(justify right)
			)
		)
		(property "Footprint" "Capacitor_SMD:C_0603_1608Metric"
			(at 165.1 74.93 0)
			(effects
				(font
					(size 1.27 1.27)
				)
				(hide yes)
			)
		)
		(property "Datasheet" "~"
			(at 165.1 74.93 0)
			(effects
				(font
					(size 1.27 1.27)
				)
				(hide yes)
			)
		)
		(property "Description" ""
			(at 165.1 74.93 0)
			(effects
				(font
					(size 1.27 1.27)
				)
				(hide yes)
			)
		)
		(property "Mfr" " 963-GMK105CC6105KV-F "
			(at 165.1 74.93 0)
			(effects
				(font
					(size 1.27 1.27)
				)
				(hide yes)
			)
		)
		(pin "1"
			(uuid "d8aa1fc6-6b7f-42a7-b652-260ebdfec95c")
		)
		(pin "2"
			(uuid "759a6a66-853d-4b8e-b141-49d908db0a0d")
		)
		(instances
			(project "branch_high_voltage"
				(path "/dbca94a9-194b-1234-8e89-e62dd00d8253/00000000-0000-0000-0000-000061b1a559"
					(reference "C10")
					(unit 1)
				)
			)
		)
	)
	(symbol
		(lib_id "power:GND")
		(at 165.1 77.47 0)
		(unit 1)
		(exclude_from_sim no)
		(in_bom yes)
		(on_board yes)
		(dnp no)
		(uuid "00000000-0000-0000-0000-000061b23fac")
		(property "Reference" "#PWR072"
			(at 165.1 83.82 0)
			(effects
				(font
					(size 1.27 1.27)
				)
				(hide yes)
			)
		)
		(property "Value" "GND"
			(at 165.227 81.8642 0)
			(effects
				(font
					(size 1.27 1.27)
				)
			)
		)
		(property "Footprint" ""
			(at 165.1 77.47 0)
			(effects
				(font
					(size 1.27 1.27)
				)
				(hide yes)
			)
		)
		(property "Datasheet" ""
			(at 165.1 77.47 0)
			(effects
				(font
					(size 1.27 1.27)
				)
				(hide yes)
			)
		)
		(property "Description" ""
			(at 165.1 77.47 0)
			(effects
				(font
					(size 1.27 1.27)
				)
				(hide yes)
			)
		)
		(pin "1"
			(uuid "847e38d9-e28c-44b6-870f-6a18f98397bc")
		)
		(instances
			(project "branch_high_voltage"
				(path "/dbca94a9-194b-1234-8e89-e62dd00d8253/00000000-0000-0000-0000-000061b1a559"
					(reference "#PWR072")
					(unit 1)
				)
			)
		)
	)
	(symbol
		(lib_id "power:GND")
		(at 175.26 99.06 0)
		(unit 1)
		(exclude_from_sim no)
		(in_bom yes)
		(on_board yes)
		(dnp no)
		(uuid "00000000-0000-0000-0000-000061b23fb7")
		(property "Reference" "#PWR077"
			(at 175.26 105.41 0)
			(effects
				(font
					(size 1.27 1.27)
				)
				(hide yes)
			)
		)
		(property "Value" "GND"
			(at 175.387 103.4542 0)
			(effects
				(font
					(size 1.27 1.27)
				)
			)
		)
		(property "Footprint" ""
			(at 175.26 99.06 0)
			(effects
				(font
					(size 1.27 1.27)
				)
				(hide yes)
			)
		)
		(property "Datasheet" ""
			(at 175.26 99.06 0)
			(effects
				(font
					(size 1.27 1.27)
				)
				(hide yes)
			)
		)
		(property "Description" ""
			(at 175.26 99.06 0)
			(effects
				(font
					(size 1.27 1.27)
				)
				(hide yes)
			)
		)
		(pin "1"
			(uuid "88792c47-7412-4fba-b03b-01460ce3a4f0")
		)
		(instances
			(project "branch_high_voltage"
				(path "/dbca94a9-194b-1234-8e89-e62dd00d8253/00000000-0000-0000-0000-000061b1a559"
					(reference "#PWR077")
					(unit 1)
				)
			)
		)
	)
	(symbol
		(lib_id "Device:R_Small")
		(at 165.1 95.25 0)
		(mirror y)
		(unit 1)
		(exclude_from_sim no)
		(in_bom yes)
		(on_board yes)
		(dnp no)
		(uuid "00000000-0000-0000-0000-000061b23fbd")
		(property "Reference" "R19"
			(at 163.6014 94.0816 0)
			(effects
				(font
					(size 1.27 1.27)
				)
				(justify left)
			)
		)
		(property "Value" "4.7k"
			(at 163.6014 96.393 0)
			(effects
				(font
					(size 1.27 1.27)
				)
				(justify left)
			)
		)
		(property "Footprint" "Resistor_SMD:R_0603_1608Metric"
			(at 165.1 95.25 0)
			(effects
				(font
					(size 1.27 1.27)
				)
				(hide yes)
			)
		)
		(property "Datasheet" "~"
			(at 165.1 95.25 0)
			(effects
				(font
					(size 1.27 1.27)
				)
				(hide yes)
			)
		)
		(property "Description" ""
			(at 165.1 95.25 0)
			(effects
				(font
					(size 1.27 1.27)
				)
				(hide yes)
			)
		)
		(property "Mfr" "RG1005P-472-D-T10"
			(at 165.1 95.25 0)
			(effects
				(font
					(size 1.27 1.27)
				)
				(hide yes)
			)
		)
		(pin "1"
			(uuid "65300ee5-a9f7-4d01-bccf-545a7a25e839")
		)
		(pin "2"
			(uuid "9901a9e5-6747-4540-ae5c-943d9ccc39cb")
		)
		(instances
			(project "branch_high_voltage"
				(path "/dbca94a9-194b-1234-8e89-e62dd00d8253/00000000-0000-0000-0000-000061b1a559"
					(reference "R19")
					(unit 1)
				)
			)
		)
	)
	(symbol
		(lib_id "power:GND")
		(at 165.1 99.06 0)
		(unit 1)
		(exclude_from_sim no)
		(in_bom yes)
		(on_board yes)
		(dnp no)
		(uuid "00000000-0000-0000-0000-000061b23fc4")
		(property "Reference" "#PWR076"
			(at 165.1 105.41 0)
			(effects
				(font
					(size 1.27 1.27)
				)
				(hide yes)
			)
		)
		(property "Value" "GND"
			(at 165.227 103.4542 0)
			(effects
				(font
					(size 1.27 1.27)
				)
			)
		)
		(property "Footprint" ""
			(at 165.1 99.06 0)
			(effects
				(font
					(size 1.27 1.27)
				)
				(hide yes)
			)
		)
		(property "Datasheet" ""
			(at 165.1 99.06 0)
			(effects
				(font
					(size 1.27 1.27)
				)
				(hide yes)
			)
		)
		(property "Description" ""
			(at 165.1 99.06 0)
			(effects
				(font
					(size 1.27 1.27)
				)
				(hide yes)
			)
		)
		(pin "1"
			(uuid "023dfff5-d966-4914-9931-dc59037ed9e0")
		)
		(instances
			(project "branch_high_voltage"
				(path "/dbca94a9-194b-1234-8e89-e62dd00d8253/00000000-0000-0000-0000-000061b1a559"
					(reference "#PWR076")
					(unit 1)
				)
			)
		)
	)
	(symbol
		(lib_id "Device:Q_NMOS_GSD")
		(at 172.72 90.17 0)
		(unit 1)
		(exclude_from_sim no)
		(in_bom yes)
		(on_board yes)
		(dnp no)
		(uuid "00000000-0000-0000-0000-000061b23fcf")
		(property "Reference" "Q2"
			(at 177.927 89.0016 0)
			(effects
				(font
					(size 1.27 1.27)
				)
				(justify left)
			)
		)
		(property "Value" "2N7002WT1G"
			(at 177.927 91.313 0)
			(effects
				(font
					(size 1.27 1.27)
				)
				(justify left)
			)
		)
		(property "Footprint" "Package_TO_SOT_SMD:SOT-323_SC-70"
			(at 177.8 87.63 0)
			(effects
				(font
					(size 1.27 1.27)
				)
				(hide yes)
			)
		)
		(property "Datasheet" "https://www.mouser.de/datasheet/2/308/2N7002W_D-1710338.pdf"
			(at 172.72 90.17 0)
			(effects
				(font
					(size 1.27 1.27)
				)
				(hide yes)
			)
		)
		(property "Description" ""
			(at 172.72 90.17 0)
			(effects
				(font
					(size 1.27 1.27)
				)
				(hide yes)
			)
		)
		(property "Mfr" "2N7002WT1G"
			(at 172.72 90.17 0)
			(effects
				(font
					(size 1.27 1.27)
				)
				(hide yes)
			)
		)
		(pin "1"
			(uuid "e077788a-eb58-440e-af12-f474fec034b3")
		)
		(pin "2"
			(uuid "f225a39a-cdc4-4a34-b6b5-3cf8fa441b78")
		)
		(pin "3"
			(uuid "ccebdf04-e33f-4695-a0e5-58e5668a50f4")
		)
		(instances
			(project "branch_high_voltage"
				(path "/dbca94a9-194b-1234-8e89-e62dd00d8253/00000000-0000-0000-0000-000061b1a559"
					(reference "Q2")
					(unit 1)
				)
			)
		)
	)
	(symbol
		(lib_id "Device:R_Small")
		(at 175.26 74.93 0)
		(mirror y)
		(unit 1)
		(exclude_from_sim no)
		(in_bom yes)
		(on_board yes)
		(dnp no)
		(uuid "00000000-0000-0000-0000-000061b23fdb")
		(property "Reference" "R16"
			(at 173.7614 73.7616 0)
			(effects
				(font
					(size 1.27 1.27)
				)
				(justify left)
			)
		)
		(property "Value" "150"
			(at 173.7614 76.073 0)
			(effects
				(font
					(size 1.27 1.27)
				)
				(justify left)
			)
		)
		(property "Footprint" "Resistor_SMD:R_0603_1608Metric"
			(at 175.26 74.93 0)
			(effects
				(font
					(size 1.27 1.27)
				)
				(hide yes)
			)
		)
		(property "Datasheet" "~"
			(at 175.26 74.93 0)
			(effects
				(font
					(size 1.27 1.27)
				)
				(hide yes)
			)
		)
		(property "Description" ""
			(at 175.26 74.93 0)
			(effects
				(font
					(size 1.27 1.27)
				)
				(hide yes)
			)
		)
		(property "Mfr" "RG1005P-151-B-T10"
			(at 175.26 74.93 0)
			(effects
				(font
					(size 1.27 1.27)
				)
				(hide yes)
			)
		)
		(pin "1"
			(uuid "16246f85-e4ed-4e8b-b20b-3d89d20b2269")
		)
		(pin "2"
			(uuid "22ce4085-5e7f-4404-a415-6e830c6b5437")
		)
		(instances
			(project "branch_high_voltage"
				(path "/dbca94a9-194b-1234-8e89-e62dd00d8253/00000000-0000-0000-0000-000061b1a559"
					(reference "R16")
					(unit 1)
				)
			)
		)
	)
	(symbol
		(lib_id "power:+5V")
		(at 64.135 67.31 0)
		(mirror y)
		(unit 1)
		(exclude_from_sim no)
		(in_bom yes)
		(on_board yes)
		(dnp no)
		(uuid "00000000-0000-0000-0000-000061b396b8")
		(property "Reference" "#PWR068"
			(at 64.135 71.12 0)
			(effects
				(font
					(size 1.27 1.27)
				)
				(hide yes)
			)
		)
		(property "Value" "+5V"
			(at 63.754 62.9158 0)
			(effects
				(font
					(size 1.27 1.27)
				)
			)
		)
		(property "Footprint" ""
			(at 64.135 67.31 0)
			(effects
				(font
					(size 1.27 1.27)
				)
				(hide yes)
			)
		)
		(property "Datasheet" ""
			(at 64.135 67.31 0)
			(effects
				(font
					(size 1.27 1.27)
				)
				(hide yes)
			)
		)
		(property "Description" ""
			(at 64.135 67.31 0)
			(effects
				(font
					(size 1.27 1.27)
				)
				(hide yes)
			)
		)
		(pin "1"
			(uuid "f638e059-da7b-4d61-9f79-dfa8a52c8dc3")
		)
		(instances
			(project "branch_high_voltage"
				(path "/dbca94a9-194b-1234-8e89-e62dd00d8253/00000000-0000-0000-0000-000061b1a559"
					(reference "#PWR068")
					(unit 1)
				)
			)
		)
	)
	(symbol
		(lib_id "Device:C_Small")
		(at 53.975 74.93 0)
		(mirror x)
		(unit 1)
		(exclude_from_sim no)
		(in_bom yes)
		(on_board yes)
		(dnp no)
		(uuid "00000000-0000-0000-0000-000061b396c0")
		(property "Reference" "C9"
			(at 52.705 73.66 0)
			(effects
				(font
					(size 1.27 1.27)
				)
				(justify right)
			)
		)
		(property "Value" "1u"
			(at 52.705 76.2 0)
			(effects
				(font
					(size 1.27 1.27)
				)
				(justify right)
			)
		)
		(property "Footprint" "Capacitor_SMD:C_0603_1608Metric"
			(at 53.975 74.93 0)
			(effects
				(font
					(size 1.27 1.27)
				)
				(hide yes)
			)
		)
		(property "Datasheet" "~"
			(at 53.975 74.93 0)
			(effects
				(font
					(size 1.27 1.27)
				)
				(hide yes)
			)
		)
		(property "Description" ""
			(at 53.975 74.93 0)
			(effects
				(font
					(size 1.27 1.27)
				)
				(hide yes)
			)
		)
		(property "Mfr" " 963-GMK105CC6105KV-F "
			(at 53.975 74.93 0)
			(effects
				(font
					(size 1.27 1.27)
				)
				(hide yes)
			)
		)
		(pin "1"
			(uuid "d299af81-dab0-470f-add2-ced54374e501")
		)
		(pin "2"
			(uuid "614dc29a-7622-45a4-b7f8-310152cdd60b")
		)
		(instances
			(project "branch_high_voltage"
				(path "/dbca94a9-194b-1234-8e89-e62dd00d8253/00000000-0000-0000-0000-000061b1a559"
					(reference "C9")
					(unit 1)
				)
			)
		)
	)
	(symbol
		(lib_id "power:GND")
		(at 53.975 77.47 0)
		(unit 1)
		(exclude_from_sim no)
		(in_bom yes)
		(on_board yes)
		(dnp no)
		(uuid "00000000-0000-0000-0000-000061b396c7")
		(property "Reference" "#PWR071"
			(at 53.975 83.82 0)
			(effects
				(font
					(size 1.27 1.27)
				)
				(hide yes)
			)
		)
		(property "Value" "GND"
			(at 54.102 81.8642 0)
			(effects
				(font
					(size 1.27 1.27)
				)
			)
		)
		(property "Footprint" ""
			(at 53.975 77.47 0)
			(effects
				(font
					(size 1.27 1.27)
				)
				(hide yes)
			)
		)
		(property "Datasheet" ""
			(at 53.975 77.47 0)
			(effects
				(font
					(size 1.27 1.27)
				)
				(hide yes)
			)
		)
		(property "Description" ""
			(at 53.975 77.47 0)
			(effects
				(font
					(size 1.27 1.27)
				)
				(hide yes)
			)
		)
		(pin "1"
			(uuid "ea9ad945-4fc4-412a-a802-b2f425b08b01")
		)
		(instances
			(project "branch_high_voltage"
				(path "/dbca94a9-194b-1234-8e89-e62dd00d8253/00000000-0000-0000-0000-000061b1a559"
					(reference "#PWR071")
					(unit 1)
				)
			)
		)
	)
	(symbol
		(lib_id "power:GND")
		(at 64.135 99.06 0)
		(unit 1)
		(exclude_from_sim no)
		(in_bom yes)
		(on_board yes)
		(dnp no)
		(uuid "00000000-0000-0000-0000-000061b396d1")
		(property "Reference" "#PWR075"
			(at 64.135 105.41 0)
			(effects
				(font
					(size 1.27 1.27)
				)
				(hide yes)
			)
		)
		(property "Value" "GND"
			(at 64.262 103.4542 0)
			(effects
				(font
					(size 1.27 1.27)
				)
			)
		)
		(property "Footprint" ""
			(at 64.135 99.06 0)
			(effects
				(font
					(size 1.27 1.27)
				)
				(hide yes)
			)
		)
		(property "Datasheet" ""
			(at 64.135 99.06 0)
			(effects
				(font
					(size 1.27 1.27)
				)
				(hide yes)
			)
		)
		(property "Description" ""
			(at 64.135 99.06 0)
			(effects
				(font
					(size 1.27 1.27)
				)
				(hide yes)
			)
		)
		(pin "1"
			(uuid "7d4b9e1c-9168-4c26-bbe2-18fec964549b")
		)
		(instances
			(project "branch_high_voltage"
				(path "/dbca94a9-194b-1234-8e89-e62dd00d8253/00000000-0000-0000-0000-000061b1a559"
					(reference "#PWR075")
					(unit 1)
				)
			)
		)
	)
	(symbol
		(lib_id "Device:R_Small")
		(at 53.975 95.25 0)
		(mirror y)
		(unit 1)
		(exclude_from_sim no)
		(in_bom yes)
		(on_board yes)
		(dnp no)
		(uuid "00000000-0000-0000-0000-000061b396d7")
		(property "Reference" "R18"
			(at 52.4764 94.0816 0)
			(effects
				(font
					(size 1.27 1.27)
				)
				(justify left)
			)
		)
		(property "Value" "4.7k"
			(at 52.4764 96.393 0)
			(effects
				(font
					(size 1.27 1.27)
				)
				(justify left)
			)
		)
		(property "Footprint" "Resistor_SMD:R_0603_1608Metric"
			(at 53.975 95.25 0)
			(effects
				(font
					(size 1.27 1.27)
				)
				(hide yes)
			)
		)
		(property "Datasheet" "~"
			(at 53.975 95.25 0)
			(effects
				(font
					(size 1.27 1.27)
				)
				(hide yes)
			)
		)
		(property "Description" ""
			(at 53.975 95.25 0)
			(effects
				(font
					(size 1.27 1.27)
				)
				(hide yes)
			)
		)
		(property "Mfr" "RG1005P-472-D-T10"
			(at 53.975 95.25 0)
			(effects
				(font
					(size 1.27 1.27)
				)
				(hide yes)
			)
		)
		(pin "1"
			(uuid "cbc20025-57a8-45a2-88f5-aee3f258fb1b")
		)
		(pin "2"
			(uuid "16f67f85-64a7-4b98-8135-a8182e8c8bd1")
		)
		(instances
			(project "branch_high_voltage"
				(path "/dbca94a9-194b-1234-8e89-e62dd00d8253/00000000-0000-0000-0000-000061b1a559"
					(reference "R18")
					(unit 1)
				)
			)
		)
	)
	(symbol
		(lib_id "power:GND")
		(at 53.975 99.06 0)
		(unit 1)
		(exclude_from_sim no)
		(in_bom yes)
		(on_board yes)
		(dnp no)
		(uuid "00000000-0000-0000-0000-000061b396de")
		(property "Reference" "#PWR074"
			(at 53.975 105.41 0)
			(effects
				(font
					(size 1.27 1.27)
				)
				(hide yes)
			)
		)
		(property "Value" "GND"
			(at 54.102 103.4542 0)
			(effects
				(font
					(size 1.27 1.27)
				)
			)
		)
		(property "Footprint" ""
			(at 53.975 99.06 0)
			(effects
				(font
					(size 1.27 1.27)
				)
				(hide yes)
			)
		)
		(property "Datasheet" ""
			(at 53.975 99.06 0)
			(effects
				(font
					(size 1.27 1.27)
				)
				(hide yes)
			)
		)
		(property "Description" ""
			(at 53.975 99.06 0)
			(effects
				(font
					(size 1.27 1.27)
				)
				(hide yes)
			)
		)
		(pin "1"
			(uuid "4e788cb9-2784-4998-b3e5-3eb018371dc5")
		)
		(instances
			(project "branch_high_voltage"
				(path "/dbca94a9-194b-1234-8e89-e62dd00d8253/00000000-0000-0000-0000-000061b1a559"
					(reference "#PWR074")
					(unit 1)
				)
			)
		)
	)
	(symbol
		(lib_id "Device:Q_NMOS_GSD")
		(at 61.595 90.17 0)
		(unit 1)
		(exclude_from_sim no)
		(in_bom yes)
		(on_board yes)
		(dnp no)
		(uuid "00000000-0000-0000-0000-000061b396e9")
		(property "Reference" "Q1"
			(at 66.802 89.0016 0)
			(effects
				(font
					(size 1.27 1.27)
				)
				(justify left)
			)
		)
		(property "Value" "2N7002WT1G"
			(at 66.802 91.313 0)
			(effects
				(font
					(size 1.27 1.27)
				)
				(justify left)
			)
		)
		(property "Footprint" "Package_TO_SOT_SMD:SOT-323_SC-70"
			(at 66.675 87.63 0)
			(effects
				(font
					(size 1.27 1.27)
				)
				(hide yes)
			)
		)
		(property "Datasheet" "https://www.mouser.de/datasheet/2/308/2N7002W_D-1710338.pdf"
			(at 61.595 90.17 0)
			(effects
				(font
					(size 1.27 1.27)
				)
				(hide yes)
			)
		)
		(property "Description" ""
			(at 61.595 90.17 0)
			(effects
				(font
					(size 1.27 1.27)
				)
				(hide yes)
			)
		)
		(property "Mfr" "2N7002WT1G"
			(at 61.595 90.17 0)
			(effects
				(font
					(size 1.27 1.27)
				)
				(hide yes)
			)
		)
		(pin "1"
			(uuid "2065db11-1b15-41c9-8048-1169f6278f54")
		)
		(pin "2"
			(uuid "d8eb7c70-5fff-4d9e-b875-19bacee23663")
		)
		(pin "3"
			(uuid "1adc8f24-3752-4d11-ac54-15f13de4b391")
		)
		(instances
			(project "branch_high_voltage"
				(path "/dbca94a9-194b-1234-8e89-e62dd00d8253/00000000-0000-0000-0000-000061b1a559"
					(reference "Q1")
					(unit 1)
				)
			)
		)
	)
	(symbol
		(lib_id "Device:LED_Small")
		(at 64.135 81.28 270)
		(mirror x)
		(unit 1)
		(exclude_from_sim no)
		(in_bom yes)
		(on_board yes)
		(dnp no)
		(uuid "00000000-0000-0000-0000-000061b396ef")
		(property "Reference" "D21"
			(at 66.6242 80.1116 90)
			(effects
				(font
					(size 1.27 1.27)
				)
				(justify left)
			)
		)
		(property "Value" "IN-S124ARUR"
			(at 66.6242 82.423 90)
			(effects
				(font
					(size 1.27 1.27)
				)
				(justify left)
			)
		)
		(property "Footprint" "LEGOS:LED_1204_3212Metric_ReverseMount_Hole1.8x2.4mm"
			(at 64.135 81.28 90)
			(effects
				(font
					(size 1.27 1.27)
				)
				(hide yes)
			)
		)
		(property "Datasheet" "http://inolux-corp.com/datasheet/SMDLED/Mono%20Color%20Reverse%20Mount/IN-S124AR%20Series_V1.0.pdf"
			(at 64.135 81.28 90)
			(effects
				(font
					(size 1.27 1.27)
				)
				(hide yes)
			)
		)
		(property "Description" ""
			(at 64.135 81.28 0)
			(effects
				(font
					(size 1.27 1.27)
				)
				(hide yes)
			)
		)
		(property "Mfr" "IN-S124ARUR"
			(at 64.135 81.28 0)
			(effects
				(font
					(size 1.27 1.27)
				)
				(hide yes)
			)
		)
		(pin "1"
			(uuid "df56bc74-84ad-4333-89d8-7480135bf1a4")
		)
		(pin "2"
			(uuid "b2b39b8b-2eb1-4cc1-8c9e-f48f219c08fe")
		)
		(instances
			(project "branch_high_voltage"
				(path "/dbca94a9-194b-1234-8e89-e62dd00d8253/00000000-0000-0000-0000-000061b1a559"
					(reference "D21")
					(unit 1)
				)
			)
		)
	)
	(symbol
		(lib_id "Device:R_Small")
		(at 64.135 74.93 0)
		(mirror y)
		(unit 1)
		(exclude_from_sim no)
		(in_bom yes)
		(on_board yes)
		(dnp no)
		(uuid "00000000-0000-0000-0000-000061b396f5")
		(property "Reference" "R15"
			(at 62.6364 73.7616 0)
			(effects
				(font
					(size 1.27 1.27)
				)
				(justify left)
			)
		)
		(property "Value" "150"
			(at 62.6364 76.073 0)
			(effects
				(font
					(size 1.27 1.27)
				)
				(justify left)
			)
		)
		(property "Footprint" "Resistor_SMD:R_0603_1608Metric"
			(at 64.135 74.93 0)
			(effects
				(font
					(size 1.27 1.27)
				)
				(hide yes)
			)
		)
		(property "Datasheet" "~"
			(at 64.135 74.93 0)
			(effects
				(font
					(size 1.27 1.27)
				)
				(hide yes)
			)
		)
		(property "Description" ""
			(at 64.135 74.93 0)
			(effects
				(font
					(size 1.27 1.27)
				)
				(hide yes)
			)
		)
		(property "Mfr" "RG1005P-151-B-T10"
			(at 64.135 74.93 0)
			(effects
				(font
					(size 1.27 1.27)
				)
				(hide yes)
			)
		)
		(pin "1"
			(uuid "175e6516-51a9-4ff5-b1a8-5f5efe4b2a87")
		)
		(pin "2"
			(uuid "53c623c7-83ca-4df1-a076-1de48899d9fd")
		)
		(instances
			(project "branch_high_voltage"
				(path "/dbca94a9-194b-1234-8e89-e62dd00d8253/00000000-0000-0000-0000-000061b1a559"
					(reference "R15")
					(unit 1)
				)
			)
		)
	)
	(symbol
		(lib_id "Device:LED_Small")
		(at 175.26 81.28 270)
		(mirror x)
		(unit 1)
		(exclude_from_sim no)
		(in_bom yes)
		(on_board yes)
		(dnp no)
		(uuid "a7d2774a-4434-413a-a25c-838e9569665f")
		(property "Reference" "D22"
			(at 177.7492 80.1116 90)
			(effects
				(font
					(size 1.27 1.27)
				)
				(justify left)
			)
		)
		(property "Value" "IN-S124ARUA"
			(at 177.7492 82.423 90)
			(effects
				(font
					(size 1.27 1.27)
				)
				(justify left)
			)
		)
		(property "Footprint" "LEGOS:LED_1204_3212Metric_ReverseMount_Hole1.8x2.4mm"
			(at 175.26 81.28 90)
			(effects
				(font
					(size 1.27 1.27)
				)
				(hide yes)
			)
		)
		(property "Datasheet" "http://inolux-corp.com/datasheet/SMDLED/Mono%20Color%20Reverse%20Mount/IN-S124AR%20Series_V1.0.pdf"
			(at 175.26 81.28 90)
			(effects
				(font
					(size 1.27 1.27)
				)
				(hide yes)
			)
		)
		(property "Description" ""
			(at 175.26 81.28 0)
			(effects
				(font
					(size 1.27 1.27)
				)
				(hide yes)
			)
		)
		(property "Mfr" "IN-S124ARUA"
			(at 175.26 81.28 0)
			(effects
				(font
					(size 1.27 1.27)
				)
				(hide yes)
			)
		)
		(pin "1"
			(uuid "fc45cce9-95e6-4d42-ace1-c34cf56c11d2")
		)
		(pin "2"
			(uuid "2a89afa9-f798-4d11-b1dd-a3be636b238c")
		)
		(instances
			(project "branch_high_voltage"
				(path "/dbca94a9-194b-1234-8e89-e62dd00d8253/00000000-0000-0000-0000-000061b1a559"
					(reference "D22")
					(unit 1)
				)
			)
		)
	)
)
