(kicad_sch
	(version 20231120)
	(generator "eeschema")
	(generator_version "8.0")
	(uuid "37060b07-1db4-4234-8fa4-a3077e0e8ba1")
	(paper "A4")
	(title_block
		(title "Sub Mechanical")
		(date "2020-10-02")
		(rev "1.1")
		(company "Institute for Automation of Complex Power Systems - E.ON ERC - RWTH Aachen University")
		(comment 1 "Designer: D.Wienands, S.Melcher, L.Jeske, D.Moll, M.Nowak")
		(comment 2 "Supervisor: C. Guarnieri Calò Carducci, J.Klimt")
	)
	(lib_symbols
		(symbol "Mechanical:MountingHole"
			(pin_names
				(offset 1.016)
			)
			(exclude_from_sim no)
			(in_bom yes)
			(on_board yes)
			(property "Reference" "H"
				(at 0 5.08 0)
				(effects
					(font
						(size 1.27 1.27)
					)
				)
			)
			(property "Value" "MountingHole"
				(at 0 3.175 0)
				(effects
					(font
						(size 1.27 1.27)
					)
				)
			)
			(property "Footprint" ""
				(at 0 0 0)
				(effects
					(font
						(size 1.27 1.27)
					)
					(hide yes)
				)
			)
			(property "Datasheet" "~"
				(at 0 0 0)
				(effects
					(font
						(size 1.27 1.27)
					)
					(hide yes)
				)
			)
			(property "Description" "Mounting Hole without connection"
				(at 0 0 0)
				(effects
					(font
						(size 1.27 1.27)
					)
					(hide yes)
				)
			)
			(property "ki_keywords" "mounting hole"
				(at 0 0 0)
				(effects
					(font
						(size 1.27 1.27)
					)
					(hide yes)
				)
			)
			(property "ki_fp_filters" "MountingHole*"
				(at 0 0 0)
				(effects
					(font
						(size 1.27 1.27)
					)
					(hide yes)
				)
			)
			(symbol "MountingHole_0_1"
				(circle
					(center 0 0)
					(radius 1.27)
					(stroke
						(width 1.27)
						(type default)
					)
					(fill
						(type none)
					)
				)
			)
		)
	)
	(symbol
		(lib_id "Mechanical:MountingHole")
		(at 101.6 63.5 0)
		(unit 1)
		(exclude_from_sim no)
		(in_bom yes)
		(on_board yes)
		(dnp no)
		(uuid "00000000-0000-0000-0000-00005f54dcab")
		(property "Reference" "H1"
			(at 104.14 62.3316 0)
			(effects
				(font
					(size 1.27 1.27)
				)
				(justify left)
			)
		)
		(property "Value" "MountingHole"
			(at 104.14 64.643 0)
			(effects
				(font
					(size 1.27 1.27)
				)
				(justify left)
			)
		)
		(property "Footprint" "LEGOS:WA-SMSI_Wuerth_97730356332"
			(at 101.6 63.5 0)
			(effects
				(font
					(size 1.27 1.27)
				)
				(hide yes)
			)
		)
		(property "Datasheet" "https://www.we-online.de/katalog/en/SMSI_SMT_STEEL_SPACER_M1_6_INTERNAL_BOTTOM_CLOSED_W_PIN/"
			(at 101.6 63.5 0)
			(effects
				(font
					(size 1.27 1.27)
				)
				(hide yes)
			)
		)
		(property "Description" ""
			(at 101.6 63.5 0)
			(effects
				(font
					(size 1.27 1.27)
				)
				(hide yes)
			)
		)
		(instances
			(project ""
				(path "/070b6eb9-3ecf-416c-b89d-2858d09009c5/00000000-0000-0000-0000-00005f5772d0"
					(reference "H1")
					(unit 1)
				)
			)
		)
	)
	(symbol
		(lib_id "Mechanical:MountingHole")
		(at 101.6 76.2 0)
		(unit 1)
		(exclude_from_sim no)
		(in_bom yes)
		(on_board yes)
		(dnp no)
		(uuid "00000000-0000-0000-0000-00005f54e3ee")
		(property "Reference" "H2"
			(at 104.14 75.0316 0)
			(effects
				(font
					(size 1.27 1.27)
				)
				(justify left)
			)
		)
		(property "Value" "MountingHole"
			(at 104.14 77.343 0)
			(effects
				(font
					(size 1.27 1.27)
				)
				(justify left)
			)
		)
		(property "Footprint" "LEGOS:WA-SMSI_Wuerth_97730356332"
			(at 101.6 76.2 0)
			(effects
				(font
					(size 1.27 1.27)
				)
				(hide yes)
			)
		)
		(property "Datasheet" "https://www.we-online.de/katalog/en/SMSI_SMT_STEEL_SPACER_M1_6_INTERNAL_BOTTOM_CLOSED_W_PIN/"
			(at 101.6 76.2 0)
			(effects
				(font
					(size 1.27 1.27)
				)
				(hide yes)
			)
		)
		(property "Description" ""
			(at 101.6 76.2 0)
			(effects
				(font
					(size 1.27 1.27)
				)
				(hide yes)
			)
		)
		(instances
			(project ""
				(path "/070b6eb9-3ecf-416c-b89d-2858d09009c5/00000000-0000-0000-0000-00005f5772d0"
					(reference "H2")
					(unit 1)
				)
			)
		)
	)
	(symbol
		(lib_id "Mechanical:MountingHole")
		(at 101.6 88.9 0)
		(unit 1)
		(exclude_from_sim no)
		(in_bom yes)
		(on_board yes)
		(dnp no)
		(uuid "00000000-0000-0000-0000-00005f54e664")
		(property "Reference" "H3"
			(at 104.14 87.7316 0)
			(effects
				(font
					(size 1.27 1.27)
				)
				(justify left)
			)
		)
		(property "Value" "MountingHole"
			(at 104.14 90.043 0)
			(effects
				(font
					(size 1.27 1.27)
				)
				(justify left)
			)
		)
		(property "Footprint" "LEGOS:WA-SMSI_Wuerth_97730356332"
			(at 101.6 88.9 0)
			(effects
				(font
					(size 1.27 1.27)
				)
				(hide yes)
			)
		)
		(property "Datasheet" "https://www.we-online.de/katalog/en/SMSI_SMT_STEEL_SPACER_M1_6_INTERNAL_BOTTOM_CLOSED_W_PIN/"
			(at 101.6 88.9 0)
			(effects
				(font
					(size 1.27 1.27)
				)
				(hide yes)
			)
		)
		(property "Description" ""
			(at 101.6 88.9 0)
			(effects
				(font
					(size 1.27 1.27)
				)
				(hide yes)
			)
		)
		(instances
			(project ""
				(path "/070b6eb9-3ecf-416c-b89d-2858d09009c5/00000000-0000-0000-0000-00005f5772d0"
					(reference "H3")
					(unit 1)
				)
			)
		)
	)
	(symbol
		(lib_id "Mechanical:MountingHole")
		(at 127 63.5 0)
		(unit 1)
		(exclude_from_sim no)
		(in_bom yes)
		(on_board yes)
		(dnp no)
		(uuid "00000000-0000-0000-0000-00005f54fb8f")
		(property "Reference" "H4"
			(at 129.54 62.3316 0)
			(effects
				(font
					(size 1.27 1.27)
				)
				(justify left)
			)
		)
		(property "Value" "MountingHole"
			(at 129.54 64.643 0)
			(effects
				(font
					(size 1.27 1.27)
				)
				(justify left)
			)
		)
		(property "Footprint" "LEGOS:WA-SMSI_Wuerth_97730356332"
			(at 127 63.5 0)
			(effects
				(font
					(size 1.27 1.27)
				)
				(hide yes)
			)
		)
		(property "Datasheet" "https://www.we-online.de/katalog/en/SMSI_SMT_STEEL_SPACER_M1_6_INTERNAL_BOTTOM_CLOSED_W_PIN/"
			(at 127 63.5 0)
			(effects
				(font
					(size 1.27 1.27)
				)
				(hide yes)
			)
		)
		(property "Description" ""
			(at 127 63.5 0)
			(effects
				(font
					(size 1.27 1.27)
				)
				(hide yes)
			)
		)
		(instances
			(project ""
				(path "/070b6eb9-3ecf-416c-b89d-2858d09009c5/00000000-0000-0000-0000-00005f5772d0"
					(reference "H4")
					(unit 1)
				)
			)
		)
	)
	(symbol
		(lib_id "Mechanical:MountingHole")
		(at 127 76.2 0)
		(unit 1)
		(exclude_from_sim no)
		(in_bom yes)
		(on_board yes)
		(dnp no)
		(uuid "00000000-0000-0000-0000-00005f54fb95")
		(property "Reference" "H5"
			(at 129.54 75.0316 0)
			(effects
				(font
					(size 1.27 1.27)
				)
				(justify left)
			)
		)
		(property "Value" "MountingHole"
			(at 129.54 77.343 0)
			(effects
				(font
					(size 1.27 1.27)
				)
				(justify left)
			)
		)
		(property "Footprint" "LEGOS:WA-SMSI_Wuerth_97730356332"
			(at 127 76.2 0)
			(effects
				(font
					(size 1.27 1.27)
				)
				(hide yes)
			)
		)
		(property "Datasheet" "https://www.we-online.de/katalog/en/SMSI_SMT_STEEL_SPACER_M1_6_INTERNAL_BOTTOM_CLOSED_W_PIN/"
			(at 127 76.2 0)
			(effects
				(font
					(size 1.27 1.27)
				)
				(hide yes)
			)
		)
		(property "Description" ""
			(at 127 76.2 0)
			(effects
				(font
					(size 1.27 1.27)
				)
				(hide yes)
			)
		)
		(instances
			(project ""
				(path "/070b6eb9-3ecf-416c-b89d-2858d09009c5/00000000-0000-0000-0000-00005f5772d0"
					(reference "H5")
					(unit 1)
				)
			)
		)
	)
	(symbol
		(lib_id "Mechanical:MountingHole")
		(at 127 88.9 0)
		(unit 1)
		(exclude_from_sim no)
		(in_bom yes)
		(on_board yes)
		(dnp no)
		(uuid "00000000-0000-0000-0000-00005f54fb9b")
		(property "Reference" "H6"
			(at 129.54 87.7316 0)
			(effects
				(font
					(size 1.27 1.27)
				)
				(justify left)
			)
		)
		(property "Value" "MountingHole"
			(at 129.54 90.043 0)
			(effects
				(font
					(size 1.27 1.27)
				)
				(justify left)
			)
		)
		(property "Footprint" "LEGOS:WA-SMSI_Wuerth_97730356332"
			(at 127 88.9 0)
			(effects
				(font
					(size 1.27 1.27)
				)
				(hide yes)
			)
		)
		(property "Datasheet" "https://www.we-online.de/katalog/en/SMSI_SMT_STEEL_SPACER_M1_6_INTERNAL_BOTTOM_CLOSED_W_PIN/"
			(at 127 88.9 0)
			(effects
				(font
					(size 1.27 1.27)
				)
				(hide yes)
			)
		)
		(property "Description" ""
			(at 127 88.9 0)
			(effects
				(font
					(size 1.27 1.27)
				)
				(hide yes)
			)
		)
		(instances
			(project ""
				(path "/070b6eb9-3ecf-416c-b89d-2858d09009c5/00000000-0000-0000-0000-00005f5772d0"
					(reference "H6")
					(unit 1)
				)
			)
		)
	)
)
