(module Power_min (layer F.Cu) (tedit 5F7DAD5D)
  (fp_text reference Ref** (at 0 0) (layer F.SilkS) hide
    (effects (font (size 1.27 1.27) (thickness 0.15)))
  )
  (fp_text value Val** (at 0 0) (layer F.SilkS) hide
    (effects (font (size 1.27 1.27) (thickness 0.15)))
  )
  (fp_line (start 1 -3.6) (end -2.2 0.5) (layer F.SilkS) (width 0.25))
  (fp_line (start -2.2 0.5) (end 0 0.5) (layer F.SilkS) (width 0.25))
  (fp_line (start 0 0.5) (end -1 3.5) (layer F.SilkS) (width 0.25))
  (fp_line (start -1 3.5) (end 2.2 -0.5) (layer F.SilkS) (width 0.25))
  (fp_line (start 2.2 -0.5) (end 0.1 -0.5) (layer F.SilkS) (width 0.25))
  (fp_line (start 0.1 -0.5) (end 1 -3.6) (layer F.SilkS) (width 0.25))
)
