(kicad_pcb (version 20171130) (host pcbnew "(5.1.6)-1")

  (general
    (thickness 1.6)
    (drawings 99)
    (tracks 0)
    (zones 0)
    (modules 0)
    (nets 1)
  )

  (page A4)
  (title_block
    (title "Node Cover A")
    (date 2020-06-03)
    (rev 1)
    (company "Institute for Automation of Complex Power Systems - E.ON ERC - RWTH Aachen University")
    (comment 1 "Designer: D. Wienands, S. Melcher, L. Jeske, D. Moll")
    (comment 2 "Supervisor: C. Guarnieri Calò Carducci")
  )

  (layers
    (0 F.Cu signal)
    (1 In1.Cu power)
    (2 In2.Cu power)
    (31 B.Cu signal)
    (32 B.Adhes user)
    (33 F.Adhes user)
    (34 B.Paste user)
    (35 F.Paste user)
    (36 B.SilkS user)
    (37 F.SilkS user)
    (38 B.Mask user)
    (39 F.Mask user)
    (40 Dwgs.User user)
    (41 Cmts.User user)
    (42 Eco1.User user)
    (43 Eco2.User user)
    (44 Edge.Cuts user)
    (45 Margin user)
    (46 B.CrtYd user)
    (47 F.CrtYd user)
    (48 B.Fab user)
    (49 F.Fab user)
  )

  (setup
    (last_trace_width 0.25)
    (user_trace_width 0.15)
    (user_trace_width 0.15)
    (user_trace_width 0.15)
    (user_trace_width 0.5)
    (user_trace_width 0.5)
    (user_trace_width 0.5)
    (trace_clearance 0.2)
    (zone_clearance 0.2)
    (zone_45_only no)
    (trace_min 0.15)
    (via_size 0.6)
    (via_drill 0.25)
    (via_min_size 0.6)
    (via_min_drill 0.25)
    (uvia_size 0.5)
    (uvia_drill 0.1)
    (uvias_allowed no)
    (uvia_min_size 0.5)
    (uvia_min_drill 0.1)
    (edge_width 0.1)
    (segment_width 0.2)
    (pcb_text_width 0.2)
    (pcb_text_size 0.8 0.8)
    (mod_edge_width 0.15)
    (mod_text_size 0.6 0.6)
    (mod_text_width 0.15)
    (pad_size 1.33 0.53)
    (pad_drill 0)
    (pad_to_mask_clearance 0)
    (aux_axis_origin 150 100)
    (grid_origin 150 100)
    (visible_elements 7FFFFFFF)
    (pcbplotparams
      (layerselection 0x010fc_ffffffff)
      (usegerberextensions false)
      (usegerberattributes false)
      (usegerberadvancedattributes false)
      (creategerberjobfile false)
      (excludeedgelayer true)
      (linewidth 0.100000)
      (plotframeref false)
      (viasonmask false)
      (mode 1)
      (useauxorigin false)
      (hpglpennumber 1)
      (hpglpenspeed 20)
      (hpglpendiameter 15.000000)
      (psnegative false)
      (psa4output false)
      (plotreference true)
      (plotvalue true)
      (plotinvisibletext false)
      (padsonsilk false)
      (subtractmaskfromsilk false)
      (outputformat 1)
      (mirror false)
      (drillshape 1)
      (scaleselection 1)
      (outputdirectory ""))
  )

  (net 0 "")

  (net_class Default "This is the default net class."
    (clearance 0.2)
    (trace_width 0.25)
    (via_dia 0.6)
    (via_drill 0.25)
    (uvia_dia 0.5)
    (uvia_drill 0.1)
  )

  (gr_arc (start 152.598076 101.5) (end 137.875644 93) (angle -51.20915048) (layer Edge.Cuts) (width 0.1) (tstamp 5F95CB67))
  (gr_arc (start 152.598076 101.5) (end 137.875644 93) (angle 51.20915048) (layer Edge.Cuts) (width 0.1) (tstamp 5F95CB66))
  (gr_arc (start 147.401924 101.5) (end 162.124356 93) (angle -51.20915048) (layer Edge.Cuts) (width 0.1) (tstamp 5F95CB5E))
  (gr_arc (start 147.401924 101.5) (end 162.124356 93) (angle 51.20915048) (layer Edge.Cuts) (width 0.1) (tstamp 5F95CB5D))
  (gr_arc (start 150 97) (end 150 114) (angle -51.20915048) (layer Edge.Cuts) (width 0.1))
  (gr_arc (start 150 97) (end 150 114) (angle 51.20915048) (layer Edge.Cuts) (width 0.1))
  (dimension 30 (width 0.15) (layer Dwgs.User)
    (gr_text "30.000 mm" (at 165 145.9) (layer Dwgs.User)
      (effects (font (size 0.6 0.6) (thickness 0.15)))
    )
    (feature1 (pts (xy 150 100) (xy 150 145.586421)))
    (feature2 (pts (xy 180 100) (xy 180 145.586421)))
    (crossbar (pts (xy 180 145) (xy 150 145)))
    (arrow1a (pts (xy 150 145) (xy 151.126504 144.413579)))
    (arrow1b (pts (xy 150 145) (xy 151.126504 145.586421)))
    (arrow2a (pts (xy 180 145) (xy 178.873496 144.413579)))
    (arrow2b (pts (xy 180 145) (xy 178.873496 145.586421)))
  )
  (gr_arc (start 140.982291 81.13087) (end 141.848317 80.63087) (angle -90) (layer Edge.Cuts) (width 0.1) (tstamp 5F915041))
  (gr_line (start 143.332291 85.20119) (end 140.517709 86.82619) (layer Edge.Cuts) (width 0.1) (tstamp 5F915042))
  (gr_line (start 160.848317 86.460164) (end 162.698317 83.25587) (layer Edge.Cuts) (width 0.1) (tstamp 5F915067))
  (gr_arc (start 168.86913 90.982291) (end 169.36913 91.848317) (angle -90) (layer Edge.Cuts) (width 0.1) (tstamp 5F91507A))
  (gr_arc (start 161.832291 82.75587) (end 162.698317 83.25587) (angle -90) (layer Edge.Cuts) (width 0.1) (tstamp 5F915064))
  (gr_arc (start 159.982291 85.960164) (end 159.482291 86.82619) (angle -90) (layer Edge.Cuts) (width 0.1) (tstamp 5F915063))
  (gr_arc (start 157.167709 84.335164) (end 156.301683 83.835164) (angle -90) (layer Edge.Cuts) (width 0.1) (tstamp 5F915068))
  (gr_arc (start 164.039836 90.017709) (end 163.539836 89.151683) (angle -90) (layer Edge.Cuts) (width 0.1) (tstamp 5F91507F))
  (gr_line (start 168.110155 87.667709) (end 169.735155 90.482291) (layer Edge.Cuts) (width 0.1) (tstamp 5F915079))
  (gr_line (start 166.74413 87.301683) (end 163.539836 89.151683) (layer Edge.Cuts) (width 0.1) (tstamp 5F91507D))
  (gr_arc (start 138.167709 82.75587) (end 137.667709 81.889845) (angle -90) (layer Edge.Cuts) (width 0.1) (tstamp 5F915048))
  (gr_line (start 137.667709 81.889845) (end 140.482291 80.264845) (layer Edge.Cuts) (width 0.1) (tstamp 5F915046))
  (gr_arc (start 140.017709 85.960164) (end 139.151683 86.460164) (angle -90) (layer Edge.Cuts) (width 0.1) (tstamp 5F915045))
  (gr_line (start 137.301683 83.25587) (end 139.151683 86.460164) (layer Edge.Cuts) (width 0.1) (tstamp 5F915044))
  (gr_arc (start 142.832291 84.335164) (end 143.332291 85.20119) (angle -90) (layer Edge.Cuts) (width 0.1) (tstamp 5F915047))
  (gr_line (start 143.698317 83.835164) (end 141.848317 80.63087) (layer Edge.Cuts) (width 0.1) (tstamp 5F915043))
  (gr_arc (start 165.664836 92.832291) (end 164.79881 93.332291) (angle -90) (layer Edge.Cuts) (width 0.1) (tstamp 5F91507E))
  (gr_line (start 164.79881 93.332291) (end 163.17381 90.517709) (layer Edge.Cuts) (width 0.1) (tstamp 5F91507B))
  (gr_arc (start 167.24413 88.167709) (end 168.110155 87.667709) (angle -90) (layer Edge.Cuts) (width 0.1) (tstamp 5F915080))
  (gr_line (start 158.151683 80.63087) (end 156.301683 83.835164) (layer Edge.Cuts) (width 0.1) (tstamp 5F915066))
  (gr_line (start 159.517709 80.264845) (end 162.332291 81.889845) (layer Edge.Cuts) (width 0.1) (tstamp 5F915062))
  (gr_line (start 166.164836 93.698317) (end 169.36913 91.848317) (layer Edge.Cuts) (width 0.1) (tstamp 5F91507C))
  (gr_arc (start 159.017709 81.13087) (end 159.517709 80.264845) (angle -90) (layer Edge.Cuts) (width 0.1) (tstamp 5F915061))
  (gr_line (start 159.482291 86.82619) (end 156.667709 85.20119) (layer Edge.Cuts) (width 0.1) (tstamp 5F915065))
  (gr_arc (start 167.15 98.375) (end 167.15 97.375) (angle -90) (layer Edge.Cuts) (width 0.1) (tstamp 5F915029))
  (gr_arc (start 167.15 101.625) (end 166.15 101.625) (angle -90) (layer Edge.Cuts) (width 0.1) (tstamp 5F91502F))
  (gr_line (start 166.15 101.625) (end 166.15 98.375) (layer Edge.Cuts) (width 0.1) (tstamp 5F915030))
  (gr_line (start 170.85 97.375) (end 167.15 97.375) (layer Edge.Cuts) (width 0.1) (tstamp 5F91502D))
  (gr_arc (start 170.85 98.375) (end 171.85 98.375) (angle -90) (layer Edge.Cuts) (width 0.1) (tstamp 5F91502B))
  (gr_arc (start 170.85 101.625) (end 170.85 102.625) (angle -90) (layer Edge.Cuts) (width 0.1) (tstamp 5F91502E))
  (gr_line (start 167.15 102.625) (end 170.85 102.625) (layer Edge.Cuts) (width 0.1) (tstamp 5F91502A))
  (gr_line (start 171.85 98.375) (end 171.85 101.625) (layer Edge.Cuts) (width 0.1) (tstamp 5F91502C))
  (gr_arc (start 159.982291 114.039836) (end 160.848317 113.539836) (angle -90) (layer Edge.Cuts) (width 0.1) (tstamp 5F915013))
  (gr_line (start 133.85 98.375) (end 133.85 101.625) (layer Edge.Cuts) (width 0.1))
  (gr_arc (start 140.017709 114.039836) (end 140.517709 113.17381) (angle -90) (layer Edge.Cuts) (width 0.1) (tstamp 5F914FFF))
  (gr_line (start 129.15 102.625) (end 132.85 102.625) (layer Edge.Cuts) (width 0.1))
  (gr_line (start 132.85 97.375) (end 129.15 97.375) (layer Edge.Cuts) (width 0.1))
  (gr_line (start 128.15 101.625) (end 128.15 98.375) (layer Edge.Cuts) (width 0.1))
  (gr_arc (start 132.85 101.625) (end 132.85 102.625) (angle -90) (layer Edge.Cuts) (width 0.1) (tstamp 5F914F71))
  (gr_arc (start 129.15 98.375) (end 129.15 97.375) (angle -90) (layer Edge.Cuts) (width 0.1) (tstamp 5F914F78))
  (gr_arc (start 129.15 101.625) (end 128.15 101.625) (angle -90) (layer Edge.Cuts) (width 0.1) (tstamp 5F914F5D))
  (gr_arc (start 132.85 98.375) (end 133.85 98.375) (angle -90) (layer Edge.Cuts) (width 0.1))
  (gr_line (start 140.482291 119.735155) (end 137.667709 118.110155) (layer Edge.Cuts) (width 0.1) (tstamp 5F914FFE))
  (gr_arc (start 140.982291 118.86913) (end 140.482291 119.735155) (angle -90) (layer Edge.Cuts) (width 0.1) (tstamp 5F914FFC))
  (gr_arc (start 142.832291 115.664836) (end 143.698317 116.164836) (angle -90) (layer Edge.Cuts) (width 0.1) (tstamp 5F914FFB))
  (gr_line (start 139.151683 113.539836) (end 137.301683 116.74413) (layer Edge.Cuts) (width 0.1) (tstamp 5F914FF9))
  (gr_arc (start 138.167709 117.24413) (end 137.301683 116.74413) (angle -90) (layer Edge.Cuts) (width 0.1) (tstamp 5F914FFD))
  (gr_line (start 140.517709 113.17381) (end 143.332291 114.79881) (layer Edge.Cuts) (width 0.1) (tstamp 5F915000))
  (gr_line (start 141.848317 119.36913) (end 143.698317 116.164836) (layer Edge.Cuts) (width 0.1) (tstamp 5F914FFA))
  (gr_arc (start 161.832291 117.24413) (end 162.332291 118.110155) (angle -90) (layer Edge.Cuts) (width 0.1) (tstamp 5F915011))
  (gr_line (start 156.301683 116.164836) (end 158.151683 119.36913) (layer Edge.Cuts) (width 0.1) (tstamp 5F915015))
  (gr_line (start 162.698317 116.74413) (end 160.848317 113.539836) (layer Edge.Cuts) (width 0.1) (tstamp 5F915014))
  (gr_line (start 156.667709 114.79881) (end 159.482291 113.17381) (layer Edge.Cuts) (width 0.1) (tstamp 5F915012))
  (gr_arc (start 159.017709 118.86913) (end 158.151683 119.36913) (angle -90) (layer Edge.Cuts) (width 0.1) (tstamp 5F915016))
  (gr_arc (start 157.167709 115.664836) (end 156.667709 114.79881) (angle -90) (layer Edge.Cuts) (width 0.1) (tstamp 5F915017))
  (gr_line (start 162.332291 118.110155) (end 159.517709 119.735155) (layer Edge.Cuts) (width 0.1) (tstamp 5F915018))
  (gr_arc (start 125 110.5) (end 125 112.625) (angle -90) (layer Edge.Cuts) (width 0.1))
  (gr_line (start 122.775001 112.624999) (end 125 112.625) (layer Edge.Cuts) (width 0.1))
  (gr_line (start 127.125 110.5) (end 127.125 89.5) (layer Edge.Cuts) (width 0.1))
  (gr_line (start 122.775001 87.375001) (end 125 87.375) (layer Edge.Cuts) (width 0.1))
  (gr_arc (start 125 89.5) (end 127.125 89.5) (angle -90) (layer Edge.Cuts) (width 0.1))
  (gr_arc (start 150 100) (end 177.225 87.375) (angle -10.2430314) (layer Edge.Cuts) (width 0.1))
  (gr_arc (start 150 100) (end 147.321071 129.890042) (angle -10.24303039) (layer Edge.Cuts) (width 0.1))
  (gr_arc (start 128.406733 83.599365) (end 126.566429 84.661865) (angle -90) (layer Edge.Cuts) (width 0.1) (tstamp 5F914067))
  (gr_line (start 129.469233 85.439669) (end 147.655767 74.939669) (layer Edge.Cuts) (width 0.1) (tstamp 5F914069))
  (gr_arc (start 146.593267 73.099365) (end 147.655767 74.939669) (angle -90) (layer Edge.Cuts) (width 0.1) (tstamp 5F914068))
  (gr_arc (start 150 100) (end 174.546071 117.265042) (angle -10.24303013) (layer Edge.Cuts) (width 0.1))
  (gr_arc (start 150 100) (end 125.453929 82.734958) (angle -10.24303106) (layer Edge.Cuts) (width 0.1))
  (gr_arc (start 150 100) (end 122.775001 112.624999) (angle -10.24303279) (layer Edge.Cuts) (width 0.1))
  (gr_arc (start 150 100) (end 152.678929 70.109958) (angle -10.24303039) (layer Edge.Cuts) (width 0.1))
  (gr_line (start 177.225 87.375) (end 175 87.375) (layer Edge.Cuts) (width 0.1) (tstamp 5F914049))
  (gr_line (start 177.225 112.625) (end 175 112.625) (layer Edge.Cuts) (width 0.1) (tstamp 5F914047))
  (gr_line (start 152.678929 70.109958) (end 151.566429 72.036865) (layer Edge.Cuts) (width 0.1) (tstamp 5F914056))
  (gr_line (start 174.54607 82.734959) (end 173.433571 84.661865) (layer Edge.Cuts) (width 0.1) (tstamp 5F914057))
  (gr_line (start 125.453929 82.734958) (end 126.566429 84.661865) (layer Edge.Cuts) (width 0.1) (tstamp 5F914065))
  (gr_line (start 147.321071 70.109958) (end 148.433571 72.036865) (layer Edge.Cuts) (width 0.1) (tstamp 5F914066))
  (gr_line (start 172.875 89.5) (end 172.875 110.5) (layer Edge.Cuts) (width 0.1) (tstamp 5F914048))
  (gr_arc (start 153.406733 73.099365) (end 151.566429 72.036865) (angle -90) (layer Edge.Cuts) (width 0.1) (tstamp 5F914059))
  (gr_arc (start 171.593267 83.599365) (end 170.530767 85.439669) (angle -90) (layer Edge.Cuts) (width 0.1) (tstamp 5F91405A))
  (gr_arc (start 175 89.5) (end 175 87.375) (angle -90) (layer Edge.Cuts) (width 0.1) (tstamp 5F91404A))
  (gr_arc (start 175 110.5) (end 172.875 110.5) (angle -90) (layer Edge.Cuts) (width 0.1) (tstamp 5F91404B))
  (gr_line (start 152.344233 74.939669) (end 170.530767 85.439669) (layer Edge.Cuts) (width 0.1) (tstamp 5F914058))
  (gr_line (start 152.678929 129.890042) (end 151.566429 127.963135) (layer Edge.Cuts) (width 0.1) (tstamp 5F91403C))
  (gr_arc (start 146.593267 126.900635) (end 148.433571 127.963135) (angle -90) (layer Edge.Cuts) (width 0.1) (tstamp 5F914029))
  (gr_line (start 170.530767 114.560331) (end 152.344233 125.060331) (layer Edge.Cuts) (width 0.1) (tstamp 5F914039))
  (gr_line (start 174.546071 117.265042) (end 173.433571 115.338135) (layer Edge.Cuts) (width 0.1) (tstamp 5F91403B))
  (gr_line (start 147.655767 125.060331) (end 129.469233 114.560331) (layer Edge.Cuts) (width 0.1) (tstamp 5F91402B))
  (gr_arc (start 128.406733 116.400635) (end 129.469233 114.560331) (angle -90) (layer Edge.Cuts) (width 0.1) (tstamp 5F91402D))
  (gr_line (start 147.321071 129.890042) (end 148.433571 127.963135) (layer Edge.Cuts) (width 0.1) (tstamp 5F91402A))
  (gr_line (start 125.453929 117.265042) (end 126.566429 115.338135) (layer Edge.Cuts) (width 0.1) (tstamp 5F91402C))
  (gr_arc (start 171.593267 116.400635) (end 173.433571 115.338135) (angle -90) (layer Edge.Cuts) (width 0.1) (tstamp 5F914038))
  (gr_arc (start 153.406733 126.900635) (end 152.344233 125.060331) (angle -90) (layer Edge.Cuts) (width 0.1) (tstamp 5F91403A))

)
