(kicad_pcb (version 20171130) (host pcbnew "(5.1.6)-1")

  (general
    (thickness 8.4)
    (drawings 42)
    (tracks 0)
    (zones 0)
    (modules 0)
    (nets 1)
  )

  (page A4)
  (title_block
    (title "Node Cover B")
    (date 2020-06-03)
    (rev 1)
    (company "Institute for Automation of Complex Power Systems - E.ON ERC - RWTH Aachen University")
    (comment 1 "Designer: D. Wienands, S. Melcher, L. Jeske, D. Moll")
    (comment 2 "Supervisor: C. Guarnieri Calò Carducci")
  )

  (layers
    (0 F.Cu signal)
    (1 In1.Cu power)
    (2 In2.Cu power)
    (31 B.Cu signal)
    (32 B.Adhes user)
    (33 F.Adhes user)
    (34 B.Paste user)
    (35 F.Paste user)
    (36 B.SilkS user)
    (37 F.SilkS user)
    (38 B.Mask user)
    (39 F.Mask user)
    (40 Dwgs.User user)
    (41 Cmts.User user)
    (42 Eco1.User user)
    (43 Eco2.User user)
    (44 Edge.Cuts user)
    (45 Margin user)
    (46 B.CrtYd user)
    (47 F.CrtYd user)
    (48 B.Fab user)
    (49 F.Fab user)
  )

  (setup
    (last_trace_width 0.25)
    (user_trace_width 0.15)
    (user_trace_width 0.15)
    (user_trace_width 0.15)
    (user_trace_width 0.5)
    (user_trace_width 0.5)
    (user_trace_width 0.5)
    (trace_clearance 0.2)
    (zone_clearance 0.2)
    (zone_45_only no)
    (trace_min 0.15)
    (via_size 0.6)
    (via_drill 0.25)
    (via_min_size 0.6)
    (via_min_drill 0.25)
    (uvia_size 0.5)
    (uvia_drill 0.1)
    (uvias_allowed no)
    (uvia_min_size 0.5)
    (uvia_min_drill 0.1)
    (edge_width 0.1)
    (segment_width 0.2)
    (pcb_text_width 0.2)
    (pcb_text_size 0.8 0.8)
    (mod_edge_width 0.15)
    (mod_text_size 0.6 0.6)
    (mod_text_width 0.15)
    (pad_size 1.33 0.53)
    (pad_drill 0)
    (pad_to_mask_clearance 0)
    (aux_axis_origin 150 100)
    (grid_origin 150 100)
    (visible_elements 7FFFFFFF)
    (pcbplotparams
      (layerselection 0x010fc_ffffffff)
      (usegerberextensions false)
      (usegerberattributes false)
      (usegerberadvancedattributes false)
      (creategerberjobfile false)
      (excludeedgelayer true)
      (linewidth 0.100000)
      (plotframeref false)
      (viasonmask false)
      (mode 1)
      (useauxorigin false)
      (hpglpennumber 1)
      (hpglpenspeed 20)
      (hpglpendiameter 15.000000)
      (psnegative false)
      (psa4output false)
      (plotreference true)
      (plotvalue true)
      (plotinvisibletext false)
      (padsonsilk false)
      (subtractmaskfromsilk false)
      (outputformat 1)
      (mirror false)
      (drillshape 1)
      (scaleselection 1)
      (outputdirectory ""))
  )

  (net 0 "")

  (net_class Default "This is the default net class."
    (clearance 0.2)
    (trace_width 0.25)
    (via_dia 0.6)
    (via_drill 0.25)
    (uvia_dia 0.5)
    (uvia_drill 0.1)
  )

  (gr_arc (start 152.598076 101.5) (end 137.875644 93) (angle -51.20915048) (layer Edge.Cuts) (width 0.1) (tstamp 5F95CB67))
  (gr_arc (start 152.598076 101.5) (end 137.875644 93) (angle 51.20915048) (layer Edge.Cuts) (width 0.1) (tstamp 5F95CB66))
  (gr_arc (start 147.401924 101.5) (end 162.124356 93) (angle -51.20915048) (layer Edge.Cuts) (width 0.1) (tstamp 5F95CB5E))
  (gr_arc (start 147.401924 101.5) (end 162.124356 93) (angle 51.20915048) (layer Edge.Cuts) (width 0.1) (tstamp 5F95CB5D))
  (gr_arc (start 150 97) (end 150 114) (angle -51.20915048) (layer Edge.Cuts) (width 0.1))
  (gr_arc (start 150 97) (end 150 114) (angle 51.20915048) (layer Edge.Cuts) (width 0.1))
  (gr_arc (start 125 110.5) (end 125 112.625) (angle -90) (layer Edge.Cuts) (width 0.1))
  (gr_line (start 122.775001 112.624999) (end 125 112.625) (layer Edge.Cuts) (width 0.1))
  (gr_line (start 127.125 110.5) (end 127.125 89.5) (layer Edge.Cuts) (width 0.1))
  (gr_line (start 122.775001 87.375001) (end 125 87.375) (layer Edge.Cuts) (width 0.1))
  (gr_arc (start 125 89.5) (end 127.125 89.5) (angle -90) (layer Edge.Cuts) (width 0.1))
  (gr_arc (start 150 100) (end 177.225 87.375) (angle -10.2430314) (layer Edge.Cuts) (width 0.1))
  (gr_arc (start 150 100) (end 147.321071 129.890042) (angle -10.24303039) (layer Edge.Cuts) (width 0.1))
  (gr_arc (start 128.406733 83.599365) (end 126.566429 84.661865) (angle -90) (layer Edge.Cuts) (width 0.1) (tstamp 5F914067))
  (gr_line (start 129.469233 85.439669) (end 147.655767 74.939669) (layer Edge.Cuts) (width 0.1) (tstamp 5F914069))
  (gr_arc (start 146.593267 73.099365) (end 147.655767 74.939669) (angle -90) (layer Edge.Cuts) (width 0.1) (tstamp 5F914068))
  (gr_arc (start 150 100) (end 174.546071 117.265042) (angle -10.24303013) (layer Edge.Cuts) (width 0.1))
  (gr_arc (start 150 100) (end 125.453929 82.734958) (angle -10.24303106) (layer Edge.Cuts) (width 0.1))
  (gr_arc (start 150 100) (end 122.775001 112.624999) (angle -10.24303279) (layer Edge.Cuts) (width 0.1))
  (gr_arc (start 150 100) (end 152.678929 70.109958) (angle -10.24303039) (layer Edge.Cuts) (width 0.1))
  (gr_line (start 177.225 87.375) (end 175 87.375) (layer Edge.Cuts) (width 0.1) (tstamp 5F914049))
  (gr_line (start 177.225 112.625) (end 175 112.625) (layer Edge.Cuts) (width 0.1) (tstamp 5F914047))
  (gr_line (start 152.678929 70.109958) (end 151.566429 72.036865) (layer Edge.Cuts) (width 0.1) (tstamp 5F914056))
  (gr_line (start 174.54607 82.734959) (end 173.433571 84.661865) (layer Edge.Cuts) (width 0.1) (tstamp 5F914057))
  (gr_line (start 125.453929 82.734958) (end 126.566429 84.661865) (layer Edge.Cuts) (width 0.1) (tstamp 5F914065))
  (gr_line (start 147.321071 70.109958) (end 148.433571 72.036865) (layer Edge.Cuts) (width 0.1) (tstamp 5F914066))
  (gr_line (start 172.875 89.5) (end 172.875 110.5) (layer Edge.Cuts) (width 0.1) (tstamp 5F914048))
  (gr_arc (start 153.406733 73.099365) (end 151.566429 72.036865) (angle -90) (layer Edge.Cuts) (width 0.1) (tstamp 5F914059))
  (gr_arc (start 171.593267 83.599365) (end 170.530767 85.439669) (angle -90) (layer Edge.Cuts) (width 0.1) (tstamp 5F91405A))
  (gr_arc (start 175 89.5) (end 175 87.375) (angle -90) (layer Edge.Cuts) (width 0.1) (tstamp 5F91404A))
  (gr_arc (start 175 110.5) (end 172.875 110.5) (angle -90) (layer Edge.Cuts) (width 0.1) (tstamp 5F91404B))
  (gr_line (start 152.344233 74.939669) (end 170.530767 85.439669) (layer Edge.Cuts) (width 0.1) (tstamp 5F914058))
  (gr_line (start 152.678929 129.890042) (end 151.566429 127.963135) (layer Edge.Cuts) (width 0.1) (tstamp 5F91403C))
  (gr_arc (start 146.593267 126.900635) (end 148.433571 127.963135) (angle -90) (layer Edge.Cuts) (width 0.1) (tstamp 5F914029))
  (gr_line (start 170.530767 114.560331) (end 152.344233 125.060331) (layer Edge.Cuts) (width 0.1) (tstamp 5F914039))
  (gr_line (start 174.546071 117.265042) (end 173.433571 115.338135) (layer Edge.Cuts) (width 0.1) (tstamp 5F91403B))
  (gr_line (start 147.655767 125.060331) (end 129.469233 114.560331) (layer Edge.Cuts) (width 0.1) (tstamp 5F91402B))
  (gr_arc (start 128.406733 116.400635) (end 129.469233 114.560331) (angle -90) (layer Edge.Cuts) (width 0.1) (tstamp 5F91402D))
  (gr_line (start 147.321071 129.890042) (end 148.433571 127.963135) (layer Edge.Cuts) (width 0.1) (tstamp 5F91402A))
  (gr_line (start 125.453929 117.265042) (end 126.566429 115.338135) (layer Edge.Cuts) (width 0.1) (tstamp 5F91402C))
  (gr_arc (start 171.593267 116.400635) (end 173.433571 115.338135) (angle -90) (layer Edge.Cuts) (width 0.1) (tstamp 5F914038))
  (gr_arc (start 153.406733 126.900635) (end 152.344233 125.060331) (angle -90) (layer Edge.Cuts) (width 0.1) (tstamp 5F91403A))

)
