#1
double LoadProfile(1440,2)
60.000000	0.051000
120.000000	0.051000
180.000000	0.051000
240.000000	0.051000
300.000000	0.051000
360.000000	0.051000
420.000000	0.051000
480.000000	0.051000
540.000000	0.051000
600.000000	0.051000
660.000000	0.051000
720.000000	0.051000
780.000000	0.051000
840.000000	0.051000
900.000000	0.051000
960.000000	0.051000
1020.000000	0.051000
1080.000000	0.051000
1140.000000	0.051000
1200.000000	0.051000
1260.000000	0.051000
1320.000000	0.051000
1380.000000	0.051000
1440.000000	0.051000
1500.000000	0.051000
1560.000000	0.051000
1620.000000	0.051000
1680.000000	0.051000
1740.000000	0.051000
1800.000000	0.051000
1860.000000	0.051000
1920.000000	0.051000
1980.000000	0.051000
2040.000000	0.051000
2100.000000	0.051000
2160.000000	0.051000
2220.000000	0.171000
2280.000000	0.171000
2340.000000	0.171000
2400.000000	0.171000
2460.000000	0.171000
2520.000000	0.171000
2580.000000	0.171000
2640.000000	0.171000
2700.000000	0.171000
2760.000000	0.171000
2820.000000	0.171000
2880.000000	0.171000
2940.000000	0.171000
3000.000000	0.171000
3060.000000	0.171000
3120.000000	0.171000
3180.000000	0.171000
3240.000000	0.171000
3300.000000	0.051000
3360.000000	0.051000
3420.000000	0.051000
3480.000000	0.051000
3540.000000	0.051000
3600.000000	0.051000
3660.000000	0.051000
3720.000000	0.051000
3780.000000	0.051000
3840.000000	0.051000
3900.000000	0.051000
3960.000000	0.051000
4020.000000	0.051000
4080.000000	0.051000
4140.000000	0.051000
4200.000000	0.051000
4260.000000	0.051000
4320.000000	0.051000
4380.000000	0.051000
4440.000000	0.051000
4500.000000	0.051000
4560.000000	0.051000
4620.000000	0.051000
4680.000000	0.051000
4740.000000	0.051000
4800.000000	0.051000
4860.000000	0.051000
4920.000000	0.051000
4980.000000	0.051000
5040.000000	0.051000
5100.000000	0.051000
5160.000000	0.051000
5220.000000	0.051000
5280.000000	0.051000
5340.000000	0.051000
5400.000000	0.051000
5460.000000	0.051000
5520.000000	0.051000
5580.000000	0.051000
5640.000000	0.051000
5700.000000	0.051000
5760.000000	0.051000
5820.000000	0.051000
5880.000000	0.051000
5940.000000	0.268000
6000.000000	0.268000
6060.000000	0.268000
6120.000000	0.268000
6180.000000	0.268000
6240.000000	0.268000
6300.000000	0.268000
6360.000000	0.268000
6420.000000	0.268000
6480.000000	0.268000
6540.000000	0.268000
6600.000000	0.268000
6660.000000	0.268000
6720.000000	0.268000
6780.000000	0.268000
6840.000000	0.268000
6900.000000	0.268000
6960.000000	0.268000
7020.000000	0.268000
7080.000000	0.268000
7140.000000	0.268000
7200.000000	0.268000
7260.000000	0.051000
7320.000000	0.051000
7380.000000	0.051000
7440.000000	0.051000
7500.000000	0.051000
7560.000000	0.051000
7620.000000	0.051000
7680.000000	0.051000
7740.000000	0.051000
7800.000000	0.051000
7860.000000	0.051000
7920.000000	0.051000
7980.000000	0.051000
8040.000000	0.051000
8100.000000	0.051000
8160.000000	0.051000
8220.000000	0.051000
8280.000000	0.051000
8340.000000	0.051000
8400.000000	0.051000
8460.000000	0.051000
8520.000000	0.051000
8580.000000	0.051000
8640.000000	0.051000
8700.000000	0.051000
8760.000000	0.051000
8820.000000	0.051000
8880.000000	0.051000
8940.000000	0.051000
9000.000000	0.051000
9060.000000	0.051000
9120.000000	0.051000
9180.000000	0.051000
9240.000000	0.051000
9300.000000	0.051000
9360.000000	0.051000
9420.000000	0.051000
9480.000000	0.051000
9540.000000	0.051000
9600.000000	0.051000
9660.000000	0.051000
9720.000000	0.051000
9780.000000	0.051000
9840.000000	0.051000
9900.000000	0.051000
9960.000000	0.051000
10020.000000	0.051000
10080.000000	0.051000
10140.000000	0.051000
10200.000000	0.171000
10260.000000	0.171000
10320.000000	0.171000
10380.000000	0.171000
10440.000000	0.388000
10500.000000	0.388000
10560.000000	0.388000
10620.000000	0.388000
10680.000000	0.388000
10740.000000	0.388000
10800.000000	0.388000
10860.000000	0.388000
10920.000000	0.388000
10980.000000	0.388000
11040.000000	0.388000
11100.000000	0.388000
11160.000000	0.388000
11220.000000	0.388000
11280.000000	0.268000
11340.000000	0.268000
11400.000000	0.268000
11460.000000	0.268000
11520.000000	0.268000
11580.000000	0.268000
11640.000000	0.268000
11700.000000	0.268000
11760.000000	0.051000
11820.000000	0.051000
11880.000000	0.051000
11940.000000	0.051000
12000.000000	0.051000
12060.000000	0.051000
12120.000000	0.051000
12180.000000	0.051000
12240.000000	0.051000
12300.000000	0.051000
12360.000000	0.051000
12420.000000	0.051000
12480.000000	0.051000
12540.000000	0.051000
12600.000000	0.051000
12660.000000	0.051000
12720.000000	0.051000
12780.000000	0.051000
12840.000000	0.051000
12900.000000	0.051000
12960.000000	0.051000
13020.000000	0.051000
13080.000000	0.051000
13140.000000	0.051000
13200.000000	0.051000
13260.000000	0.051000
13320.000000	0.051000
13380.000000	0.051000
13440.000000	0.051000
13500.000000	0.051000
13560.000000	0.051000
13620.000000	0.051000
13680.000000	0.051000
13740.000000	0.051000
13800.000000	0.051000
13860.000000	0.051000
13920.000000	0.051000
13980.000000	0.051000
14040.000000	0.051000
14100.000000	0.051000
14160.000000	0.171000
14220.000000	0.171000
14280.000000	0.171000
14340.000000	0.171000
14400.000000	0.171000
14460.000000	0.388000
14520.000000	0.388000
14580.000000	0.388000
14640.000000	0.388000
14700.000000	0.388000
14760.000000	0.388000
14820.000000	0.388000
14880.000000	0.388000
14940.000000	0.388000
15000.000000	0.388000
15060.000000	0.388000
15120.000000	0.388000
15180.000000	0.388000
15240.000000	0.268000
15300.000000	0.268000
15360.000000	0.268000
15420.000000	0.268000
15480.000000	0.268000
15540.000000	0.268000
15600.000000	0.268000
15660.000000	0.268000
15720.000000	0.268000
15780.000000	0.051000
15840.000000	0.051000
15900.000000	0.051000
15960.000000	0.051000
16020.000000	0.051000
16080.000000	0.051000
16140.000000	0.051000
16200.000000	0.051000
16260.000000	0.051000
16320.000000	0.051000
16380.000000	0.051000
16440.000000	0.051000
16500.000000	0.051000
16560.000000	0.051000
16620.000000	0.051000
16680.000000	0.051000
16740.000000	0.051000
16800.000000	0.051000
16860.000000	0.051000
16920.000000	0.051000
16980.000000	0.051000
17040.000000	0.051000
17100.000000	0.051000
17160.000000	0.051000
17220.000000	0.051000
17280.000000	0.051000
17340.000000	0.051000
17400.000000	0.051000
17460.000000	0.051000
17520.000000	0.051000
17580.000000	0.051000
17640.000000	0.051000
17700.000000	0.051000
17760.000000	0.051000
17820.000000	0.051000
17880.000000	0.051000
17940.000000	0.051000
18000.000000	0.051000
18060.000000	0.051000
18120.000000	0.051000
18180.000000	0.051000
18240.000000	0.051000
18300.000000	0.051000
18360.000000	0.051000
18420.000000	0.051000
18480.000000	0.051000
18540.000000	0.051000
18600.000000	0.051000
18660.000000	0.051000
18720.000000	0.051000
18780.000000	0.051000
18840.000000	0.051000
18900.000000	0.051000
18960.000000	0.051000
19020.000000	0.268000
19080.000000	0.268000
19140.000000	0.268000
19200.000000	0.268000
19260.000000	0.268000
19320.000000	0.268000
19380.000000	0.268000
19440.000000	0.268000
19500.000000	0.268000
19560.000000	0.268000
19620.000000	0.268000
19680.000000	0.268000
19740.000000	0.268000
19800.000000	0.268000
19860.000000	0.268000
19920.000000	0.268000
19980.000000	0.388000
20040.000000	0.388000
20100.000000	0.388000
20160.000000	0.388000
20220.000000	0.388000
20280.000000	0.388000
20340.000000	0.171000
20400.000000	0.171000
20460.000000	0.171000
20520.000000	0.171000
20580.000000	0.171000
20640.000000	0.171000
20700.000000	0.171000
20760.000000	0.171000
20820.000000	0.171000
20880.000000	0.171000
20940.000000	0.171000
21000.000000	0.171000
21060.000000	0.051000
21120.000000	0.051000
21180.000000	0.051000
21240.000000	0.051000
21300.000000	0.051000
21360.000000	0.051000
21420.000000	0.051000
21480.000000	0.051000
21540.000000	0.051000
21600.000000	0.051000
21660.000000	0.051000
21720.000000	0.051000
21780.000000	0.051000
21840.000000	0.051000
21900.000000	0.051000
21960.000000	0.051000
22020.000000	0.051000
22080.000000	0.051000
22140.000000	0.051000
22200.000000	0.051000
22260.000000	0.051000
22320.000000	0.051000
22380.000000	0.051000
22440.000000	0.051000
22500.000000	0.051000
22560.000000	0.051000
22620.000000	0.051000
22680.000000	0.051000
22740.000000	0.051000
22800.000000	0.051000
22860.000000	0.051000
22920.000000	0.051000
22980.000000	0.051000
23040.000000	0.051000
23100.000000	0.051000
23160.000000	0.051000
23220.000000	0.051000
23280.000000	0.051000
23340.000000	0.051000
23400.000000	0.051000
23460.000000	0.051000
23520.000000	0.268000
23580.000000	0.268000
23640.000000	0.268000
23700.000000	0.268000
23760.000000	0.268000
23820.000000	0.268000
23880.000000	0.268000
23940.000000	0.268000
24000.000000	0.268000
24060.000000	0.268000
24120.000000	0.268000
24180.000000	0.268000
24240.000000	0.268000
24300.000000	0.268000
24360.000000	0.268000
24420.000000	0.268000
24480.000000	0.268000
24540.000000	0.268000
24600.000000	0.268000
24660.000000	0.268000
24720.000000	0.268000
24780.000000	0.268000
24840.000000	0.051000
24900.000000	0.051000
24960.000000	0.051000
25020.000000	0.051000
25080.000000	0.051000
25140.000000	0.051000
25200.000000	0.051000
25260.000000	0.051000
25320.000000	0.051000
25380.000000	0.051000
25440.000000	0.051000
25500.000000	0.051000
25560.000000	0.051000
25620.000000	3.158000
25680.000000	3.218000
25740.000000	3.218000
25800.000000	3.158000
25860.000000	3.158000
25920.000000	3.297000
25980.000000	3.297000
26040.000000	3.297000
26100.000000	3.297000
26160.000000	3.297000
26220.000000	3.337000
26280.000000	3.337000
26340.000000	3.337000
26400.000000	3.337000
26460.000000	3.337000
26520.000000	3.357000
26580.000000	3.357000
26640.000000	3.357000
26700.000000	3.357000
26760.000000	3.357000
26820.000000	0.250000
26880.000000	0.310000
26940.000000	0.310000
27000.000000	0.310000
27060.000000	0.051000
27120.000000	0.051000
27180.000000	0.051000
27240.000000	0.051000
27300.000000	0.051000
27360.000000	0.051000
27420.000000	0.051000
27480.000000	0.051000
27540.000000	0.051000
27600.000000	0.051000
27660.000000	0.051000
27720.000000	0.051000
27780.000000	0.051000
27840.000000	0.051000
27900.000000	0.268000
27960.000000	0.268000
28020.000000	0.268000
28080.000000	0.268000
28140.000000	0.268000
28200.000000	0.268000
28260.000000	0.467000
28320.000000	0.467000
28380.000000	0.467000
28440.000000	0.517000
28500.000000	0.637000
28560.000000	0.817000
28620.000000	0.877000
28680.000000	0.857000
28740.000000	0.797000
28800.000000	0.797000
28860.000000	0.837000
28920.000000	0.837000
28980.000000	0.837000
29040.000000	0.837000
29100.000000	0.837000
29160.000000	0.837000
29220.000000	0.620000
29280.000000	0.620000
29340.000000	0.911000
29400.000000	0.911000
29460.000000	0.911000
29520.000000	0.911000
29580.000000	0.440000
29640.000000	0.440000
29700.000000	0.440000
29760.000000	0.440000
29820.000000	0.440000
29880.000000	0.340000
29940.000000	0.340000
30000.000000	0.280000
30060.000000	0.051000
30120.000000	0.051000
30180.000000	0.051000
30240.000000	0.051000
30300.000000	0.051000
30360.000000	0.051000
30420.000000	0.051000
30480.000000	0.051000
30540.000000	0.051000
30600.000000	0.051000
30660.000000	0.051000
30720.000000	0.051000
30780.000000	0.051000
30840.000000	0.051000
30900.000000	0.051000
30960.000000	0.051000
31020.000000	0.051000
31080.000000	0.051000
31140.000000	0.051000
31200.000000	0.051000
31260.000000	0.051000
31320.000000	0.051000
31380.000000	0.051000
31440.000000	0.051000
31500.000000	0.051000
31560.000000	0.051000
31620.000000	0.051000
31680.000000	0.051000
31740.000000	0.051000
31800.000000	0.051000
31860.000000	0.051000
31920.000000	0.268000
31980.000000	0.268000
32040.000000	0.268000
32100.000000	0.268000
32160.000000	0.388000
32220.000000	0.388000
32280.000000	0.388000
32340.000000	0.388000
32400.000000	0.388000
32460.000000	0.388000
32520.000000	0.388000
32580.000000	0.388000
32640.000000	0.388000
32700.000000	0.388000
32760.000000	0.388000
32820.000000	0.388000
32880.000000	0.388000
32940.000000	0.388000
33000.000000	0.388000
33060.000000	0.388000
33120.000000	0.388000
33180.000000	0.388000
33240.000000	0.051000
33300.000000	0.051000
33360.000000	0.051000
33420.000000	0.051000
33480.000000	0.051000
33540.000000	0.051000
33600.000000	0.051000
33660.000000	0.051000
33720.000000	0.051000
33780.000000	0.051000
33840.000000	0.051000
33900.000000	0.051000
33960.000000	0.051000
34020.000000	0.051000
34080.000000	0.051000
34140.000000	0.051000
34200.000000	0.051000
34260.000000	0.051000
34320.000000	0.051000
34380.000000	0.051000
34440.000000	0.051000
34500.000000	0.051000
34560.000000	0.051000
34620.000000	0.051000
34680.000000	0.051000
34740.000000	0.051000
34800.000000	0.051000
34860.000000	0.051000
34920.000000	0.051000
34980.000000	0.051000
35040.000000	0.051000
35100.000000	0.051000
35160.000000	0.051000
35220.000000	0.051000
35280.000000	0.051000
35340.000000	0.051000
35400.000000	0.051000
35460.000000	0.051000
35520.000000	0.051000
35580.000000	0.051000
35640.000000	0.051000
35700.000000	0.051000
35760.000000	0.051000
35820.000000	0.051000
35880.000000	0.051000
35940.000000	0.051000
36000.000000	0.051000
36060.000000	0.051000
36120.000000	0.051000
36180.000000	0.051000
36240.000000	0.051000
36300.000000	0.051000
36360.000000	0.051000
36420.000000	0.051000
36480.000000	0.051000
36540.000000	0.051000
36600.000000	0.051000
36660.000000	0.268000
36720.000000	0.268000
36780.000000	0.268000
36840.000000	0.268000
36900.000000	0.268000
36960.000000	0.268000
37020.000000	0.268000
37080.000000	0.268000
37140.000000	0.268000
37200.000000	0.268000
37260.000000	0.268000
37320.000000	0.268000
37380.000000	0.268000
37440.000000	0.268000
37500.000000	0.268000
37560.000000	0.268000
37620.000000	0.268000
37680.000000	0.268000
37740.000000	0.268000
37800.000000	0.268000
37860.000000	0.268000
37920.000000	0.268000
37980.000000	0.051000
38040.000000	0.051000
38100.000000	0.051000
38160.000000	0.051000
38220.000000	0.051000
38280.000000	0.051000
38340.000000	0.051000
38400.000000	0.051000
38460.000000	0.051000
38520.000000	0.051000
38580.000000	0.051000
38640.000000	0.051000
38700.000000	0.051000
38760.000000	0.051000
38820.000000	0.051000
38880.000000	0.051000
38940.000000	0.051000
39000.000000	0.051000
39060.000000	0.051000
39120.000000	0.051000
39180.000000	0.051000
39240.000000	0.051000
39300.000000	0.051000
39360.000000	0.051000
39420.000000	0.051000
39480.000000	0.051000
39540.000000	0.051000
39600.000000	0.051000
39660.000000	0.051000
39720.000000	0.051000
39780.000000	0.051000
39840.000000	0.051000
39900.000000	0.051000
39960.000000	0.051000
40020.000000	0.051000
40080.000000	0.051000
40140.000000	0.051000
40200.000000	0.051000
40260.000000	0.051000
40320.000000	0.051000
40380.000000	0.051000
40440.000000	0.051000
40500.000000	0.051000
40560.000000	0.051000
40620.000000	0.051000
40680.000000	0.051000
40740.000000	0.051000
40800.000000	0.051000
40860.000000	0.051000
40920.000000	0.051000
40980.000000	0.051000
41040.000000	0.051000
41100.000000	0.051000
41160.000000	0.051000
41220.000000	0.051000
41280.000000	0.051000
41340.000000	0.051000
41400.000000	0.051000
41460.000000	0.051000
41520.000000	0.051000
41580.000000	0.051000
41640.000000	0.051000
41700.000000	0.051000
41760.000000	0.051000
41820.000000	0.051000
41880.000000	0.171000
41940.000000	0.171000
42000.000000	0.388000
42060.000000	0.388000
42120.000000	0.388000
42180.000000	0.388000
42240.000000	0.388000
42300.000000	0.388000
42360.000000	0.388000
42420.000000	0.388000
42480.000000	0.388000
42540.000000	0.388000
42600.000000	0.388000
42660.000000	0.388000
42720.000000	0.388000
42780.000000	0.388000
42840.000000	0.388000
42900.000000	0.388000
42960.000000	0.268000
43020.000000	0.268000
43080.000000	0.268000
43140.000000	0.268000
43200.000000	0.268000
43260.000000	0.268000
43320.000000	0.051000
43380.000000	0.051000
43440.000000	0.051000
43500.000000	0.051000
43560.000000	0.051000
43620.000000	0.051000
43680.000000	0.051000
43740.000000	0.051000
43800.000000	0.051000
43860.000000	0.051000
43920.000000	0.051000
43980.000000	0.051000
44040.000000	0.051000
44100.000000	0.051000
44160.000000	0.051000
44220.000000	0.051000
44280.000000	0.051000
44340.000000	0.051000
44400.000000	0.051000
44460.000000	0.051000
44520.000000	0.051000
44580.000000	0.051000
44640.000000	0.051000
44700.000000	0.051000
44760.000000	0.051000
44820.000000	0.051000
44880.000000	0.051000
44940.000000	0.051000
45000.000000	0.051000
45060.000000	0.051000
45120.000000	0.051000
45180.000000	0.051000
45240.000000	0.051000
45300.000000	0.051000
45360.000000	0.051000
45420.000000	0.051000
45480.000000	0.051000
45540.000000	0.051000
45600.000000	0.051000
45660.000000	0.051000
45720.000000	0.051000
45780.000000	0.051000
45840.000000	0.051000
45900.000000	0.051000
45960.000000	0.051000
46020.000000	0.051000
46080.000000	0.051000
46140.000000	0.051000
46200.000000	0.268000
46260.000000	0.268000
46320.000000	0.268000
46380.000000	0.268000
46440.000000	0.268000
46500.000000	0.268000
46560.000000	0.268000
46620.000000	0.268000
46680.000000	0.268000
46740.000000	0.268000
46800.000000	0.268000
46860.000000	0.268000
46920.000000	0.268000
46980.000000	0.268000
47040.000000	0.268000
47100.000000	0.268000
47160.000000	0.268000
47220.000000	0.268000
47280.000000	0.268000
47340.000000	0.268000
47400.000000	0.268000
47460.000000	0.268000
47520.000000	0.051000
47580.000000	0.051000
47640.000000	0.051000
47700.000000	0.051000
47760.000000	0.051000
47820.000000	0.051000
47880.000000	0.051000
47940.000000	0.051000
48000.000000	0.051000
48060.000000	0.051000
48120.000000	0.051000
48180.000000	0.051000
48240.000000	0.051000
48300.000000	0.051000
48360.000000	0.051000
48420.000000	0.051000
48480.000000	0.051000
48540.000000	0.051000
48600.000000	0.051000
48660.000000	0.051000
48720.000000	0.051000
48780.000000	0.051000
48840.000000	0.051000
48900.000000	0.051000
48960.000000	0.171000
49020.000000	0.171000
49080.000000	0.171000
49140.000000	0.171000
49200.000000	0.171000
49260.000000	0.171000
49320.000000	0.171000
49380.000000	0.171000
49440.000000	0.171000
49500.000000	0.171000
49560.000000	0.171000
49620.000000	0.171000
49680.000000	0.171000
49740.000000	0.171000
49800.000000	0.171000
49860.000000	0.171000
49920.000000	0.171000
49980.000000	0.171000
50040.000000	0.051000
50100.000000	0.051000
50160.000000	0.051000
50220.000000	0.051000
50280.000000	0.051000
50340.000000	0.051000
50400.000000	0.051000
50460.000000	0.051000
50520.000000	0.051000
50580.000000	0.051000
50640.000000	0.051000
50700.000000	0.051000
50760.000000	0.051000
50820.000000	0.051000
50880.000000	0.051000
50940.000000	0.268000
51000.000000	0.268000
51060.000000	0.268000
51120.000000	0.268000
51180.000000	0.268000
51240.000000	0.268000
51300.000000	0.268000
51360.000000	0.268000
51420.000000	0.268000
51480.000000	0.268000
51540.000000	0.268000
51600.000000	0.268000
51660.000000	0.268000
51720.000000	0.268000
51780.000000	0.268000
51840.000000	0.268000
51900.000000	0.268000
51960.000000	0.268000
52020.000000	0.268000
52080.000000	0.268000
52140.000000	0.268000
52200.000000	0.268000
52260.000000	0.051000
52320.000000	0.051000
52380.000000	0.051000
52440.000000	0.051000
52500.000000	0.051000
52560.000000	0.051000
52620.000000	0.051000
52680.000000	0.051000
52740.000000	0.051000
52800.000000	0.051000
52860.000000	0.051000
52920.000000	0.051000
52980.000000	0.051000
53040.000000	0.051000
53100.000000	0.051000
53160.000000	0.051000
53220.000000	0.051000
53280.000000	0.051000
53340.000000	0.051000
53400.000000	0.051000
53460.000000	0.051000
53520.000000	0.171000
53580.000000	0.171000
53640.000000	0.171000
53700.000000	0.171000
53760.000000	0.171000
53820.000000	0.171000
53880.000000	0.171000
53940.000000	0.171000
54000.000000	0.171000
54060.000000	0.171000
54120.000000	0.171000
54180.000000	0.171000
54240.000000	0.171000
54300.000000	0.171000
54360.000000	0.171000
54420.000000	0.171000
54480.000000	0.171000
54540.000000	0.171000
54600.000000	0.051000
54660.000000	0.051000
54720.000000	0.051000
54780.000000	0.051000
54840.000000	0.051000
54900.000000	0.051000
54960.000000	0.051000
55020.000000	0.051000
55080.000000	0.051000
55140.000000	0.268000
55200.000000	0.268000
55260.000000	0.268000
55320.000000	0.268000
55380.000000	0.268000
55440.000000	0.268000
55500.000000	0.268000
55560.000000	0.268000
55620.000000	0.268000
55680.000000	0.268000
55740.000000	0.268000
55800.000000	0.268000
55860.000000	0.407000
55920.000000	0.407000
55980.000000	0.407000
56040.000000	0.407000
56100.000000	0.407000
56160.000000	0.407000
56220.000000	0.407000
56280.000000	0.407000
56340.000000	3.514000
56400.000000	3.514000
56460.000000	3.297000
56520.000000	3.357000
56580.000000	3.357000
56640.000000	3.357000
56700.000000	3.392000
56760.000000	3.392000
56820.000000	3.392000
56880.000000	3.392000
56940.000000	3.392000
57000.000000	3.392000
57060.000000	3.392000
57120.000000	3.452000
57180.000000	3.452000
57240.000000	3.452000
57300.000000	3.512000
57360.000000	3.452000
57420.000000	3.452000
57480.000000	3.512000
57540.000000	0.405000
57600.000000	0.405000
57660.000000	0.405000
57720.000000	0.405000
57780.000000	0.405000
57840.000000	0.345000
57900.000000	0.385000
57960.000000	0.350000
58020.000000	0.350000
58080.000000	0.350000
58140.000000	0.470000
58200.000000	0.470000
58260.000000	0.505000
58320.000000	0.558000
58380.000000	0.558000
58440.000000	0.558000
58500.000000	0.558000
58560.000000	0.558000
58620.000000	0.658000
58680.000000	0.658000
58740.000000	0.658000
58800.000000	0.658000
58860.000000	0.658000
58920.000000	0.658000
58980.000000	0.658000
59040.000000	0.658000
59100.000000	0.658000
59160.000000	0.658000
59220.000000	0.538000
59280.000000	0.538000
59340.000000	0.538000
59400.000000	0.535000
59460.000000	0.535000
59520.000000	0.535000
59580.000000	0.535000
59640.000000	0.535000
59700.000000	0.535000
59760.000000	0.535000
59820.000000	0.535000
59880.000000	0.540000
59940.000000	0.485000
60000.000000	0.485000
60060.000000	0.485000
60120.000000	0.485000
60180.000000	0.485000
60240.000000	0.425000
60300.000000	0.425000
60360.000000	0.425000
60420.000000	0.425000
60480.000000	0.390000
60540.000000	0.450000
60600.000000	0.450000
60660.000000	0.450000
60720.000000	0.450000
60780.000000	0.450000
60840.000000	0.667000
60900.000000	0.667000
60960.000000	0.667000
61020.000000	0.667000
61080.000000	0.667000
61140.000000	0.607000
61200.000000	0.607000
61260.000000	0.607000
61320.000000	0.607000
61380.000000	0.607000
61440.000000	0.667000
61500.000000	0.607000
61560.000000	0.607000
61620.000000	0.727000
61680.000000	0.727000
61740.000000	0.727000
61800.000000	0.727000
61860.000000	0.782000
61920.000000	0.782000
61980.000000	0.727000
62040.000000	0.727000
62100.000000	0.727000
62160.000000	0.510000
62220.000000	0.510000
62280.000000	0.510000
62340.000000	0.510000
62400.000000	0.510000
62460.000000	0.510000
62520.000000	0.510000
62580.000000	0.510000
62640.000000	0.510000
62700.000000	0.390000
62760.000000	0.390000
62820.000000	0.390000
62880.000000	0.390000
62940.000000	0.390000
63000.000000	0.390000
63060.000000	0.390000
63120.000000	0.390000
63180.000000	0.390000
63240.000000	0.390000
63300.000000	0.390000
63360.000000	0.390000
63420.000000	0.390000
63480.000000	0.390000
63540.000000	0.390000
63600.000000	0.390000
63660.000000	0.390000
63720.000000	0.390000
63780.000000	0.390000
63840.000000	0.390000
63900.000000	0.445000
63960.000000	0.505000
64020.000000	0.505000
64080.000000	0.505000
64140.000000	0.541000
64200.000000	0.521000
64260.000000	0.521000
64320.000000	0.521000
64380.000000	0.581000
64440.000000	0.641000
64500.000000	0.641000
64560.000000	0.586000
64620.000000	0.546000
64680.000000	0.486000
64740.000000	0.486000
64800.000000	0.486000
64860.000000	0.446000
64920.000000	2.717000
64980.000000	2.717000
65040.000000	2.777000
65100.000000	0.561000
65160.000000	0.621000
65220.000000	0.741000
65280.000000	0.741000
65340.000000	0.781000
65400.000000	0.721000
65460.000000	0.661000
65520.000000	0.741000
65580.000000	0.741000
65640.000000	3.848000
65700.000000	3.828000
65760.000000	3.828000
65820.000000	3.828000
65880.000000	3.828000
65940.000000	3.828000
66000.000000	3.828000
66060.000000	3.837000
66120.000000	3.877000
66180.000000	3.877000
66240.000000	4.021000
66300.000000	3.901000
66360.000000	3.901000
66420.000000	3.901000
66480.000000	3.901000
66540.000000	3.861000
66600.000000	3.861000
66660.000000	3.861000
66720.000000	3.861000
66780.000000	3.981000
66840.000000	0.874000
66900.000000	0.874000
66960.000000	0.814000
67020.000000	0.699000
67080.000000	0.759000
67140.000000	0.759000
67200.000000	0.759000
67260.000000	0.794000
67320.000000	0.794000
67380.000000	0.794000
67440.000000	0.794000
67500.000000	0.794000
67560.000000	0.794000
67620.000000	0.794000
67680.000000	0.794000
67740.000000	0.794000
67800.000000	0.794000
67860.000000	0.794000
67920.000000	0.794000
67980.000000	0.794000
68040.000000	0.794000
68100.000000	1.011000
68160.000000	1.011000
68220.000000	1.011000
68280.000000	1.977000
68340.000000	1.977000
68400.000000	1.917000
68460.000000	0.951000
68520.000000	0.915000
68580.000000	0.915000
68640.000000	0.970000
68700.000000	0.970000
68760.000000	0.970000
68820.000000	0.970000
68880.000000	0.970000
68940.000000	0.994000
69000.000000	0.994000
69060.000000	0.974000
69120.000000	0.974000
69180.000000	0.974000
69240.000000	0.974000
69300.000000	0.959000
69360.000000	0.959000
69420.000000	0.682000
69480.000000	0.742000
69540.000000	0.642000
69600.000000	0.642000
69660.000000	0.633000
69720.000000	0.470000
69780.000000	0.470000
69840.000000	0.530000
69900.000000	0.530000
69960.000000	0.530000
70020.000000	0.530000
70080.000000	0.590000
70140.000000	0.590000
70200.000000	0.640000
70260.000000	0.675000
70320.000000	3.035000
70380.000000	2.975000
70440.000000	3.015000
70500.000000	0.799000
70560.000000	0.799000
70620.000000	0.799000
70680.000000	0.759000
70740.000000	0.819000
70800.000000	0.759000
70860.000000	0.759000
70920.000000	0.620000
70980.000000	0.620000
71040.000000	0.635000
71100.000000	0.615000
71160.000000	0.515000
71220.000000	0.623000
71280.000000	0.515000
71340.000000	0.575000
71400.000000	0.575000
71460.000000	0.575000
71520.000000	0.575000
71580.000000	0.575000
71640.000000	0.575000
71700.000000	0.575000
71760.000000	0.575000
71820.000000	0.575000
71880.000000	0.635000
71940.000000	0.635000
72000.000000	3.742000
72060.000000	3.742000
72120.000000	3.959000
72180.000000	3.959000
72240.000000	4.007000
72300.000000	6.223000
72360.000000	6.223000
72420.000000	6.223000
72480.000000	4.007000
72540.000000	4.227000
72600.000000	4.083000
72660.000000	4.083000
72720.000000	4.083000
72780.000000	4.138000
72840.000000	4.138000
72900.000000	4.138000
72960.000000	4.138000
73020.000000	4.138000
73080.000000	4.138000
73140.000000	4.138000
73200.000000	1.031000
73260.000000	0.931000
73320.000000	0.931000
73380.000000	0.931000
73440.000000	0.750000
73500.000000	0.750000
73560.000000	0.790000
73620.000000	0.620000
73680.000000	0.620000
73740.000000	0.764000
73800.000000	0.764000
73860.000000	0.764000
73920.000000	0.764000
73980.000000	0.724000
74040.000000	0.824000
74100.000000	0.909000
74160.000000	0.909000
74220.000000	0.909000
74280.000000	0.869000
74340.000000	0.809000
74400.000000	0.809000
74460.000000	0.809000
74520.000000	0.749000
74580.000000	0.749000
74640.000000	0.749000
74700.000000	0.749000
74760.000000	0.749000
74820.000000	0.749000
74880.000000	0.749000
74940.000000	0.749000
75000.000000	0.749000
75060.000000	0.749000
75120.000000	0.749000
75180.000000	0.758000
75240.000000	0.758000
75300.000000	0.758000
75360.000000	0.758000
75420.000000	0.743000
75480.000000	0.743000
75540.000000	0.743000
75600.000000	0.783000
75660.000000	0.783000
75720.000000	0.743000
75780.000000	0.683000
75840.000000	0.683000
75900.000000	0.683000
75960.000000	0.683000
76020.000000	0.743000
76080.000000	0.743000
76140.000000	0.743000
76200.000000	0.743000
76260.000000	0.793000
76320.000000	0.793000
76380.000000	0.793000
76440.000000	0.808000
76500.000000	0.808000
76560.000000	0.808000
76620.000000	0.708000
76680.000000	0.808000
76740.000000	0.808000
76800.000000	0.808000
76860.000000	0.693000
76920.000000	0.693000
76980.000000	0.693000
77040.000000	0.693000
77100.000000	0.693000
77160.000000	0.633000
77220.000000	0.633000
77280.000000	0.633000
77340.000000	0.633000
77400.000000	0.633000
77460.000000	0.673000
77520.000000	0.668000
77580.000000	1.328000
77640.000000	1.328000
77700.000000	3.604000
77760.000000	3.604000
77820.000000	3.568000
77880.000000	0.752000
77940.000000	0.752000
78000.000000	0.989000
78060.000000	0.989000
78120.000000	0.929000
78180.000000	0.929000
78240.000000	0.809000
78300.000000	0.874000
78360.000000	0.874000
78420.000000	0.934000
78480.000000	0.909000
78540.000000	0.874000
78600.000000	0.874000
78660.000000	0.874000
78720.000000	0.874000
78780.000000	0.865000
78840.000000	0.865000
78900.000000	0.965000
78960.000000	0.965000
79020.000000	0.965000
79080.000000	0.965000
79140.000000	4.072000
79200.000000	4.072000
79260.000000	4.072000
79320.000000	3.855000
79380.000000	3.735000
79440.000000	3.775000
79500.000000	3.775000
79560.000000	3.775000
79620.000000	3.775000
79680.000000	3.775000
79740.000000	3.835000
79800.000000	3.727000
79860.000000	3.667000
79920.000000	3.667000
79980.000000	3.567000
80040.000000	3.567000
80100.000000	3.576000
80160.000000	3.576000
80220.000000	3.636000
80280.000000	3.636000
80340.000000	0.549000
80400.000000	0.549000
80460.000000	0.649000
80520.000000	0.489000
80580.000000	0.489000
80640.000000	0.489000
80700.000000	0.489000
80760.000000	0.489000
80820.000000	0.364000
80880.000000	0.364000
80940.000000	0.364000
81000.000000	0.380000
81060.000000	0.380000
81120.000000	0.380000
81180.000000	0.380000
81240.000000	0.380000
81300.000000	0.380000
81360.000000	0.380000
81420.000000	0.440000
81480.000000	0.340000
81540.000000	0.340000
81600.000000	0.340000
81660.000000	0.340000
81720.000000	0.340000
81780.000000	0.340000
81840.000000	0.340000
81900.000000	0.340000
81960.000000	0.340000
82020.000000	0.395000
82080.000000	0.395000
82140.000000	0.340000
82200.000000	0.395000
82260.000000	0.340000
82320.000000	0.340000
82380.000000	0.340000
82440.000000	0.340000
82500.000000	0.340000
82560.000000	0.400000
82620.000000	0.400000
82680.000000	0.360000
82740.000000	0.360000
82800.000000	0.360000
82860.000000	0.051000
82920.000000	0.051000
82980.000000	0.051000
83040.000000	0.051000
83100.000000	0.051000
83160.000000	0.051000
83220.000000	0.051000
83280.000000	0.051000
83340.000000	0.051000
83400.000000	0.051000
83460.000000	0.171000
83520.000000	0.171000
83580.000000	0.171000
83640.000000	0.171000
83700.000000	0.171000
83760.000000	0.171000
83820.000000	0.171000
83880.000000	0.171000
83940.000000	0.171000
84000.000000	0.171000
84060.000000	0.171000
84120.000000	0.171000
84180.000000	0.171000
84240.000000	0.171000
84300.000000	0.171000
84360.000000	0.171000
84420.000000	0.388000
84480.000000	0.388000
84540.000000	0.268000
84600.000000	0.268000
84660.000000	0.268000
84720.000000	0.268000
84780.000000	0.268000
84840.000000	0.268000
84900.000000	0.268000
84960.000000	0.268000
85020.000000	0.268000
85080.000000	0.268000
85140.000000	0.268000
85200.000000	0.268000
85260.000000	0.268000
85320.000000	0.268000
85380.000000	0.268000
85440.000000	0.268000
85500.000000	0.268000
85560.000000	0.268000
85620.000000	0.268000
85680.000000	0.268000
85740.000000	0.051000
85800.000000	0.051000
85860.000000	0.051000
85920.000000	0.051000
85980.000000	0.051000
86040.000000	0.051000
86100.000000	0.051000
86160.000000	0.051000
86220.000000	0.051000
86280.000000	0.051000
86340.000000	0.051000
86400.000000	0.051000
