#1
double LoadProfile(1440,2)
60.000000	0.046000
120.000000	0.046000
180.000000	0.046000
240.000000	0.046000
300.000000	0.046000
360.000000	0.046000
420.000000	0.046000
480.000000	0.046000
540.000000	0.046000
600.000000	0.046000
660.000000	0.046000
720.000000	0.046000
780.000000	0.046000
840.000000	0.046000
900.000000	0.046000
960.000000	0.046000
1020.000000	0.046000
1080.000000	0.046000
1140.000000	0.046000
1200.000000	0.046000
1260.000000	0.046000
1320.000000	0.046000
1380.000000	0.046000
1440.000000	0.046000
1500.000000	0.046000
1560.000000	0.046000
1620.000000	0.046000
1680.000000	0.046000
1740.000000	0.046000
1800.000000	0.046000
1860.000000	0.046000
1920.000000	0.046000
1980.000000	0.046000
2040.000000	0.046000
2100.000000	0.046000
2160.000000	0.046000
2220.000000	0.046000
2280.000000	0.046000
2340.000000	0.046000
2400.000000	0.046000
2460.000000	0.046000
2520.000000	0.046000
2580.000000	0.046000
2640.000000	0.046000
2700.000000	0.046000
2760.000000	0.046000
2820.000000	0.046000
2880.000000	0.046000
2940.000000	0.046000
3000.000000	0.046000
3060.000000	0.046000
3120.000000	0.046000
3180.000000	0.046000
3240.000000	0.046000
3300.000000	0.046000
3360.000000	0.046000
3420.000000	0.046000
3480.000000	0.046000
3540.000000	0.046000
3600.000000	0.046000
3660.000000	0.046000
3720.000000	0.046000
3780.000000	0.046000
3840.000000	0.046000
3900.000000	0.046000
3960.000000	0.046000
4020.000000	0.046000
4080.000000	0.046000
4140.000000	0.046000
4200.000000	0.046000
4260.000000	0.046000
4320.000000	0.046000
4380.000000	0.046000
4440.000000	0.046000
4500.000000	0.046000
4560.000000	0.046000
4620.000000	0.046000
4680.000000	0.046000
4740.000000	0.046000
4800.000000	0.046000
4860.000000	0.046000
4920.000000	0.046000
4980.000000	0.046000
5040.000000	0.046000
5100.000000	0.046000
5160.000000	0.046000
5220.000000	0.046000
5280.000000	0.046000
5340.000000	0.154000
5400.000000	0.154000
5460.000000	0.154000
5520.000000	0.154000
5580.000000	0.154000
5640.000000	0.154000
5700.000000	0.154000
5760.000000	0.154000
5820.000000	0.154000
5880.000000	0.154000
5940.000000	0.154000
6000.000000	0.154000
6060.000000	0.154000
6120.000000	0.154000
6180.000000	0.154000
6240.000000	0.154000
6300.000000	0.154000
6360.000000	0.154000
6420.000000	0.046000
6480.000000	0.046000
6540.000000	0.046000
6600.000000	0.046000
6660.000000	0.046000
6720.000000	0.046000
6780.000000	0.046000
6840.000000	0.046000
6900.000000	0.046000
6960.000000	0.046000
7020.000000	0.046000
7080.000000	0.046000
7140.000000	0.046000
7200.000000	0.046000
7260.000000	0.046000
7320.000000	0.046000
7380.000000	0.046000
7440.000000	0.046000
7500.000000	0.046000
7560.000000	0.046000
7620.000000	0.046000
7680.000000	0.046000
7740.000000	0.046000
7800.000000	0.046000
7860.000000	0.046000
7920.000000	0.046000
7980.000000	0.046000
8040.000000	0.046000
8100.000000	0.046000
8160.000000	0.046000
8220.000000	0.046000
8280.000000	0.046000
8340.000000	0.046000
8400.000000	0.046000
8460.000000	0.046000
8520.000000	0.046000
8580.000000	0.046000
8640.000000	0.046000
8700.000000	0.046000
8760.000000	0.046000
8820.000000	0.046000
8880.000000	0.154000
8940.000000	0.154000
9000.000000	0.154000
9060.000000	0.154000
9120.000000	0.154000
9180.000000	0.154000
9240.000000	0.154000
9300.000000	0.154000
9360.000000	0.154000
9420.000000	0.154000
9480.000000	0.154000
9540.000000	0.154000
9600.000000	0.154000
9660.000000	0.154000
9720.000000	0.154000
9780.000000	0.154000
9840.000000	0.154000
9900.000000	0.154000
9960.000000	0.046000
10020.000000	0.046000
10080.000000	0.046000
10140.000000	0.046000
10200.000000	0.046000
10260.000000	0.046000
10320.000000	0.046000
10380.000000	0.046000
10440.000000	0.046000
10500.000000	0.046000
10560.000000	0.046000
10620.000000	0.046000
10680.000000	0.046000
10740.000000	0.046000
10800.000000	0.046000
10860.000000	0.046000
10920.000000	0.046000
10980.000000	0.046000
11040.000000	0.046000
11100.000000	0.046000
11160.000000	0.046000
11220.000000	0.046000
11280.000000	0.046000
11340.000000	0.046000
11400.000000	0.046000
11460.000000	0.046000
11520.000000	0.046000
11580.000000	0.046000
11640.000000	0.046000
11700.000000	0.046000
11760.000000	0.046000
11820.000000	0.046000
11880.000000	0.046000
11940.000000	0.046000
12000.000000	0.046000
12060.000000	0.046000
12120.000000	0.046000
12180.000000	0.046000
12240.000000	0.046000
12300.000000	0.046000
12360.000000	0.046000
12420.000000	0.046000
12480.000000	0.046000
12540.000000	0.046000
12600.000000	0.046000
12660.000000	0.046000
12720.000000	0.046000
12780.000000	0.046000
12840.000000	0.046000
12900.000000	0.046000
12960.000000	0.046000
13020.000000	0.046000
13080.000000	0.046000
13140.000000	0.046000
13200.000000	0.046000
13260.000000	0.046000
13320.000000	0.046000
13380.000000	0.046000
13440.000000	0.046000
13500.000000	0.046000
13560.000000	0.046000
13620.000000	0.046000
13680.000000	0.046000
13740.000000	0.046000
13800.000000	0.046000
13860.000000	0.046000
13920.000000	0.046000
13980.000000	0.046000
14040.000000	0.046000
14100.000000	0.046000
14160.000000	0.046000
14220.000000	0.046000
14280.000000	0.046000
14340.000000	0.046000
14400.000000	0.046000
14460.000000	0.046000
14520.000000	0.046000
14580.000000	0.046000
14640.000000	0.046000
14700.000000	0.046000
14760.000000	0.046000
14820.000000	0.046000
14880.000000	0.046000
14940.000000	0.046000
15000.000000	0.046000
15060.000000	0.046000
15120.000000	0.046000
15180.000000	0.046000
15240.000000	0.046000
15300.000000	0.046000
15360.000000	0.046000
15420.000000	0.046000
15480.000000	0.046000
15540.000000	0.046000
15600.000000	0.046000
15660.000000	0.046000
15720.000000	0.046000
15780.000000	0.046000
15840.000000	0.046000
15900.000000	0.046000
15960.000000	0.046000
16020.000000	0.046000
16080.000000	0.046000
16140.000000	0.046000
16200.000000	0.046000
16260.000000	0.046000
16320.000000	0.046000
16380.000000	0.046000
16440.000000	0.046000
16500.000000	0.046000
16560.000000	0.046000
16620.000000	0.046000
16680.000000	0.046000
16740.000000	0.046000
16800.000000	0.046000
16860.000000	0.046000
16920.000000	0.046000
16980.000000	0.046000
17040.000000	0.046000
17100.000000	0.154000
17160.000000	0.154000
17220.000000	0.154000
17280.000000	0.154000
17340.000000	0.154000
17400.000000	0.154000
17460.000000	0.154000
17520.000000	0.154000
17580.000000	0.154000
17640.000000	0.154000
17700.000000	0.154000
17760.000000	0.154000
17820.000000	0.154000
17880.000000	0.154000
17940.000000	0.154000
18000.000000	0.154000
18060.000000	0.154000
18120.000000	0.154000
18180.000000	0.046000
18240.000000	0.046000
18300.000000	0.046000
18360.000000	0.046000
18420.000000	0.046000
18480.000000	0.046000
18540.000000	0.046000
18600.000000	0.046000
18660.000000	0.046000
18720.000000	0.046000
18780.000000	0.046000
18840.000000	0.046000
18900.000000	0.046000
18960.000000	0.046000
19020.000000	0.046000
19080.000000	0.046000
19140.000000	0.046000
19200.000000	0.046000
19260.000000	0.046000
19320.000000	0.046000
19380.000000	0.046000
19440.000000	0.046000
19500.000000	0.046000
19560.000000	0.046000
19620.000000	0.046000
19680.000000	0.046000
19740.000000	0.046000
19800.000000	0.046000
19860.000000	0.046000
19920.000000	0.046000
19980.000000	0.046000
20040.000000	2.305000
20100.000000	2.305000
20160.000000	2.305000
20220.000000	0.106000
20280.000000	0.118000
20340.000000	0.118000
20400.000000	0.118000
20460.000000	0.178000
20520.000000	0.118000
20580.000000	0.138000
20640.000000	0.138000
20700.000000	0.138000
20760.000000	0.138000
20820.000000	0.150000
20880.000000	0.150000
20940.000000	0.150000
21000.000000	0.130000
21060.000000	0.130000
21120.000000	0.130000
21180.000000	0.130000
21240.000000	0.130000
21300.000000	0.130000
21360.000000	0.130000
21420.000000	0.130000
21480.000000	0.130000
21540.000000	0.130000
21600.000000	0.130000
21660.000000	2.389000
21720.000000	2.389000
21780.000000	2.389000
21840.000000	0.118000
21900.000000	0.118000
21960.000000	0.118000
22020.000000	0.178000
22080.000000	0.118000
22140.000000	0.118000
22200.000000	0.118000
22260.000000	0.118000
22320.000000	0.118000
22380.000000	0.118000
22440.000000	0.118000
22500.000000	0.226000
22560.000000	0.226000
22620.000000	0.226000
22680.000000	0.226000
22740.000000	0.226000
22800.000000	0.226000
22860.000000	0.286000
22920.000000	0.286000
22980.000000	0.286000
23040.000000	0.286000
23100.000000	0.286000
23160.000000	0.286000
23220.000000	0.226000
23280.000000	0.226000
23340.000000	0.226000
23400.000000	0.226000
23460.000000	0.286000
23520.000000	0.226000
23580.000000	0.118000
23640.000000	0.118000
23700.000000	0.118000
23760.000000	0.118000
23820.000000	0.118000
23880.000000	0.118000
23940.000000	0.058000
24000.000000	0.058000
24060.000000	0.070000
24120.000000	0.070000
24180.000000	0.078000
24240.000000	0.078000
24300.000000	0.078000
24360.000000	0.078000
24420.000000	0.066000
24480.000000	0.066000
24540.000000	0.066000
24600.000000	0.066000
24660.000000	0.066000
24720.000000	0.066000
24780.000000	0.066000
24840.000000	0.066000
24900.000000	0.066000
24960.000000	0.066000
25020.000000	0.126000
25080.000000	0.126000
25140.000000	0.126000
25200.000000	0.126000
25260.000000	0.126000
25320.000000	0.126000
25380.000000	0.106000
25440.000000	0.106000
25500.000000	0.106000
25560.000000	0.106000
25620.000000	0.106000
25680.000000	0.106000
25740.000000	0.106000
25800.000000	8.894000
25860.000000	8.894000
25920.000000	8.894000
25980.000000	2.365000
26040.000000	2.365000
26100.000000	2.365000
26160.000000	0.118000
26220.000000	0.178000
26280.000000	0.118000
26340.000000	0.118000
26400.000000	0.118000
26460.000000	0.118000
26520.000000	0.118000
26580.000000	0.118000
26640.000000	0.118000
26700.000000	0.118000
26760.000000	0.226000
26820.000000	0.226000
26880.000000	0.226000
26940.000000	0.226000
27000.000000	0.226000
27060.000000	0.226000
27120.000000	0.226000
27180.000000	0.214000
27240.000000	0.214000
27300.000000	0.214000
27360.000000	0.214000
27420.000000	0.214000
27480.000000	0.214000
27540.000000	0.214000
27600.000000	0.214000
27660.000000	0.214000
27720.000000	2.473000
27780.000000	2.473000
27840.000000	2.365000
27900.000000	0.106000
27960.000000	0.106000
28020.000000	0.106000
28080.000000	0.118000
28140.000000	0.118000
28200.000000	0.118000
28260.000000	0.118000
28320.000000	0.058000
28380.000000	0.118000
28440.000000	0.118000
28500.000000	0.118000
28560.000000	0.118000
28620.000000	0.118000
28680.000000	0.118000
28740.000000	0.118000
28800.000000	0.166000
28860.000000	0.166000
28920.000000	0.106000
28980.000000	0.166000
29040.000000	0.166000
29100.000000	0.106000
29160.000000	0.106000
29220.000000	0.146000
29280.000000	0.118000
29340.000000	0.118000
29400.000000	0.118000
29460.000000	0.130000
29520.000000	0.190000
29580.000000	0.190000
29640.000000	0.190000
29700.000000	0.250000
29760.000000	0.250000
29820.000000	0.190000
29880.000000	0.190000
29940.000000	0.190000
30000.000000	0.190000
30060.000000	0.190000
30120.000000	0.130000
30180.000000	0.130000
30240.000000	0.238000
30300.000000	0.238000
30360.000000	0.238000
30420.000000	0.238000
30480.000000	0.238000
30540.000000	0.226000
30600.000000	0.226000
30660.000000	0.266000
30720.000000	0.266000
30780.000000	0.266000
30840.000000	0.266000
30900.000000	0.266000
30960.000000	0.266000
31020.000000	0.266000
31080.000000	0.206000
31140.000000	0.206000
31200.000000	0.206000
31260.000000	0.206000
31320.000000	0.098000
31380.000000	0.098000
31440.000000	0.098000
31500.000000	0.098000
31560.000000	0.098000
31620.000000	0.098000
31680.000000	0.098000
31740.000000	0.098000
31800.000000	0.098000
31860.000000	0.098000
31920.000000	0.098000
31980.000000	0.098000
32040.000000	0.098000
32100.000000	0.098000
32160.000000	0.098000
32220.000000	0.098000
32280.000000	0.098000
32340.000000	0.098000
32400.000000	0.098000
32460.000000	0.170000
32520.000000	0.170000
32580.000000	0.170000
32640.000000	0.170000
32700.000000	1.984000
32760.000000	1.984000
32820.000000	1.984000
32880.000000	1.984000
32940.000000	3.967000
33000.000000	3.967000
33060.000000	3.967000
33120.000000	3.967000
33180.000000	3.967000
33240.000000	3.967000
33300.000000	3.967000
33360.000000	3.967000
33420.000000	3.967000
33480.000000	3.967000
33540.000000	3.955000
33600.000000	3.955000
33660.000000	3.955000
33720.000000	3.955000
33780.000000	3.955000
33840.000000	3.955000
33900.000000	2.141000
33960.000000	2.141000
34020.000000	2.141000
34080.000000	2.141000
34140.000000	2.141000
34200.000000	0.158000
34260.000000	0.158000
34320.000000	0.158000
34380.000000	0.158000
34440.000000	0.158000
34500.000000	0.158000
34560.000000	0.158000
34620.000000	0.158000
34680.000000	0.158000
34740.000000	0.158000
34800.000000	0.158000
34860.000000	0.158000
34920.000000	0.158000
34980.000000	0.158000
35040.000000	0.158000
35100.000000	0.158000
35160.000000	2.417000
35220.000000	2.417000
35280.000000	2.417000
35340.000000	0.158000
35400.000000	0.266000
35460.000000	0.266000
35520.000000	0.266000
35580.000000	0.266000
35640.000000	0.266000
35700.000000	0.266000
35760.000000	0.266000
35820.000000	0.266000
35880.000000	0.266000
35940.000000	0.266000
36000.000000	0.266000
36060.000000	0.266000
36120.000000	0.266000
36180.000000	0.266000
36240.000000	0.266000
36300.000000	0.266000
36360.000000	0.266000
36420.000000	0.278000
36480.000000	0.170000
36540.000000	0.170000
36600.000000	0.170000
36660.000000	0.170000
36720.000000	0.230000
36780.000000	0.230000
36840.000000	0.230000
36900.000000	0.230000
36960.000000	0.230000
37020.000000	0.230000
37080.000000	0.230000
37140.000000	0.230000
37200.000000	0.230000
37260.000000	0.230000
37320.000000	0.230000
37380.000000	0.230000
37440.000000	0.230000
37500.000000	0.230000
37560.000000	0.230000
37620.000000	0.218000
37680.000000	0.218000
37740.000000	0.218000
37800.000000	0.218000
37860.000000	0.218000
37920.000000	0.218000
37980.000000	0.395000
38040.000000	0.395000
38100.000000	0.218000
38160.000000	0.218000
38220.000000	0.218000
38280.000000	0.218000
38340.000000	0.218000
38400.000000	0.218000
38460.000000	0.218000
38520.000000	0.218000
38580.000000	0.218000
38640.000000	0.218000
38700.000000	0.218000
38760.000000	0.395000
38820.000000	0.395000
38880.000000	0.218000
38940.000000	0.218000
39000.000000	0.218000
39060.000000	0.218000
39120.000000	0.218000
39180.000000	0.218000
39240.000000	0.218000
39300.000000	0.326000
39360.000000	2.585000
39420.000000	2.545000
39480.000000	2.545000
39540.000000	0.463000
39600.000000	0.463000
39660.000000	0.286000
39720.000000	0.286000
39780.000000	0.286000
39840.000000	0.286000
39900.000000	0.286000
39960.000000	0.286000
40020.000000	0.286000
40080.000000	0.358000
40140.000000	0.358000
40200.000000	0.358000
40260.000000	0.298000
40320.000000	0.475000
40380.000000	0.367000
40440.000000	0.685000
40500.000000	0.685000
40560.000000	2.668000
40620.000000	2.668000
40680.000000	2.668000
40740.000000	4.600000
40800.000000	4.600000
40860.000000	4.600000
40920.000000	4.600000
40980.000000	4.600000
41040.000000	4.600000
41100.000000	4.600000
41160.000000	4.600000
41220.000000	4.600000
41280.000000	4.600000
41340.000000	4.600000
41400.000000	4.600000
41460.000000	4.600000
41520.000000	4.600000
41580.000000	4.600000
41640.000000	4.600000
41700.000000	4.600000
41760.000000	4.600000
41820.000000	2.617000
41880.000000	2.617000
41940.000000	2.617000
42000.000000	2.617000
42060.000000	2.617000
42120.000000	2.617000
42180.000000	2.617000
42240.000000	2.617000
42300.000000	2.617000
42360.000000	2.617000
42420.000000	2.617000
42480.000000	2.617000
42540.000000	2.617000
42600.000000	2.617000
42660.000000	2.617000
42720.000000	2.617000
42780.000000	2.617000
42840.000000	2.617000
42900.000000	2.617000
42960.000000	2.617000
43020.000000	2.617000
43080.000000	2.617000
43140.000000	2.617000
43200.000000	2.617000
43260.000000	2.617000
43320.000000	2.617000
43380.000000	2.617000
43440.000000	2.617000
43500.000000	2.617000
43560.000000	2.617000
43620.000000	2.617000
43680.000000	2.617000
43740.000000	2.617000
43800.000000	2.617000
43860.000000	2.617000
43920.000000	2.617000
43980.000000	2.617000
44040.000000	2.617000
44100.000000	2.617000
44160.000000	2.617000
44220.000000	2.617000
44280.000000	2.617000
44340.000000	0.118000
44400.000000	0.118000
44460.000000	0.118000
44520.000000	0.118000
44580.000000	0.118000
44640.000000	0.118000
44700.000000	0.118000
44760.000000	0.226000
44820.000000	0.226000
44880.000000	0.226000
44940.000000	0.226000
45000.000000	0.226000
45060.000000	0.226000
45120.000000	0.226000
45180.000000	0.226000
45240.000000	0.226000
45300.000000	0.226000
45360.000000	0.226000
45420.000000	0.226000
45480.000000	0.226000
45540.000000	0.226000
45600.000000	0.403000
45660.000000	0.403000
45720.000000	0.226000
45780.000000	0.226000
45840.000000	0.118000
45900.000000	0.118000
45960.000000	0.118000
46020.000000	0.118000
46080.000000	0.118000
46140.000000	0.118000
46200.000000	0.118000
46260.000000	0.118000
46320.000000	0.118000
46380.000000	0.295000
46440.000000	0.295000
46500.000000	0.118000
46560.000000	0.118000
46620.000000	0.118000
46680.000000	0.118000
46740.000000	0.118000
46800.000000	0.118000
46860.000000	0.118000
46920.000000	0.118000
46980.000000	0.118000
47040.000000	0.118000
47100.000000	0.118000
47160.000000	0.295000
47220.000000	0.295000
47280.000000	0.118000
47340.000000	0.118000
47400.000000	0.118000
47460.000000	0.118000
47520.000000	0.118000
47580.000000	0.118000
47640.000000	0.118000
47700.000000	0.118000
47760.000000	0.118000
47820.000000	0.118000
47880.000000	0.118000
47940.000000	0.295000
48000.000000	0.295000
48060.000000	0.613000
48120.000000	0.613000
48180.000000	0.613000
48240.000000	0.613000
48300.000000	0.613000
48360.000000	0.046000
48420.000000	0.046000
48480.000000	0.046000
48540.000000	0.046000
48600.000000	0.046000
48660.000000	0.046000
48720.000000	0.046000
48780.000000	0.046000
48840.000000	0.046000
48900.000000	0.046000
48960.000000	0.046000
49020.000000	0.046000
49080.000000	0.046000
49140.000000	0.046000
49200.000000	0.046000
49260.000000	0.046000
49320.000000	0.046000
49380.000000	0.046000
49440.000000	0.046000
49500.000000	0.046000
49560.000000	0.046000
49620.000000	0.046000
49680.000000	0.046000
49740.000000	0.046000
49800.000000	0.046000
49860.000000	0.046000
49920.000000	0.046000
49980.000000	0.046000
50040.000000	0.046000
50100.000000	0.046000
50160.000000	0.046000
50220.000000	0.046000
50280.000000	0.046000
50340.000000	0.046000
50400.000000	0.046000
50460.000000	0.046000
50520.000000	0.046000
50580.000000	0.046000
50640.000000	0.046000
50700.000000	0.046000
50760.000000	0.046000
50820.000000	0.046000
50880.000000	0.046000
50940.000000	0.046000
51000.000000	0.046000
51060.000000	0.046000
51120.000000	0.046000
51180.000000	0.046000
51240.000000	0.046000
51300.000000	0.046000
51360.000000	0.046000
51420.000000	0.046000
51480.000000	0.046000
51540.000000	0.046000
51600.000000	0.046000
51660.000000	0.046000
51720.000000	0.046000
51780.000000	0.046000
51840.000000	0.046000
51900.000000	0.046000
51960.000000	0.046000
52020.000000	0.046000
52080.000000	0.046000
52140.000000	0.046000
52200.000000	0.046000
52260.000000	0.046000
52320.000000	0.046000
52380.000000	0.046000
52440.000000	0.046000
52500.000000	0.046000
52560.000000	0.046000
52620.000000	0.046000
52680.000000	0.046000
52740.000000	0.046000
52800.000000	0.046000
52860.000000	0.046000
52920.000000	0.046000
52980.000000	0.046000
53040.000000	0.154000
53100.000000	0.154000
53160.000000	0.154000
53220.000000	0.154000
53280.000000	0.154000
53340.000000	0.154000
53400.000000	0.154000
53460.000000	0.154000
53520.000000	0.154000
53580.000000	0.154000
53640.000000	0.154000
53700.000000	0.154000
53760.000000	0.154000
53820.000000	0.154000
53880.000000	0.154000
53940.000000	0.154000
54000.000000	0.154000
54060.000000	0.154000
54120.000000	0.046000
54180.000000	0.046000
54240.000000	0.046000
54300.000000	0.046000
54360.000000	0.046000
54420.000000	0.046000
54480.000000	0.046000
54540.000000	0.046000
54600.000000	0.046000
54660.000000	0.046000
54720.000000	0.046000
54780.000000	0.046000
54840.000000	0.046000
54900.000000	0.046000
54960.000000	0.046000
55020.000000	0.046000
55080.000000	0.046000
55140.000000	0.046000
55200.000000	0.046000
55260.000000	0.046000
55320.000000	0.046000
55380.000000	0.046000
55440.000000	0.046000
55500.000000	0.046000
55560.000000	0.046000
55620.000000	0.046000
55680.000000	0.046000
55740.000000	0.046000
55800.000000	0.046000
55860.000000	0.046000
55920.000000	0.046000
55980.000000	0.046000
56040.000000	0.046000
56100.000000	0.046000
56160.000000	0.046000
56220.000000	0.046000
56280.000000	0.046000
56340.000000	0.046000
56400.000000	0.046000
56460.000000	0.046000
56520.000000	0.046000
56580.000000	0.046000
56640.000000	0.046000
56700.000000	0.046000
56760.000000	0.154000
56820.000000	0.154000
56880.000000	0.154000
56940.000000	0.154000
57000.000000	0.154000
57060.000000	0.154000
57120.000000	0.154000
57180.000000	0.154000
57240.000000	0.154000
57300.000000	0.154000
57360.000000	0.154000
57420.000000	0.154000
57480.000000	0.154000
57540.000000	0.154000
57600.000000	0.154000
57660.000000	0.154000
57720.000000	0.154000
57780.000000	0.154000
57840.000000	0.046000
57900.000000	0.046000
57960.000000	0.046000
58020.000000	0.046000
58080.000000	0.046000
58140.000000	0.046000
58200.000000	0.046000
58260.000000	0.046000
58320.000000	0.046000
58380.000000	0.046000
58440.000000	0.046000
58500.000000	0.046000
58560.000000	0.046000
58620.000000	0.046000
58680.000000	0.046000
58740.000000	0.046000
58800.000000	0.046000
58860.000000	0.046000
58920.000000	0.046000
58980.000000	0.046000
59040.000000	0.046000
59100.000000	0.046000
59160.000000	0.046000
59220.000000	0.046000
59280.000000	0.046000
59340.000000	0.046000
59400.000000	0.046000
59460.000000	0.046000
59520.000000	0.046000
59580.000000	0.046000
59640.000000	0.046000
59700.000000	0.046000
59760.000000	0.046000
59820.000000	0.046000
59880.000000	0.046000
59940.000000	0.046000
60000.000000	0.046000
60060.000000	0.046000
60120.000000	0.046000
60180.000000	0.046000
60240.000000	0.046000
60300.000000	0.046000
60360.000000	0.046000
60420.000000	0.046000
60480.000000	0.046000
60540.000000	0.046000
60600.000000	0.046000
60660.000000	0.046000
60720.000000	0.046000
60780.000000	0.046000
60840.000000	0.046000
60900.000000	0.046000
60960.000000	0.046000
61020.000000	0.046000
61080.000000	0.046000
61140.000000	0.046000
61200.000000	0.046000
61260.000000	0.154000
61320.000000	0.154000
61380.000000	0.154000
61440.000000	0.154000
61500.000000	0.154000
61560.000000	0.154000
61620.000000	0.154000
61680.000000	0.154000
61740.000000	0.154000
61800.000000	0.154000
61860.000000	0.154000
61920.000000	0.154000
61980.000000	0.154000
62040.000000	0.154000
62100.000000	0.154000
62160.000000	0.154000
62220.000000	0.154000
62280.000000	0.154000
62340.000000	0.046000
62400.000000	0.046000
62460.000000	0.046000
62520.000000	0.046000
62580.000000	0.046000
62640.000000	0.046000
62700.000000	0.046000
62760.000000	0.046000
62820.000000	0.046000
62880.000000	0.046000
62940.000000	0.046000
63000.000000	0.106000
63060.000000	0.106000
63120.000000	0.106000
63180.000000	0.106000
63240.000000	0.046000
63300.000000	0.046000
63360.000000	0.046000
63420.000000	0.046000
63480.000000	0.046000
63540.000000	0.046000
63600.000000	0.046000
63660.000000	0.057000
63720.000000	0.057000
63780.000000	0.057000
63840.000000	0.117000
63900.000000	0.057000
63960.000000	0.057000
64020.000000	0.057000
64080.000000	0.117000
64140.000000	0.117000
64200.000000	0.117000
64260.000000	0.252000
64320.000000	0.252000
64380.000000	0.252000
64440.000000	0.192000
64500.000000	0.192000
64560.000000	0.192000
64620.000000	0.192000
64680.000000	0.300000
64740.000000	0.300000
64800.000000	0.300000
64860.000000	0.380000
64920.000000	0.380000
64980.000000	0.412000
65040.000000	0.412000
65100.000000	0.412000
65160.000000	0.412000
65220.000000	0.412000
65280.000000	0.412000
65340.000000	0.412000
65400.000000	0.412000
65460.000000	2.395000
65520.000000	2.395000
65580.000000	2.355000
65640.000000	2.367000
65700.000000	2.355000
65760.000000	2.247000
65820.000000	2.342000
65880.000000	4.601000
65940.000000	4.601000
66000.000000	4.601000
66060.000000	2.342000
66120.000000	2.354000
66180.000000	2.354000
66240.000000	2.354000
66300.000000	2.354000
66360.000000	2.354000
66420.000000	2.394000
66480.000000	2.394000
66540.000000	2.394000
66600.000000	2.394000
66660.000000	2.454000
66720.000000	0.471000
66780.000000	0.511000
66840.000000	0.451000
66900.000000	0.511000
66960.000000	0.511000
67020.000000	0.511000
67080.000000	0.511000
67140.000000	0.511000
67200.000000	0.511000
67260.000000	0.471000
67320.000000	0.471000
67380.000000	0.471000
67440.000000	0.471000
67500.000000	0.471000
67560.000000	0.471000
67620.000000	0.471000
67680.000000	0.471000
67740.000000	0.471000
67800.000000	0.471000
67860.000000	0.471000
67920.000000	0.471000
67980.000000	0.471000
68040.000000	0.460000
68100.000000	0.460000
68160.000000	0.460000
68220.000000	0.568000
68280.000000	0.568000
68340.000000	0.568000
68400.000000	0.568000
68460.000000	0.568000
68520.000000	0.568000
68580.000000	0.579000
68640.000000	0.579000
68700.000000	0.579000
68760.000000	0.579000
68820.000000	0.579000
68880.000000	0.579000
68940.000000	0.579000
69000.000000	0.579000
69060.000000	0.579000
69120.000000	0.639000
69180.000000	0.639000
69240.000000	0.579000
69300.000000	0.471000
69360.000000	0.471000
69420.000000	0.471000
69480.000000	0.471000
69540.000000	0.471000
69600.000000	0.471000
69660.000000	0.471000
69720.000000	0.459000
69780.000000	0.459000
69840.000000	0.459000
69900.000000	0.459000
69960.000000	0.459000
70020.000000	0.459000
70080.000000	0.459000
70140.000000	0.459000
70200.000000	0.459000
70260.000000	0.459000
70320.000000	0.459000
70380.000000	0.459000
70440.000000	0.459000
70500.000000	0.636000
70560.000000	0.636000
70620.000000	0.459000
70680.000000	0.479000
70740.000000	0.479000
70800.000000	0.479000
70860.000000	0.479000
70920.000000	0.479000
70980.000000	0.479000
71040.000000	0.479000
71100.000000	0.539000
71160.000000	0.539000
71220.000000	0.539000
71280.000000	0.716000
71340.000000	0.716000
71400.000000	0.539000
71460.000000	0.539000
71520.000000	0.491000
71580.000000	0.491000
71640.000000	0.479000
71700.000000	0.479000
71760.000000	0.479000
71820.000000	0.479000
71880.000000	0.479000
71940.000000	0.479000
72000.000000	0.479000
72060.000000	0.656000
72120.000000	0.656000
72180.000000	0.479000
72240.000000	0.479000
72300.000000	0.479000
72360.000000	0.479000
72420.000000	0.479000
72480.000000	0.479000
72540.000000	0.587000
72600.000000	0.587000
72660.000000	0.587000
72720.000000	0.587000
72780.000000	0.587000
72840.000000	0.764000
72900.000000	0.764000
72960.000000	1.131000
73020.000000	1.131000
73080.000000	1.071000
73140.000000	1.071000
73200.000000	1.071000
73260.000000	0.504000
73320.000000	0.504000
73380.000000	0.504000
73440.000000	0.504000
73500.000000	0.504000
73560.000000	0.504000
73620.000000	0.408000
73680.000000	0.408000
73740.000000	0.408000
73800.000000	0.408000
73860.000000	0.408000
73920.000000	0.408000
73980.000000	0.408000
74040.000000	0.408000
74100.000000	0.408000
74160.000000	0.388000
74220.000000	0.388000
74280.000000	0.388000
74340.000000	0.388000
74400.000000	0.388000
74460.000000	0.408000
74520.000000	0.408000
74580.000000	0.408000
74640.000000	0.408000
74700.000000	0.408000
74760.000000	0.388000
74820.000000	0.388000
74880.000000	0.388000
74940.000000	0.388000
75000.000000	0.388000
75060.000000	0.388000
75120.000000	0.388000
75180.000000	0.388000
75240.000000	0.399000
75300.000000	0.399000
75360.000000	0.399000
75420.000000	0.399000
75480.000000	0.399000
75540.000000	0.399000
75600.000000	0.399000
75660.000000	0.411000
75720.000000	0.411000
75780.000000	0.411000
75840.000000	0.411000
75900.000000	0.411000
75960.000000	0.411000
76020.000000	0.411000
76080.000000	0.399000
76140.000000	0.399000
76200.000000	0.399000
76260.000000	0.399000
76320.000000	0.399000
76380.000000	0.399000
76440.000000	0.399000
76500.000000	0.459000
76560.000000	0.399000
76620.000000	0.399000
76680.000000	0.399000
76740.000000	0.399000
76800.000000	0.399000
76860.000000	0.399000
76920.000000	0.399000
76980.000000	0.339000
77040.000000	0.204000
77100.000000	0.264000
77160.000000	0.264000
77220.000000	0.264000
77280.000000	0.224000
77340.000000	0.224000
77400.000000	0.224000
77460.000000	0.359000
77520.000000	0.359000
77580.000000	0.359000
77640.000000	0.359000
77700.000000	0.359000
77760.000000	0.359000
77820.000000	0.359000
77880.000000	0.359000
77940.000000	0.359000
78000.000000	0.359000
78060.000000	0.359000
78120.000000	0.359000
78180.000000	0.371000
78240.000000	0.371000
78300.000000	0.371000
78360.000000	0.371000
78420.000000	0.371000
78480.000000	0.371000
78540.000000	0.371000
78600.000000	0.371000
78660.000000	0.371000
78720.000000	0.299000
78780.000000	0.299000
78840.000000	0.299000
78900.000000	0.299000
78960.000000	0.299000
79020.000000	0.299000
79080.000000	0.299000
79140.000000	0.299000
79200.000000	0.359000
79260.000000	0.299000
79320.000000	0.299000
79380.000000	0.299000
79440.000000	0.299000
79500.000000	0.299000
79560.000000	0.287000
79620.000000	0.276000
79680.000000	0.276000
79740.000000	0.216000
79800.000000	0.216000
79860.000000	0.344000
79920.000000	0.344000
79980.000000	0.320000
80040.000000	0.320000
80100.000000	0.320000
80160.000000	0.320000
80220.000000	0.320000
80280.000000	0.320000
80340.000000	0.320000
80400.000000	0.332000
80460.000000	0.344000
80520.000000	0.344000
80580.000000	0.379000
80640.000000	0.379000
80700.000000	0.379000
80760.000000	0.379000
80820.000000	0.439000
80880.000000	0.439000
80940.000000	0.331000
81000.000000	0.196000
81060.000000	0.196000
81120.000000	0.196000
81180.000000	0.196000
81240.000000	0.196000
81300.000000	0.196000
81360.000000	0.196000
81420.000000	0.196000
81480.000000	0.196000
81540.000000	0.236000
81600.000000	0.236000
81660.000000	0.236000
81720.000000	0.236000
81780.000000	0.236000
81840.000000	0.236000
81900.000000	0.236000
81960.000000	0.236000
82020.000000	0.236000
82080.000000	0.236000
82140.000000	0.236000
82200.000000	0.236000
82260.000000	0.236000
82320.000000	0.236000
82380.000000	0.236000
82440.000000	0.196000
82500.000000	0.196000
82560.000000	0.196000
82620.000000	0.136000
82680.000000	0.136000
82740.000000	0.196000
82800.000000	0.196000
82860.000000	0.046000
82920.000000	0.046000
82980.000000	0.046000
83040.000000	0.046000
83100.000000	0.046000
83160.000000	0.046000
83220.000000	0.046000
83280.000000	0.046000
83340.000000	0.046000
83400.000000	0.046000
83460.000000	0.046000
83520.000000	0.046000
83580.000000	0.046000
83640.000000	0.046000
83700.000000	0.154000
83760.000000	0.154000
83820.000000	0.154000
83880.000000	0.154000
83940.000000	0.154000
84000.000000	0.154000
84060.000000	0.154000
84120.000000	0.154000
84180.000000	0.154000
84240.000000	0.154000
84300.000000	0.154000
84360.000000	0.154000
84420.000000	0.154000
84480.000000	0.154000
84540.000000	0.154000
84600.000000	0.154000
84660.000000	0.154000
84720.000000	0.154000
84780.000000	0.046000
84840.000000	0.046000
84900.000000	0.046000
84960.000000	0.046000
85020.000000	0.046000
85080.000000	0.046000
85140.000000	0.046000
85200.000000	0.046000
85260.000000	0.046000
85320.000000	0.046000
85380.000000	0.046000
85440.000000	0.046000
85500.000000	0.046000
85560.000000	0.046000
85620.000000	0.046000
85680.000000	0.046000
85740.000000	0.046000
85800.000000	0.046000
85860.000000	0.046000
85920.000000	0.046000
85980.000000	0.046000
86040.000000	0.046000
86100.000000	0.046000
86160.000000	0.046000
86220.000000	0.046000
86280.000000	0.046000
86340.000000	0.046000
86400.000000	0.046000
