#1
double LoadProfile(1440,2)
60.000000	0.053000
120.000000	0.053000
180.000000	0.053000
240.000000	0.053000
300.000000	0.053000
360.000000	0.053000
420.000000	0.053000
480.000000	0.053000
540.000000	0.053000
600.000000	0.053000
660.000000	0.053000
720.000000	0.053000
780.000000	0.053000
840.000000	0.053000
900.000000	0.053000
960.000000	0.053000
1020.000000	0.053000
1080.000000	0.053000
1140.000000	0.053000
1200.000000	0.053000
1260.000000	0.053000
1320.000000	0.053000
1380.000000	0.053000
1440.000000	0.053000
1500.000000	0.053000
1560.000000	0.053000
1620.000000	0.053000
1680.000000	0.053000
1740.000000	0.053000
1800.000000	0.053000
1860.000000	0.053000
1920.000000	0.053000
1980.000000	0.053000
2040.000000	0.053000
2100.000000	0.053000
2160.000000	0.053000
2220.000000	0.053000
2280.000000	0.053000
2340.000000	0.053000
2400.000000	0.053000
2460.000000	0.053000
2520.000000	0.053000
2580.000000	0.053000
2640.000000	0.053000
2700.000000	0.053000
2760.000000	0.053000
2820.000000	0.053000
2880.000000	0.053000
2940.000000	0.053000
3000.000000	0.053000
3060.000000	0.053000
3120.000000	0.053000
3180.000000	0.053000
3240.000000	0.053000
3300.000000	0.053000
3360.000000	0.053000
3420.000000	0.053000
3480.000000	0.053000
3540.000000	0.053000
3600.000000	0.053000
3660.000000	0.053000
3720.000000	0.053000
3780.000000	0.053000
3840.000000	0.053000
3900.000000	0.053000
3960.000000	0.053000
4020.000000	0.053000
4080.000000	0.053000
4140.000000	0.053000
4200.000000	0.053000
4260.000000	0.053000
4320.000000	0.053000
4380.000000	0.053000
4440.000000	0.259000
4500.000000	0.259000
4560.000000	0.259000
4620.000000	0.259000
4680.000000	0.259000
4740.000000	0.259000
4800.000000	0.259000
4860.000000	0.259000
4920.000000	0.259000
4980.000000	0.259000
5040.000000	0.259000
5100.000000	0.259000
5160.000000	0.259000
5220.000000	0.259000
5280.000000	0.053000
5340.000000	0.053000
5400.000000	0.053000
5460.000000	0.053000
5520.000000	0.053000
5580.000000	0.053000
5640.000000	0.053000
5700.000000	0.053000
5760.000000	0.053000
5820.000000	0.053000
5880.000000	0.053000
5940.000000	0.053000
6000.000000	0.053000
6060.000000	0.053000
6120.000000	0.053000
6180.000000	0.053000
6240.000000	0.053000
6300.000000	0.053000
6360.000000	0.053000
6420.000000	0.053000
6480.000000	0.053000
6540.000000	0.053000
6600.000000	0.053000
6660.000000	0.053000
6720.000000	0.053000
6780.000000	0.053000
6840.000000	0.053000
6900.000000	0.053000
6960.000000	0.053000
7020.000000	0.053000
7080.000000	0.053000
7140.000000	0.053000
7200.000000	0.053000
7260.000000	0.053000
7320.000000	0.053000
7380.000000	0.053000
7440.000000	0.053000
7500.000000	0.053000
7560.000000	0.053000
7620.000000	0.053000
7680.000000	0.053000
7740.000000	0.053000
7800.000000	0.053000
7860.000000	0.053000
7920.000000	0.053000
7980.000000	0.053000
8040.000000	0.053000
8100.000000	0.053000
8160.000000	0.053000
8220.000000	0.053000
8280.000000	0.053000
8340.000000	0.053000
8400.000000	0.053000
8460.000000	0.053000
8520.000000	0.053000
8580.000000	0.053000
8640.000000	0.053000
8700.000000	0.053000
8760.000000	0.053000
8820.000000	0.053000
8880.000000	0.053000
8940.000000	0.053000
9000.000000	0.053000
9060.000000	0.053000
9120.000000	0.053000
9180.000000	0.053000
9240.000000	0.259000
9300.000000	0.259000
9360.000000	0.259000
9420.000000	0.259000
9480.000000	0.259000
9540.000000	0.259000
9600.000000	0.259000
9660.000000	0.259000
9720.000000	0.259000
9780.000000	0.259000
9840.000000	0.259000
9900.000000	0.259000
9960.000000	0.259000
10020.000000	0.259000
10080.000000	0.053000
10140.000000	0.053000
10200.000000	0.053000
10260.000000	0.053000
10320.000000	0.053000
10380.000000	0.053000
10440.000000	0.053000
10500.000000	0.053000
10560.000000	0.053000
10620.000000	0.053000
10680.000000	0.053000
10740.000000	0.053000
10800.000000	0.053000
10860.000000	0.053000
10920.000000	0.053000
10980.000000	0.053000
11040.000000	0.053000
11100.000000	0.053000
11160.000000	0.053000
11220.000000	0.053000
11280.000000	0.053000
11340.000000	0.053000
11400.000000	0.053000
11460.000000	0.053000
11520.000000	0.053000
11580.000000	0.053000
11640.000000	0.053000
11700.000000	0.053000
11760.000000	0.053000
11820.000000	0.053000
11880.000000	0.053000
11940.000000	0.053000
12000.000000	0.053000
12060.000000	0.053000
12120.000000	0.053000
12180.000000	0.053000
12240.000000	0.053000
12300.000000	0.053000
12360.000000	0.053000
12420.000000	0.053000
12480.000000	0.053000
12540.000000	0.053000
12600.000000	0.053000
12660.000000	0.053000
12720.000000	0.053000
12780.000000	0.053000
12840.000000	0.053000
12900.000000	0.053000
12960.000000	0.053000
13020.000000	0.053000
13080.000000	0.053000
13140.000000	0.053000
13200.000000	0.053000
13260.000000	0.053000
13320.000000	0.053000
13380.000000	0.053000
13440.000000	0.053000
13500.000000	0.053000
13560.000000	0.053000
13620.000000	0.053000
13680.000000	0.053000
13740.000000	0.053000
13800.000000	0.053000
13860.000000	0.053000
13920.000000	0.053000
13980.000000	0.053000
14040.000000	0.053000
14100.000000	0.053000
14160.000000	0.053000
14220.000000	0.053000
14280.000000	0.053000
14340.000000	0.053000
14400.000000	0.053000
14460.000000	0.259000
14520.000000	0.259000
14580.000000	0.259000
14640.000000	0.259000
14700.000000	0.259000
14760.000000	0.259000
14820.000000	0.259000
14880.000000	0.259000
14940.000000	0.259000
15000.000000	0.259000
15060.000000	0.259000
15120.000000	0.259000
15180.000000	0.259000
15240.000000	0.259000
15300.000000	0.053000
15360.000000	0.053000
15420.000000	0.053000
15480.000000	0.053000
15540.000000	0.053000
15600.000000	0.053000
15660.000000	0.053000
15720.000000	0.053000
15780.000000	0.053000
15840.000000	0.053000
15900.000000	0.053000
15960.000000	0.053000
16020.000000	0.053000
16080.000000	0.053000
16140.000000	0.053000
16200.000000	0.053000
16260.000000	0.053000
16320.000000	0.053000
16380.000000	0.053000
16440.000000	0.053000
16500.000000	0.053000
16560.000000	0.053000
16620.000000	0.113000
16680.000000	0.213000
16740.000000	0.233000
16800.000000	0.213000
16860.000000	0.213000
16920.000000	0.213000
16980.000000	0.273000
17040.000000	0.273000
17100.000000	0.273000
17160.000000	0.273000
17220.000000	0.308000
17280.000000	0.208000
17340.000000	0.268000
17400.000000	0.268000
17460.000000	0.268000
17520.000000	0.268000
17580.000000	0.268000
17640.000000	0.268000
17700.000000	0.268000
17760.000000	0.268000
17820.000000	0.328000
17880.000000	0.328000
17940.000000	0.328000
18000.000000	0.268000
18060.000000	0.268000
18120.000000	0.268000
18180.000000	0.268000
18240.000000	0.268000
18300.000000	0.268000
18360.000000	0.268000
18420.000000	0.268000
18480.000000	0.288000
18540.000000	0.288000
18600.000000	0.288000
18660.000000	0.053000
18720.000000	0.053000
18780.000000	0.053000
18840.000000	0.053000
18900.000000	0.053000
18960.000000	0.053000
19020.000000	0.053000
19080.000000	0.053000
19140.000000	0.053000
19200.000000	0.053000
19260.000000	0.053000
19320.000000	0.053000
19380.000000	0.053000
19440.000000	0.053000
19500.000000	0.053000
19560.000000	0.053000
19620.000000	0.053000
19680.000000	0.053000
19740.000000	0.053000
19800.000000	0.053000
19860.000000	0.053000
19920.000000	0.053000
19980.000000	0.053000
20040.000000	0.053000
20100.000000	0.053000
20160.000000	0.053000
20220.000000	0.053000
20280.000000	0.053000
20340.000000	0.053000
20400.000000	0.259000
20460.000000	0.259000
20520.000000	0.259000
20580.000000	0.259000
20640.000000	0.259000
20700.000000	0.259000
20760.000000	0.259000
20820.000000	0.259000
20880.000000	0.259000
20940.000000	0.259000
21000.000000	0.259000
21060.000000	0.259000
21120.000000	0.259000
21180.000000	0.259000
21240.000000	0.053000
21300.000000	0.053000
21360.000000	0.053000
21420.000000	0.053000
21480.000000	0.053000
21540.000000	0.053000
21600.000000	0.053000
21660.000000	0.053000
21720.000000	0.053000
21780.000000	0.053000
21840.000000	0.053000
21900.000000	0.053000
21960.000000	0.053000
22020.000000	0.053000
22080.000000	0.053000
22140.000000	0.053000
22200.000000	0.053000
22260.000000	0.053000
22320.000000	0.053000
22380.000000	0.053000
22440.000000	0.053000
22500.000000	0.053000
22560.000000	0.053000
22620.000000	0.053000
22680.000000	0.053000
22740.000000	0.053000
22800.000000	0.053000
22860.000000	0.053000
22920.000000	0.053000
22980.000000	0.053000
23040.000000	0.053000
23100.000000	0.053000
23160.000000	0.053000
23220.000000	0.053000
23280.000000	0.053000
23340.000000	0.053000
23400.000000	0.053000
23460.000000	0.053000
23520.000000	0.053000
23580.000000	0.053000
23640.000000	0.053000
23700.000000	0.053000
23760.000000	0.053000
23820.000000	0.053000
23880.000000	0.053000
23940.000000	0.053000
24000.000000	0.053000
24060.000000	0.053000
24120.000000	0.053000
24180.000000	0.053000
24240.000000	0.053000
24300.000000	0.053000
24360.000000	0.053000
24420.000000	0.053000
24480.000000	0.053000
24540.000000	0.053000
24600.000000	0.053000
24660.000000	0.113000
24720.000000	0.113000
24780.000000	0.113000
24840.000000	0.113000
24900.000000	0.113000
24960.000000	0.113000
25020.000000	0.113000
25080.000000	0.053000
25140.000000	0.053000
25200.000000	0.053000
25260.000000	0.053000
25320.000000	0.053000
25380.000000	0.259000
25440.000000	0.259000
25500.000000	0.279000
25560.000000	0.279000
25620.000000	0.279000
25680.000000	0.279000
25740.000000	0.379000
25800.000000	0.314000
25860.000000	0.314000
25920.000000	0.314000
25980.000000	0.294000
26040.000000	0.294000
26100.000000	0.294000
26160.000000	0.259000
26220.000000	0.053000
26280.000000	0.053000
26340.000000	0.053000
26400.000000	0.053000
26460.000000	0.053000
26520.000000	0.053000
26580.000000	0.053000
26640.000000	0.053000
26700.000000	0.053000
26760.000000	0.053000
26820.000000	0.053000
26880.000000	0.053000
26940.000000	0.053000
27000.000000	0.053000
27060.000000	0.053000
27120.000000	0.053000
27180.000000	0.053000
27240.000000	0.053000
27300.000000	0.053000
27360.000000	0.053000
27420.000000	0.053000
27480.000000	0.053000
27540.000000	0.053000
27600.000000	0.053000
27660.000000	0.053000
27720.000000	0.053000
27780.000000	0.053000
27840.000000	0.053000
27900.000000	0.053000
27960.000000	0.053000
28020.000000	0.053000
28080.000000	0.053000
28140.000000	0.053000
28200.000000	0.053000
28260.000000	0.053000
28320.000000	0.093000
28380.000000	0.153000
28440.000000	0.153000
28500.000000	0.153000
28560.000000	0.153000
28620.000000	0.153000
28680.000000	0.273000
28740.000000	0.273000
28800.000000	0.273000
28860.000000	0.053000
28920.000000	0.053000
28980.000000	0.053000
29040.000000	0.053000
29100.000000	0.053000
29160.000000	0.053000
29220.000000	0.053000
29280.000000	0.053000
29340.000000	0.053000
29400.000000	0.053000
29460.000000	0.053000
29520.000000	0.053000
29580.000000	0.259000
29640.000000	0.259000
29700.000000	0.259000
29760.000000	0.259000
29820.000000	0.259000
29880.000000	0.259000
29940.000000	0.259000
30000.000000	0.259000
30060.000000	0.259000
30120.000000	0.259000
30180.000000	0.259000
30240.000000	0.259000
30300.000000	0.259000
30360.000000	0.259000
30420.000000	0.053000
30480.000000	0.053000
30540.000000	0.053000
30600.000000	0.053000
30660.000000	0.053000
30720.000000	0.053000
30780.000000	0.053000
30840.000000	0.053000
30900.000000	0.053000
30960.000000	0.053000
31020.000000	0.053000
31080.000000	0.053000
31140.000000	0.053000
31200.000000	0.053000
31260.000000	0.053000
31320.000000	0.053000
31380.000000	0.053000
31440.000000	0.053000
31500.000000	0.053000
31560.000000	0.053000
31620.000000	0.053000
31680.000000	0.053000
31740.000000	0.053000
31800.000000	0.053000
31860.000000	0.053000
31920.000000	0.053000
31980.000000	0.053000
32040.000000	0.053000
32100.000000	0.053000
32160.000000	0.053000
32220.000000	0.053000
32280.000000	0.053000
32340.000000	0.053000
32400.000000	0.053000
32460.000000	0.053000
32520.000000	0.053000
32580.000000	0.053000
32640.000000	0.053000
32700.000000	0.053000
32760.000000	0.053000
32820.000000	0.053000
32880.000000	0.053000
32940.000000	0.053000
33000.000000	0.053000
33060.000000	0.053000
33120.000000	0.053000
33180.000000	0.053000
33240.000000	0.053000
33300.000000	0.053000
33360.000000	0.053000
33420.000000	0.053000
33480.000000	0.053000
33540.000000	0.053000
33600.000000	0.053000
33660.000000	0.053000
33720.000000	0.053000
33780.000000	0.053000
33840.000000	0.053000
33900.000000	0.053000
33960.000000	0.053000
34020.000000	0.053000
34080.000000	0.053000
34140.000000	0.053000
34200.000000	0.053000
34260.000000	0.053000
34320.000000	0.053000
34380.000000	0.053000
34440.000000	0.053000
34500.000000	0.053000
34560.000000	0.053000
34620.000000	0.053000
34680.000000	0.053000
34740.000000	0.053000
34800.000000	0.053000
34860.000000	0.053000
34920.000000	0.053000
34980.000000	0.053000
35040.000000	0.053000
35100.000000	0.053000
35160.000000	0.053000
35220.000000	0.053000
35280.000000	0.053000
35340.000000	0.053000
35400.000000	0.053000
35460.000000	0.053000
35520.000000	0.053000
35580.000000	0.053000
35640.000000	0.053000
35700.000000	0.053000
35760.000000	0.053000
35820.000000	0.053000
35880.000000	0.053000
35940.000000	0.053000
36000.000000	0.053000
36060.000000	0.053000
36120.000000	0.053000
36180.000000	0.053000
36240.000000	0.053000
36300.000000	0.053000
36360.000000	0.053000
36420.000000	0.053000
36480.000000	0.053000
36540.000000	0.053000
36600.000000	0.053000
36660.000000	0.053000
36720.000000	0.053000
36780.000000	0.053000
36840.000000	0.053000
36900.000000	0.053000
36960.000000	0.053000
37020.000000	0.053000
37080.000000	0.053000
37140.000000	0.053000
37200.000000	0.053000
37260.000000	0.053000
37320.000000	0.053000
37380.000000	0.053000
37440.000000	0.053000
37500.000000	0.053000
37560.000000	0.053000
37620.000000	0.053000
37680.000000	0.053000
37740.000000	0.053000
37800.000000	0.053000
37860.000000	0.053000
37920.000000	0.053000
37980.000000	0.259000
38040.000000	0.259000
38100.000000	0.259000
38160.000000	0.259000
38220.000000	0.259000
38280.000000	0.259000
38340.000000	0.259000
38400.000000	0.259000
38460.000000	0.259000
38520.000000	0.259000
38580.000000	0.259000
38640.000000	0.259000
38700.000000	0.259000
38760.000000	0.259000
38820.000000	0.053000
38880.000000	0.053000
38940.000000	0.053000
39000.000000	0.053000
39060.000000	0.053000
39120.000000	0.053000
39180.000000	0.053000
39240.000000	0.053000
39300.000000	0.053000
39360.000000	0.053000
39420.000000	0.053000
39480.000000	0.053000
39540.000000	0.053000
39600.000000	0.053000
39660.000000	0.053000
39720.000000	0.053000
39780.000000	0.053000
39840.000000	0.053000
39900.000000	0.053000
39960.000000	0.053000
40020.000000	0.053000
40080.000000	0.053000
40140.000000	0.053000
40200.000000	0.053000
40260.000000	0.053000
40320.000000	0.053000
40380.000000	0.053000
40440.000000	0.053000
40500.000000	0.053000
40560.000000	0.053000
40620.000000	0.053000
40680.000000	0.053000
40740.000000	0.053000
40800.000000	0.053000
40860.000000	0.053000
40920.000000	0.053000
40980.000000	0.053000
41040.000000	0.053000
41100.000000	0.053000
41160.000000	0.053000
41220.000000	0.053000
41280.000000	0.053000
41340.000000	0.053000
41400.000000	0.053000
41460.000000	0.173000
41520.000000	0.173000
41580.000000	0.173000
41640.000000	0.173000
41700.000000	0.173000
41760.000000	0.173000
41820.000000	0.173000
41880.000000	0.173000
41940.000000	0.233000
42000.000000	0.273000
42060.000000	0.273000
42120.000000	0.273000
42180.000000	0.273000
42240.000000	0.273000
42300.000000	0.313000
42360.000000	0.373000
42420.000000	0.373000
42480.000000	0.333000
42540.000000	0.333000
42600.000000	0.333000
42660.000000	0.333000
42720.000000	0.333000
42780.000000	0.333000
42840.000000	0.333000
42900.000000	0.333000
42960.000000	0.499000
43020.000000	0.499000
43080.000000	0.499000
43140.000000	0.499000
43200.000000	0.499000
43260.000000	0.644000
43320.000000	0.519000
43380.000000	0.499000
43440.000000	2.770000
43500.000000	2.770000
43560.000000	2.770000
43620.000000	0.599000
43680.000000	0.599000
43740.000000	0.599000
43800.000000	0.393000
43860.000000	0.568000
43920.000000	0.508000
43980.000000	0.508000
44040.000000	0.433000
44100.000000	0.433000
44160.000000	0.433000
44220.000000	0.433000
44280.000000	0.373000
44340.000000	0.373000
44400.000000	0.373000
44460.000000	0.373000
44520.000000	0.373000
44580.000000	0.273000
44640.000000	0.273000
44700.000000	0.273000
44760.000000	0.273000
44820.000000	0.287000
44880.000000	0.287000
44940.000000	0.247000
45000.000000	0.247000
45060.000000	0.247000
45120.000000	0.247000
45180.000000	0.247000
45240.000000	0.247000
45300.000000	0.247000
45360.000000	0.247000
45420.000000	0.247000
45480.000000	0.247000
45540.000000	0.247000
45600.000000	0.247000
45660.000000	0.247000
45720.000000	0.247000
45780.000000	0.247000
45840.000000	0.247000
45900.000000	0.247000
45960.000000	0.247000
46020.000000	0.247000
46080.000000	0.247000
46140.000000	0.247000
46200.000000	0.247000
46260.000000	0.247000
46320.000000	0.247000
46380.000000	0.247000
46440.000000	0.247000
46500.000000	0.247000
46560.000000	0.187000
46620.000000	0.187000
46680.000000	0.187000
46740.000000	0.187000
46800.000000	0.187000
46860.000000	0.187000
46920.000000	0.187000
46980.000000	0.187000
47040.000000	0.187000
47100.000000	0.187000
47160.000000	0.187000
47220.000000	0.572000
47280.000000	0.778000
47340.000000	0.778000
47400.000000	0.778000
47460.000000	0.393000
47520.000000	0.393000
47580.000000	0.393000
47640.000000	0.393000
47700.000000	0.393000
47760.000000	0.393000
47820.000000	0.393000
47880.000000	0.401000
47940.000000	0.401000
48000.000000	0.401000
48060.000000	0.520000
48120.000000	0.374000
48180.000000	0.374000
48240.000000	0.374000
48300.000000	0.374000
48360.000000	0.374000
48420.000000	0.360000
48480.000000	0.360000
48540.000000	0.360000
48600.000000	0.360000
48660.000000	0.360000
48720.000000	0.360000
48780.000000	0.360000
48840.000000	0.360000
48900.000000	0.360000
48960.000000	0.360000
49020.000000	0.360000
49080.000000	0.360000
49140.000000	0.360000
49200.000000	0.360000
49260.000000	0.360000
49320.000000	0.360000
49380.000000	0.360000
49440.000000	0.360000
49500.000000	0.360000
49560.000000	0.374000
49620.000000	0.374000
49680.000000	0.374000
49740.000000	0.374000
49800.000000	0.374000
49860.000000	0.053000
49920.000000	0.053000
49980.000000	0.053000
50040.000000	0.053000
50100.000000	0.053000
50160.000000	0.053000
50220.000000	0.053000
50280.000000	0.053000
50340.000000	0.053000
50400.000000	0.053000
50460.000000	0.347000
50520.000000	0.347000
50580.000000	0.347000
50640.000000	0.347000
50700.000000	0.347000
50760.000000	0.347000
50820.000000	0.347000
50880.000000	0.347000
50940.000000	0.347000
51000.000000	0.347000
51060.000000	0.347000
51120.000000	0.347000
51180.000000	0.347000
51240.000000	0.347000
51300.000000	0.347000
51360.000000	0.347000
51420.000000	0.347000
51480.000000	0.347000
51540.000000	0.347000
51600.000000	0.347000
51660.000000	0.347000
51720.000000	0.347000
51780.000000	0.347000
51840.000000	0.434000
51900.000000	0.434000
51960.000000	0.434000
52020.000000	0.434000
52080.000000	0.434000
52140.000000	0.434000
52200.000000	0.434000
52260.000000	0.640000
52320.000000	0.640000
52380.000000	0.640000
52440.000000	0.640000
52500.000000	0.640000
52560.000000	0.640000
52620.000000	0.640000
52680.000000	0.640000
52740.000000	0.640000
52800.000000	0.640000
52860.000000	0.632000
52920.000000	0.632000
52980.000000	2.903000
53040.000000	2.903000
53100.000000	2.697000
53160.000000	0.426000
53220.000000	0.426000
53280.000000	0.426000
53340.000000	0.426000
53400.000000	0.426000
53460.000000	0.426000
53520.000000	0.426000
53580.000000	0.426000
53640.000000	0.426000
53700.000000	0.426000
53760.000000	2.597000
53820.000000	2.597000
53880.000000	2.597000
53940.000000	2.597000
54000.000000	2.597000
54060.000000	2.597000
54120.000000	2.597000
54180.000000	2.597000
54240.000000	2.597000
54300.000000	2.597000
54360.000000	2.597000
54420.000000	2.597000
54480.000000	2.597000
54540.000000	2.597000
54600.000000	2.597000
54660.000000	2.597000
54720.000000	2.597000
54780.000000	2.597000
54840.000000	2.564000
54900.000000	2.564000
54960.000000	2.564000
55020.000000	2.564000
55080.000000	2.445000
55140.000000	2.445000
55200.000000	2.445000
55260.000000	2.445000
55320.000000	2.445000
55380.000000	0.260000
55440.000000	0.260000
55500.000000	0.260000
55560.000000	0.260000
55620.000000	0.260000
55680.000000	0.260000
55740.000000	0.260000
55800.000000	0.260000
55860.000000	0.260000
55920.000000	0.260000
55980.000000	0.260000
56040.000000	0.260000
56100.000000	0.293000
56160.000000	0.293000
56220.000000	0.293000
56280.000000	0.293000
56340.000000	0.293000
56400.000000	0.293000
56460.000000	0.293000
56520.000000	0.333000
56580.000000	0.373000
56640.000000	0.373000
56700.000000	0.373000
56760.000000	0.579000
56820.000000	0.579000
56880.000000	0.579000
56940.000000	0.579000
57000.000000	0.579000
57060.000000	0.579000
57120.000000	0.704000
57180.000000	0.704000
57240.000000	0.704000
57300.000000	0.704000
57360.000000	0.579000
57420.000000	0.579000
57480.000000	0.639000
57540.000000	0.739000
57600.000000	0.473000
57660.000000	0.473000
57720.000000	0.473000
57780.000000	0.433000
57840.000000	0.433000
57900.000000	0.408000
57960.000000	0.408000
58020.000000	0.408000
58080.000000	0.408000
58140.000000	0.408000
58200.000000	0.408000
58260.000000	0.408000
58320.000000	0.547000
58380.000000	0.547000
58440.000000	0.527000
58500.000000	0.408000
58560.000000	0.408000
58620.000000	0.468000
58680.000000	0.528000
58740.000000	0.588000
58800.000000	0.588000
58860.000000	0.588000
58920.000000	0.588000
58980.000000	0.493000
59040.000000	0.493000
59100.000000	0.493000
59160.000000	0.493000
59220.000000	0.493000
59280.000000	0.433000
59340.000000	0.433000
59400.000000	0.433000
59460.000000	0.433000
59520.000000	0.433000
59580.000000	0.433000
59640.000000	0.433000
59700.000000	0.433000
59760.000000	0.433000
59820.000000	0.433000
59880.000000	0.313000
59940.000000	0.313000
60000.000000	0.313000
60060.000000	0.313000
60120.000000	0.313000
60180.000000	0.273000
60240.000000	0.273000
60300.000000	0.273000
60360.000000	0.273000
60420.000000	0.273000
60480.000000	0.300000
60540.000000	0.300000
60600.000000	0.240000
60660.000000	0.240000
60720.000000	0.365000
60780.000000	0.365000
60840.000000	0.365000
60900.000000	0.365000
60960.000000	0.365000
61020.000000	0.365000
61080.000000	0.240000
61140.000000	0.240000
61200.000000	0.485000
61260.000000	0.425000
61320.000000	0.425000
61380.000000	0.445000
61440.000000	0.445000
61500.000000	0.445000
61560.000000	0.445000
61620.000000	0.830000
61680.000000	0.830000
61740.000000	0.810000
61800.000000	0.810000
61860.000000	0.425000
61920.000000	0.425000
61980.000000	0.425000
62040.000000	0.425000
62100.000000	0.425000
62160.000000	0.460000
62220.000000	0.460000
62280.000000	0.666000
62340.000000	0.666000
62400.000000	0.726000
62460.000000	0.686000
62520.000000	0.686000
62580.000000	2.957000
62640.000000	2.957000
62700.000000	2.957000
62760.000000	0.686000
62820.000000	0.686000
62880.000000	0.786000
62940.000000	0.786000
63000.000000	0.786000
63060.000000	0.786000
63120.000000	0.415000
63180.000000	0.415000
63240.000000	0.415000
63300.000000	0.415000
63360.000000	0.415000
63420.000000	0.415000
63480.000000	0.415000
63540.000000	0.455000
63600.000000	0.600000
63660.000000	0.553000
63720.000000	0.388000
63780.000000	0.468000
63840.000000	0.468000
63900.000000	0.468000
63960.000000	0.408000
64020.000000	0.348000
64080.000000	0.348000
64140.000000	0.483000
64200.000000	0.483000
64260.000000	0.543000
64320.000000	0.483000
64380.000000	0.483000
64440.000000	0.483000
64500.000000	0.448000
64560.000000	0.448000
64620.000000	0.448000
64680.000000	0.448000
64740.000000	0.448000
64800.000000	0.448000
64860.000000	0.448000
64920.000000	0.448000
64980.000000	0.508000
65040.000000	0.568000
65100.000000	0.693000
65160.000000	0.701000
65220.000000	0.701000
65280.000000	0.701000
65340.000000	0.701000
65400.000000	0.734000
65460.000000	0.734000
65520.000000	0.734000
65580.000000	0.734000
65640.000000	0.734000
65700.000000	0.754000
65760.000000	0.734000
65820.000000	0.734000
65880.000000	0.853000
65940.000000	0.853000
66000.000000	0.853000
66060.000000	0.853000
66120.000000	0.853000
66180.000000	0.853000
66240.000000	0.853000
66300.000000	0.853000
66360.000000	0.853000
66420.000000	0.853000
66480.000000	0.853000
66540.000000	0.853000
66600.000000	1.059000
66660.000000	1.059000
66720.000000	1.059000
66780.000000	1.059000
66840.000000	1.059000
66900.000000	1.059000
66960.000000	1.059000
67020.000000	1.059000
67080.000000	1.059000
67140.000000	1.059000
67200.000000	1.059000
67260.000000	1.059000
67320.000000	1.059000
67380.000000	1.059000
67440.000000	0.893000
67500.000000	0.833000
67560.000000	0.833000
67620.000000	0.833000
67680.000000	0.833000
67740.000000	0.833000
67800.000000	0.833000
67860.000000	0.833000
67920.000000	0.833000
67980.000000	0.853000
68040.000000	0.813000
68100.000000	0.813000
68160.000000	0.773000
68220.000000	0.773000
68280.000000	0.773000
68340.000000	0.773000
68400.000000	0.773000
68460.000000	3.044000
68520.000000	3.044000
68580.000000	3.044000
68640.000000	0.738000
68700.000000	0.738000
68760.000000	0.778000
68820.000000	0.738000
68880.000000	0.638000
68940.000000	0.638000
69000.000000	0.638000
69060.000000	0.638000
69120.000000	0.513000
69180.000000	0.513000
69240.000000	0.513000
69300.000000	0.513000
69360.000000	0.513000
69420.000000	0.513000
69480.000000	0.513000
69540.000000	0.505000
69600.000000	0.505000
69660.000000	0.505000
69720.000000	0.505000
69780.000000	0.532000
69840.000000	0.532000
69900.000000	0.532000
69960.000000	0.512000
70020.000000	0.512000
70080.000000	0.512000
70140.000000	0.512000
70200.000000	0.512000
70260.000000	0.512000
70320.000000	0.512000
70380.000000	0.512000
70440.000000	0.512000
70500.000000	0.512000
70560.000000	0.587000
70620.000000	0.587000
70680.000000	0.627000
70740.000000	0.627000
70800.000000	0.627000
70860.000000	0.587000
70920.000000	0.587000
70980.000000	0.587000
71040.000000	0.468000
71100.000000	0.468000
71160.000000	0.468000
71220.000000	0.468000
71280.000000	0.468000
71340.000000	0.468000
71400.000000	0.468000
71460.000000	0.053000
71520.000000	0.053000
71580.000000	0.053000
71640.000000	0.053000
71700.000000	0.053000
71760.000000	0.053000
71820.000000	0.053000
71880.000000	0.053000
71940.000000	0.053000
72000.000000	0.053000
72060.000000	0.053000
72120.000000	0.053000
72180.000000	0.053000
72240.000000	0.053000
72300.000000	0.053000
72360.000000	0.259000
72420.000000	0.259000
72480.000000	0.259000
72540.000000	0.259000
72600.000000	0.259000
72660.000000	0.259000
72720.000000	0.259000
72780.000000	0.259000
72840.000000	0.259000
72900.000000	0.259000
72960.000000	0.259000
73020.000000	0.259000
73080.000000	0.259000
73140.000000	0.259000
73200.000000	0.053000
73260.000000	0.053000
73320.000000	0.053000
73380.000000	0.053000
73440.000000	0.053000
73500.000000	0.053000
73560.000000	0.053000
73620.000000	0.053000
73680.000000	0.053000
73740.000000	0.053000
73800.000000	0.053000
73860.000000	0.053000
73920.000000	0.053000
73980.000000	0.053000
74040.000000	0.053000
74100.000000	0.053000
74160.000000	0.053000
74220.000000	0.053000
74280.000000	0.053000
74340.000000	0.053000
74400.000000	0.053000
74460.000000	0.053000
74520.000000	0.053000
74580.000000	0.053000
74640.000000	0.053000
74700.000000	0.053000
74760.000000	0.053000
74820.000000	0.053000
74880.000000	0.053000
74940.000000	0.053000
75000.000000	0.053000
75060.000000	0.053000
75120.000000	0.053000
75180.000000	0.053000
75240.000000	0.053000
75300.000000	0.053000
75360.000000	0.053000
75420.000000	0.053000
75480.000000	0.053000
75540.000000	0.053000
75600.000000	0.053000
75660.000000	0.053000
75720.000000	0.053000
75780.000000	0.053000
75840.000000	0.053000
75900.000000	0.053000
75960.000000	0.053000
76020.000000	0.053000
76080.000000	0.053000
76140.000000	0.053000
76200.000000	0.053000
76260.000000	0.053000
76320.000000	0.053000
76380.000000	0.053000
76440.000000	0.053000
76500.000000	0.053000
76560.000000	0.053000
76620.000000	0.053000
76680.000000	0.053000
76740.000000	0.053000
76800.000000	0.053000
76860.000000	0.053000
76920.000000	0.053000
76980.000000	0.053000
77040.000000	0.053000
77100.000000	0.053000
77160.000000	0.053000
77220.000000	0.053000
77280.000000	0.053000
77340.000000	0.053000
77400.000000	0.053000
77460.000000	0.053000
77520.000000	0.053000
77580.000000	0.053000
77640.000000	0.053000
77700.000000	0.053000
77760.000000	0.053000
77820.000000	0.053000
77880.000000	0.053000
77940.000000	0.053000
78000.000000	0.053000
78060.000000	0.053000
78120.000000	0.053000
78180.000000	0.053000
78240.000000	0.053000
78300.000000	0.053000
78360.000000	0.053000
78420.000000	0.053000
78480.000000	0.053000
78540.000000	0.053000
78600.000000	0.053000
78660.000000	0.053000
78720.000000	0.053000
78780.000000	0.053000
78840.000000	0.053000
78900.000000	0.053000
78960.000000	0.053000
79020.000000	0.053000
79080.000000	0.259000
79140.000000	0.259000
79200.000000	0.259000
79260.000000	0.259000
79320.000000	0.259000
79380.000000	0.259000
79440.000000	0.259000
79500.000000	0.259000
79560.000000	0.259000
79620.000000	0.259000
79680.000000	0.259000
79740.000000	0.259000
79800.000000	0.259000
79860.000000	0.259000
79920.000000	0.053000
79980.000000	0.053000
80040.000000	0.053000
80100.000000	0.053000
80160.000000	0.053000
80220.000000	0.053000
80280.000000	0.053000
80340.000000	0.053000
80400.000000	0.053000
80460.000000	0.053000
80520.000000	0.053000
80580.000000	0.053000
80640.000000	0.053000
80700.000000	0.053000
80760.000000	0.053000
80820.000000	0.053000
80880.000000	0.053000
80940.000000	0.053000
81000.000000	0.053000
81060.000000	0.053000
81120.000000	0.053000
81180.000000	0.053000
81240.000000	0.053000
81300.000000	0.053000
81360.000000	0.053000
81420.000000	0.053000
81480.000000	0.053000
81540.000000	0.053000
81600.000000	0.053000
81660.000000	0.053000
81720.000000	0.053000
81780.000000	0.053000
81840.000000	0.053000
81900.000000	0.053000
81960.000000	0.053000
82020.000000	0.053000
82080.000000	0.053000
82140.000000	0.053000
82200.000000	0.053000
82260.000000	0.053000
82320.000000	0.053000
82380.000000	0.053000
82440.000000	0.053000
82500.000000	0.053000
82560.000000	0.053000
82620.000000	0.053000
82680.000000	0.053000
82740.000000	0.053000
82800.000000	0.053000
82860.000000	0.053000
82920.000000	0.053000
82980.000000	0.053000
83040.000000	0.053000
83100.000000	0.053000
83160.000000	0.053000
83220.000000	0.053000
83280.000000	0.053000
83340.000000	0.053000
83400.000000	0.053000
83460.000000	0.053000
83520.000000	0.053000
83580.000000	0.053000
83640.000000	0.053000
83700.000000	0.053000
83760.000000	0.053000
83820.000000	0.053000
83880.000000	0.053000
83940.000000	0.053000
84000.000000	0.053000
84060.000000	0.053000
84120.000000	0.259000
84180.000000	0.259000
84240.000000	0.259000
84300.000000	0.259000
84360.000000	0.259000
84420.000000	0.259000
84480.000000	0.259000
84540.000000	0.259000
84600.000000	0.259000
84660.000000	0.259000
84720.000000	0.259000
84780.000000	0.259000
84840.000000	0.259000
84900.000000	0.259000
84960.000000	0.053000
85020.000000	0.053000
85080.000000	0.053000
85140.000000	0.053000
85200.000000	0.053000
85260.000000	0.053000
85320.000000	0.053000
85380.000000	0.053000
85440.000000	0.053000
85500.000000	0.053000
85560.000000	0.053000
85620.000000	0.053000
85680.000000	0.053000
85740.000000	0.053000
85800.000000	0.053000
85860.000000	0.053000
85920.000000	0.053000
85980.000000	0.053000
86040.000000	0.053000
86100.000000	0.053000
86160.000000	0.053000
86220.000000	0.053000
86280.000000	0.053000
86340.000000	0.053000
86400.000000	0.053000
