#1
double LoadProfile(1440,2)
60.000000	0.048000
120.000000	0.048000
180.000000	0.057000
240.000000	0.048000
300.000000	0.048000
360.000000	0.048000
420.000000	0.048000
480.000000	0.148000
540.000000	0.148000
600.000000	2.331000
660.000000	0.048000
720.000000	0.048000
780.000000	0.048000
840.000000	0.048000
900.000000	0.048000
960.000000	0.048000
1020.000000	0.048000
1080.000000	0.048000
1140.000000	0.048000
1200.000000	0.048000
1260.000000	0.048000
1320.000000	0.048000
1380.000000	0.048000
1440.000000	0.048000
1500.000000	0.048000
1560.000000	0.048000
1620.000000	0.048000
1680.000000	0.048000
1740.000000	0.048000
1800.000000	0.048000
1860.000000	0.048000
1920.000000	0.048000
1980.000000	0.048000
2040.000000	0.048000
2100.000000	0.048000
2160.000000	0.048000
2220.000000	0.048000
2280.000000	0.048000
2340.000000	0.048000
2400.000000	0.219000
2460.000000	0.219000
2520.000000	0.219000
2580.000000	0.219000
2640.000000	0.219000
2700.000000	0.219000
2760.000000	0.219000
2820.000000	0.219000
2880.000000	0.219000
2940.000000	0.219000
3000.000000	0.219000
3060.000000	0.219000
3120.000000	0.219000
3180.000000	0.219000
3240.000000	0.219000
3300.000000	0.219000
3360.000000	0.219000
3420.000000	0.219000
3480.000000	0.219000
3540.000000	0.219000
3600.000000	0.219000
3660.000000	0.219000
3720.000000	0.048000
3780.000000	0.048000
3840.000000	0.048000
3900.000000	0.048000
3960.000000	0.048000
4020.000000	0.048000
4080.000000	0.048000
4140.000000	0.048000
4200.000000	0.048000
4260.000000	0.048000
4320.000000	0.048000
4380.000000	0.048000
4440.000000	0.048000
4500.000000	0.048000
4560.000000	0.048000
4620.000000	0.048000
4680.000000	0.048000
4740.000000	0.048000
4800.000000	0.048000
4860.000000	0.048000
4920.000000	0.048000
4980.000000	0.048000
5040.000000	0.048000
5100.000000	0.048000
5160.000000	0.048000
5220.000000	0.048000
5280.000000	0.048000
5340.000000	0.048000
5400.000000	0.048000
5460.000000	0.048000
5520.000000	0.048000
5580.000000	0.048000
5640.000000	0.048000
5700.000000	0.048000
5760.000000	0.048000
5820.000000	0.048000
5880.000000	0.048000
5940.000000	0.048000
6000.000000	0.048000
6060.000000	0.048000
6120.000000	0.048000
6180.000000	0.048000
6240.000000	0.048000
6300.000000	0.048000
6360.000000	0.048000
6420.000000	0.048000
6480.000000	0.048000
6540.000000	0.048000
6600.000000	0.048000
6660.000000	0.048000
6720.000000	0.048000
6780.000000	0.048000
6840.000000	0.048000
6900.000000	0.048000
6960.000000	0.048000
7020.000000	0.048000
7080.000000	0.048000
7140.000000	0.048000
7200.000000	0.048000
7260.000000	0.048000
7320.000000	0.048000
7380.000000	0.048000
7440.000000	0.219000
7500.000000	0.219000
7560.000000	0.219000
7620.000000	0.219000
7680.000000	0.219000
7740.000000	0.219000
7800.000000	0.219000
7860.000000	0.219000
7920.000000	0.219000
7980.000000	0.219000
8040.000000	0.219000
8100.000000	0.219000
8160.000000	0.219000
8220.000000	0.219000
8280.000000	0.219000
8340.000000	0.219000
8400.000000	0.219000
8460.000000	0.219000
8520.000000	0.219000
8580.000000	0.219000
8640.000000	0.219000
8700.000000	0.219000
8760.000000	0.048000
8820.000000	0.048000
8880.000000	0.048000
8940.000000	0.048000
9000.000000	0.048000
9060.000000	0.048000
9120.000000	0.048000
9180.000000	0.048000
9240.000000	0.048000
9300.000000	0.048000
9360.000000	0.048000
9420.000000	0.048000
9480.000000	0.048000
9540.000000	0.048000
9600.000000	0.048000
9660.000000	0.048000
9720.000000	0.048000
9780.000000	0.048000
9840.000000	0.048000
9900.000000	0.048000
9960.000000	0.048000
10020.000000	0.048000
10080.000000	0.048000
10140.000000	0.048000
10200.000000	0.048000
10260.000000	0.048000
10320.000000	0.048000
10380.000000	0.048000
10440.000000	0.048000
10500.000000	0.048000
10560.000000	0.048000
10620.000000	0.048000
10680.000000	0.048000
10740.000000	0.048000
10800.000000	0.048000
10860.000000	0.048000
10920.000000	0.048000
10980.000000	0.048000
11040.000000	0.048000
11100.000000	0.048000
11160.000000	0.048000
11220.000000	0.048000
11280.000000	0.048000
11340.000000	0.048000
11400.000000	0.048000
11460.000000	0.048000
11520.000000	0.048000
11580.000000	0.048000
11640.000000	0.219000
11700.000000	0.219000
11760.000000	0.219000
11820.000000	0.219000
11880.000000	0.219000
11940.000000	0.219000
12000.000000	0.219000
12060.000000	0.219000
12120.000000	0.219000
12180.000000	0.219000
12240.000000	0.219000
12300.000000	0.219000
12360.000000	0.219000
12420.000000	0.219000
12480.000000	0.219000
12540.000000	0.219000
12600.000000	0.219000
12660.000000	0.219000
12720.000000	0.219000
12780.000000	0.219000
12840.000000	0.219000
12900.000000	0.219000
12960.000000	0.048000
13020.000000	0.048000
13080.000000	0.048000
13140.000000	0.048000
13200.000000	0.048000
13260.000000	0.048000
13320.000000	0.048000
13380.000000	0.048000
13440.000000	0.048000
13500.000000	0.048000
13560.000000	0.048000
13620.000000	0.048000
13680.000000	0.048000
13740.000000	0.048000
13800.000000	0.048000
13860.000000	0.048000
13920.000000	0.048000
13980.000000	0.048000
14040.000000	0.048000
14100.000000	0.048000
14160.000000	0.048000
14220.000000	0.048000
14280.000000	0.048000
14340.000000	0.048000
14400.000000	0.048000
14460.000000	0.048000
14520.000000	0.048000
14580.000000	0.048000
14640.000000	0.048000
14700.000000	0.048000
14760.000000	0.048000
14820.000000	0.048000
14880.000000	0.048000
14940.000000	0.048000
15000.000000	0.048000
15060.000000	0.048000
15120.000000	0.048000
15180.000000	0.048000
15240.000000	0.048000
15300.000000	0.048000
15360.000000	0.048000
15420.000000	0.048000
15480.000000	0.048000
15540.000000	0.048000
15600.000000	0.048000
15660.000000	0.219000
15720.000000	0.219000
15780.000000	0.219000
15840.000000	0.219000
15900.000000	0.219000
15960.000000	0.219000
16020.000000	0.219000
16080.000000	0.219000
16140.000000	0.219000
16200.000000	0.219000
16260.000000	0.219000
16320.000000	0.219000
16380.000000	0.219000
16440.000000	0.219000
16500.000000	0.219000
16560.000000	0.219000
16620.000000	0.219000
16680.000000	0.219000
16740.000000	0.219000
16800.000000	0.219000
16860.000000	0.219000
16920.000000	0.219000
16980.000000	0.048000
17040.000000	0.048000
17100.000000	0.048000
17160.000000	0.048000
17220.000000	0.048000
17280.000000	0.048000
17340.000000	0.048000
17400.000000	0.048000
17460.000000	0.048000
17520.000000	0.048000
17580.000000	0.048000
17640.000000	0.048000
17700.000000	0.048000
17760.000000	0.048000
17820.000000	0.048000
17880.000000	0.048000
17940.000000	0.048000
18000.000000	0.048000
18060.000000	0.048000
18120.000000	0.048000
18180.000000	0.048000
18240.000000	0.048000
18300.000000	0.048000
18360.000000	0.048000
18420.000000	0.048000
18480.000000	0.048000
18540.000000	0.048000
18600.000000	0.048000
18660.000000	0.048000
18720.000000	0.048000
18780.000000	0.048000
18840.000000	0.048000
18900.000000	0.048000
18960.000000	0.048000
19020.000000	0.048000
19080.000000	0.048000
19140.000000	0.048000
19200.000000	0.048000
19260.000000	0.048000
19320.000000	0.048000
19380.000000	0.048000
19440.000000	0.048000
19500.000000	0.048000
19560.000000	0.048000
19620.000000	0.048000
19680.000000	0.048000
19740.000000	0.048000
19800.000000	0.048000
19860.000000	0.048000
19920.000000	0.048000
19980.000000	0.048000
20040.000000	0.048000
20100.000000	0.048000
20160.000000	0.048000
20220.000000	0.048000
20280.000000	0.048000
20340.000000	0.048000
20400.000000	0.048000
20460.000000	0.048000
20520.000000	0.048000
20580.000000	0.048000
20640.000000	0.048000
20700.000000	0.048000
20760.000000	0.048000
20820.000000	0.048000
20880.000000	0.048000
20940.000000	0.219000
21000.000000	0.219000
21060.000000	0.219000
21120.000000	0.219000
21180.000000	0.219000
21240.000000	0.219000
21300.000000	0.219000
21360.000000	0.219000
21420.000000	0.219000
21480.000000	0.219000
21540.000000	0.219000
21600.000000	0.219000
21660.000000	0.219000
21720.000000	0.219000
21780.000000	0.219000
21840.000000	0.219000
21900.000000	0.219000
21960.000000	0.219000
22020.000000	0.219000
22080.000000	0.219000
22140.000000	0.219000
22200.000000	0.219000
22260.000000	0.048000
22320.000000	0.048000
22380.000000	0.048000
22440.000000	0.048000
22500.000000	0.048000
22560.000000	0.048000
22620.000000	0.048000
22680.000000	0.048000
22740.000000	0.048000
22800.000000	0.048000
22860.000000	0.048000
22920.000000	0.048000
22980.000000	0.048000
23040.000000	0.048000
23100.000000	0.048000
23160.000000	0.048000
23220.000000	0.048000
23280.000000	0.048000
23340.000000	0.048000
23400.000000	0.048000
23460.000000	0.048000
23520.000000	0.048000
23580.000000	0.048000
23640.000000	0.048000
23700.000000	0.048000
23760.000000	0.048000
23820.000000	0.048000
23880.000000	0.048000
23940.000000	0.048000
24000.000000	0.048000
24060.000000	0.048000
24120.000000	0.048000
24180.000000	0.048000
24240.000000	0.048000
24300.000000	0.048000
24360.000000	0.048000
24420.000000	0.048000
24480.000000	0.048000
24540.000000	0.048000
24600.000000	0.048000
24660.000000	0.048000
24720.000000	0.048000
24780.000000	0.048000
24840.000000	0.048000
24900.000000	0.048000
24960.000000	0.219000
25020.000000	0.219000
25080.000000	0.219000
25140.000000	0.219000
25200.000000	0.219000
25260.000000	0.219000
25320.000000	0.219000
25380.000000	0.219000
25440.000000	0.219000
25500.000000	0.219000
25560.000000	0.219000
25620.000000	0.219000
25680.000000	0.219000
25740.000000	0.219000
25800.000000	0.219000
25860.000000	0.219000
25920.000000	0.219000
25980.000000	0.219000
26040.000000	0.219000
26100.000000	0.219000
26160.000000	0.219000
26220.000000	0.219000
26280.000000	0.048000
26340.000000	0.048000
26400.000000	0.048000
26460.000000	0.048000
26520.000000	0.048000
26580.000000	0.048000
26640.000000	0.048000
26700.000000	0.048000
26760.000000	0.048000
26820.000000	0.048000
26880.000000	0.048000
26940.000000	0.048000
27000.000000	0.048000
27060.000000	0.048000
27120.000000	0.048000
27180.000000	0.048000
27240.000000	0.048000
27300.000000	0.048000
27360.000000	0.048000
27420.000000	0.048000
27480.000000	0.048000
27540.000000	0.048000
27600.000000	0.048000
27660.000000	0.048000
27720.000000	0.048000
27780.000000	0.048000
27840.000000	0.048000
27900.000000	0.048000
27960.000000	0.048000
28020.000000	0.048000
28080.000000	0.048000
28140.000000	0.048000
28200.000000	0.048000
28260.000000	0.048000
28320.000000	0.048000
28380.000000	0.048000
28440.000000	0.048000
28500.000000	0.048000
28560.000000	0.048000
28620.000000	0.048000
28680.000000	0.048000
28740.000000	0.048000
28800.000000	0.048000
28860.000000	2.271000
28920.000000	2.271000
28980.000000	0.108000
29040.000000	0.048000
29100.000000	0.048000
29160.000000	0.108000
29220.000000	0.117000
29280.000000	0.092000
29340.000000	0.092000
29400.000000	0.092000
29460.000000	0.132000
29520.000000	0.132000
29580.000000	0.132000
29640.000000	0.224000
29700.000000	0.224000
29760.000000	0.264000
29820.000000	0.264000
29880.000000	0.229000
29940.000000	0.229000
30000.000000	0.229000
30060.000000	0.229000
30120.000000	0.149000
30180.000000	0.209000
30240.000000	0.309000
30300.000000	0.309000
30360.000000	0.249000
30420.000000	0.289000
30480.000000	0.329000
30540.000000	0.329000
30600.000000	0.508000
30660.000000	0.508000
30720.000000	0.568000
30780.000000	0.568000
30840.000000	0.508000
30900.000000	0.508000
30960.000000	0.508000
31020.000000	0.408000
31080.000000	0.408000
31140.000000	0.408000
31200.000000	0.408000
31260.000000	0.408000
31320.000000	0.408000
31380.000000	0.408000
31440.000000	0.408000
31500.000000	0.408000
31560.000000	0.368000
31620.000000	0.368000
31680.000000	0.368000
31740.000000	0.368000
31800.000000	0.368000
31860.000000	0.368000
31920.000000	0.197000
31980.000000	0.197000
32040.000000	0.197000
32100.000000	0.210000
32160.000000	0.210000
32220.000000	0.210000
32280.000000	0.170000
32340.000000	0.170000
32400.000000	0.170000
32460.000000	0.170000
32520.000000	0.170000
32580.000000	0.170000
32640.000000	0.170000
32700.000000	0.170000
32760.000000	0.161000
32820.000000	0.161000
32880.000000	0.161000
32940.000000	0.161000
33000.000000	0.161000
33060.000000	0.161000
33120.000000	0.161000
33180.000000	0.245000
33240.000000	0.245000
33300.000000	0.245000
33360.000000	0.245000
33420.000000	0.245000
33480.000000	0.245000
33540.000000	0.245000
33600.000000	0.245000
33660.000000	0.245000
33720.000000	0.245000
33780.000000	0.257000
33840.000000	0.245000
33900.000000	0.245000
33960.000000	0.245000
34020.000000	0.161000
34080.000000	0.161000
34140.000000	0.161000
34200.000000	0.161000
34260.000000	0.161000
34320.000000	0.161000
34380.000000	0.161000
34440.000000	0.161000
34500.000000	0.161000
34560.000000	0.161000
34620.000000	0.161000
34680.000000	0.161000
34740.000000	0.161000
34800.000000	0.161000
34860.000000	0.048000
34920.000000	0.048000
34980.000000	0.048000
35040.000000	0.219000
35100.000000	0.219000
35160.000000	0.219000
35220.000000	0.219000
35280.000000	0.219000
35340.000000	0.219000
35400.000000	0.219000
35460.000000	0.219000
35520.000000	0.219000
35580.000000	0.219000
35640.000000	0.219000
35700.000000	0.219000
35760.000000	0.219000
35820.000000	0.219000
35880.000000	0.219000
35940.000000	0.219000
36000.000000	0.219000
36060.000000	0.219000
36120.000000	0.219000
36180.000000	0.219000
36240.000000	0.219000
36300.000000	0.219000
36360.000000	0.048000
36420.000000	0.048000
36480.000000	0.048000
36540.000000	0.048000
36600.000000	0.048000
36660.000000	0.048000
36720.000000	0.048000
36780.000000	0.048000
36840.000000	0.048000
36900.000000	0.048000
36960.000000	0.048000
37020.000000	0.048000
37080.000000	0.048000
37140.000000	0.048000
37200.000000	0.048000
37260.000000	0.048000
37320.000000	0.048000
37380.000000	0.048000
37440.000000	0.048000
37500.000000	0.048000
37560.000000	0.048000
37620.000000	0.048000
37680.000000	0.048000
37740.000000	0.048000
37800.000000	0.048000
37860.000000	0.048000
37920.000000	0.048000
37980.000000	0.048000
38040.000000	0.048000
38100.000000	0.048000
38160.000000	0.048000
38220.000000	0.048000
38280.000000	0.048000
38340.000000	0.048000
38400.000000	0.048000
38460.000000	0.048000
38520.000000	0.048000
38580.000000	0.048000
38640.000000	0.048000
38700.000000	0.048000
38760.000000	0.048000
38820.000000	0.048000
38880.000000	0.048000
38940.000000	0.048000
39000.000000	0.048000
39060.000000	0.048000
39120.000000	0.048000
39180.000000	0.048000
39240.000000	0.048000
39300.000000	0.048000
39360.000000	0.048000
39420.000000	0.048000
39480.000000	0.048000
39540.000000	0.048000
39600.000000	0.048000
39660.000000	0.048000
39720.000000	0.048000
39780.000000	0.048000
39840.000000	0.048000
39900.000000	0.048000
39960.000000	0.048000
40020.000000	0.048000
40080.000000	0.048000
40140.000000	0.219000
40200.000000	0.219000
40260.000000	0.219000
40320.000000	0.219000
40380.000000	0.219000
40440.000000	0.219000
40500.000000	0.219000
40560.000000	0.219000
40620.000000	0.219000
40680.000000	0.219000
40740.000000	0.219000
40800.000000	0.219000
40860.000000	0.219000
40920.000000	0.219000
40980.000000	0.219000
41040.000000	0.219000
41100.000000	0.219000
41160.000000	0.219000
41220.000000	0.219000
41280.000000	0.219000
41340.000000	0.219000
41400.000000	0.219000
41460.000000	0.048000
41520.000000	0.048000
41580.000000	0.048000
41640.000000	0.048000
41700.000000	0.048000
41760.000000	0.048000
41820.000000	0.048000
41880.000000	0.048000
41940.000000	0.048000
42000.000000	0.048000
42060.000000	0.048000
42120.000000	0.048000
42180.000000	0.048000
42240.000000	0.048000
42300.000000	0.048000
42360.000000	0.048000
42420.000000	0.048000
42480.000000	0.048000
42540.000000	0.048000
42600.000000	0.048000
42660.000000	0.048000
42720.000000	0.048000
42780.000000	0.048000
42840.000000	0.048000
42900.000000	0.048000
42960.000000	0.048000
43020.000000	0.048000
43080.000000	0.048000
43140.000000	0.048000
43200.000000	0.048000
43260.000000	0.048000
43320.000000	0.048000
43380.000000	0.048000
43440.000000	0.048000
43500.000000	0.048000
43560.000000	0.048000
43620.000000	0.048000
43680.000000	0.048000
43740.000000	0.048000
43800.000000	0.048000
43860.000000	0.048000
43920.000000	0.048000
43980.000000	0.048000
44040.000000	0.048000
44100.000000	0.048000
44160.000000	0.048000
44220.000000	0.048000
44280.000000	0.048000
44340.000000	0.048000
44400.000000	0.048000
44460.000000	0.048000
44520.000000	0.048000
44580.000000	0.048000
44640.000000	0.048000
44700.000000	0.048000
44760.000000	0.048000
44820.000000	0.048000
44880.000000	0.048000
44940.000000	0.048000
45000.000000	0.048000
45060.000000	0.048000
45120.000000	0.048000
45180.000000	0.048000
45240.000000	0.048000
45300.000000	0.048000
45360.000000	0.048000
45420.000000	0.048000
45480.000000	0.048000
45540.000000	0.048000
45600.000000	0.048000
45660.000000	0.048000
45720.000000	0.048000
45780.000000	0.048000
45840.000000	0.048000
45900.000000	0.048000
45960.000000	0.048000
46020.000000	0.048000
46080.000000	0.048000
46140.000000	0.048000
46200.000000	0.048000
46260.000000	0.048000
46320.000000	0.048000
46380.000000	0.048000
46440.000000	0.048000
46500.000000	0.219000
46560.000000	0.219000
46620.000000	0.219000
46680.000000	0.219000
46740.000000	0.219000
46800.000000	0.219000
46860.000000	0.219000
46920.000000	0.219000
46980.000000	0.219000
47040.000000	0.219000
47100.000000	0.219000
47160.000000	0.219000
47220.000000	0.219000
47280.000000	0.219000
47340.000000	0.219000
47400.000000	0.219000
47460.000000	0.219000
47520.000000	0.219000
47580.000000	0.219000
47640.000000	0.219000
47700.000000	0.219000
47760.000000	0.219000
47820.000000	0.048000
47880.000000	0.048000
47940.000000	0.048000
48000.000000	0.048000
48060.000000	0.048000
48120.000000	0.048000
48180.000000	0.048000
48240.000000	0.048000
48300.000000	0.048000
48360.000000	0.048000
48420.000000	0.048000
48480.000000	0.048000
48540.000000	0.048000
48600.000000	0.048000
48660.000000	0.048000
48720.000000	0.048000
48780.000000	0.048000
48840.000000	0.048000
48900.000000	0.048000
48960.000000	0.048000
49020.000000	0.048000
49080.000000	0.048000
49140.000000	0.048000
49200.000000	0.048000
49260.000000	0.061000
49320.000000	0.061000
49380.000000	0.061000
49440.000000	0.061000
49500.000000	0.061000
49560.000000	0.061000
49620.000000	0.061000
49680.000000	0.061000
49740.000000	0.061000
49800.000000	0.061000
49860.000000	0.061000
49920.000000	0.061000
49980.000000	0.061000
50040.000000	0.061000
50100.000000	0.048000
50160.000000	0.048000
50220.000000	0.048000
50280.000000	0.048000
50340.000000	0.048000
50400.000000	0.048000
50460.000000	0.048000
50520.000000	0.048000
50580.000000	0.048000
50640.000000	0.048000
50700.000000	0.048000
50760.000000	0.048000
50820.000000	0.048000
50880.000000	0.048000
50940.000000	0.048000
51000.000000	0.048000
51060.000000	0.219000
51120.000000	0.219000
51180.000000	0.219000
51240.000000	0.219000
51300.000000	0.219000
51360.000000	0.219000
51420.000000	0.219000
51480.000000	0.219000
51540.000000	0.279000
51600.000000	0.279000
51660.000000	0.279000
51720.000000	0.279000
51780.000000	0.279000
51840.000000	0.279000
51900.000000	3.010000
51960.000000	3.010000
52020.000000	3.010000
52080.000000	3.010000
52140.000000	3.010000
52200.000000	3.010000
52260.000000	3.010000
52320.000000	3.010000
52380.000000	2.839000
52440.000000	2.839000
52500.000000	3.153000
52560.000000	3.153000
52620.000000	3.153000
52680.000000	3.153000
52740.000000	2.839000
52800.000000	2.839000
52860.000000	2.839000
52920.000000	2.839000
52980.000000	2.779000
53040.000000	2.779000
53100.000000	2.779000
53160.000000	2.779000
53220.000000	2.779000
53280.000000	2.779000
53340.000000	2.779000
53400.000000	2.779000
53460.000000	2.779000
53520.000000	2.779000
53580.000000	2.779000
53640.000000	2.779000
53700.000000	2.779000
53760.000000	2.779000
53820.000000	2.779000
53880.000000	2.779000
53940.000000	2.779000
54000.000000	2.779000
54060.000000	2.779000
54120.000000	2.779000
54180.000000	2.779000
54240.000000	2.779000
54300.000000	2.779000
54360.000000	2.779000
54420.000000	2.779000
54480.000000	2.779000
54540.000000	2.779000
54600.000000	2.779000
54660.000000	2.779000
54720.000000	2.779000
54780.000000	2.779000
54840.000000	2.779000
54900.000000	2.779000
54960.000000	2.779000
55020.000000	2.779000
55080.000000	2.950000
55140.000000	2.950000
55200.000000	2.950000
55260.000000	2.950000
55320.000000	2.950000
55380.000000	2.950000
55440.000000	2.950000
55500.000000	0.219000
55560.000000	0.219000
55620.000000	0.219000
55680.000000	0.219000
55740.000000	0.219000
55800.000000	0.219000
55860.000000	0.219000
55920.000000	0.219000
55980.000000	0.219000
56040.000000	0.219000
56100.000000	0.219000
56160.000000	0.219000
56220.000000	0.219000
56280.000000	0.219000
56340.000000	0.219000
56400.000000	0.048000
56460.000000	0.048000
56520.000000	0.048000
56580.000000	0.048000
56640.000000	0.048000
56700.000000	0.048000
56760.000000	0.048000
56820.000000	0.048000
56880.000000	0.048000
56940.000000	0.048000
57000.000000	0.048000
57060.000000	0.048000
57120.000000	0.048000
57180.000000	0.048000
57240.000000	0.048000
57300.000000	0.048000
57360.000000	0.048000
57420.000000	0.048000
57480.000000	0.048000
57540.000000	0.048000
57600.000000	0.048000
57660.000000	0.048000
57720.000000	0.048000
57780.000000	0.048000
57840.000000	0.048000
57900.000000	0.048000
57960.000000	0.048000
58020.000000	0.048000
58080.000000	0.048000
58140.000000	0.048000
58200.000000	0.048000
58260.000000	0.048000
58320.000000	0.048000
58380.000000	0.048000
58440.000000	0.048000
58500.000000	0.048000
58560.000000	0.048000
58620.000000	0.048000
58680.000000	0.048000
58740.000000	0.048000
58800.000000	0.048000
58860.000000	0.048000
58920.000000	0.048000
58980.000000	0.048000
59040.000000	0.048000
59100.000000	0.048000
59160.000000	0.048000
59220.000000	0.048000
59280.000000	0.219000
59340.000000	0.219000
59400.000000	0.219000
59460.000000	0.219000
59520.000000	0.219000
59580.000000	0.219000
59640.000000	0.219000
59700.000000	0.219000
59760.000000	0.219000
59820.000000	0.219000
59880.000000	0.219000
59940.000000	0.219000
60000.000000	0.219000
60060.000000	0.219000
60120.000000	0.219000
60180.000000	0.219000
60240.000000	0.219000
60300.000000	0.219000
60360.000000	0.219000
60420.000000	0.219000
60480.000000	0.219000
60540.000000	0.219000
60600.000000	0.048000
60660.000000	0.048000
60720.000000	0.048000
60780.000000	0.048000
60840.000000	0.048000
60900.000000	0.048000
60960.000000	0.048000
61020.000000	0.048000
61080.000000	0.048000
61140.000000	0.048000
61200.000000	0.048000
61260.000000	0.048000
61320.000000	0.048000
61380.000000	0.048000
61440.000000	0.048000
61500.000000	0.048000
61560.000000	0.048000
61620.000000	0.048000
61680.000000	0.048000
61740.000000	0.048000
61800.000000	0.048000
61860.000000	0.048000
61920.000000	0.048000
61980.000000	0.048000
62040.000000	0.048000
62100.000000	0.048000
62160.000000	0.048000
62220.000000	0.048000
62280.000000	0.048000
62340.000000	0.048000
62400.000000	0.048000
62460.000000	0.048000
62520.000000	0.048000
62580.000000	0.048000
62640.000000	0.048000
62700.000000	0.048000
62760.000000	0.048000
62820.000000	0.048000
62880.000000	0.048000
62940.000000	0.048000
63000.000000	0.048000
63060.000000	0.048000
63120.000000	0.048000
63180.000000	0.048000
63240.000000	0.048000
63300.000000	0.048000
63360.000000	0.048000
63420.000000	0.048000
63480.000000	0.048000
63540.000000	0.048000
63600.000000	0.048000
63660.000000	0.048000
63720.000000	0.048000
63780.000000	0.048000
63840.000000	0.048000
63900.000000	0.048000
63960.000000	0.048000
64020.000000	0.048000
64080.000000	0.048000
64140.000000	0.048000
64200.000000	0.219000
64260.000000	0.219000
64320.000000	0.219000
64380.000000	0.219000
64440.000000	0.219000
64500.000000	0.219000
64560.000000	0.219000
64620.000000	0.219000
64680.000000	0.219000
64740.000000	0.219000
64800.000000	0.219000
64860.000000	0.219000
64920.000000	0.219000
64980.000000	0.219000
65040.000000	0.219000
65100.000000	0.219000
65160.000000	0.219000
65220.000000	0.219000
65280.000000	0.219000
65340.000000	0.219000
65400.000000	0.219000
65460.000000	0.219000
65520.000000	0.048000
65580.000000	0.048000
65640.000000	0.048000
65700.000000	0.048000
65760.000000	0.048000
65820.000000	0.048000
65880.000000	0.048000
65940.000000	0.048000
66000.000000	0.048000
66060.000000	0.048000
66120.000000	0.048000
66180.000000	0.048000
66240.000000	0.048000
66300.000000	0.048000
66360.000000	0.048000
66420.000000	0.048000
66480.000000	0.048000
66540.000000	0.048000
66600.000000	0.048000
66660.000000	0.048000
66720.000000	0.548000
66780.000000	0.548000
66840.000000	0.548000
66900.000000	0.548000
66960.000000	0.148000
67020.000000	0.188000
67080.000000	0.188000
67140.000000	0.088000
67200.000000	0.088000
67260.000000	0.148000
67320.000000	0.148000
67380.000000	0.240000
67440.000000	0.240000
67500.000000	0.240000
67560.000000	0.240000
67620.000000	0.240000
67680.000000	0.240000
67740.000000	0.240000
67800.000000	0.240000
67860.000000	0.240000
67920.000000	0.240000
67980.000000	0.252000
68040.000000	0.252000
68100.000000	0.252000
68160.000000	0.252000
68220.000000	0.252000
68280.000000	0.252000
68340.000000	0.192000
68400.000000	0.363000
68460.000000	0.219000
68520.000000	0.219000
68580.000000	0.219000
68640.000000	0.219000
68700.000000	0.219000
68760.000000	0.219000
68820.000000	0.219000
68880.000000	0.219000
68940.000000	0.219000
69000.000000	0.219000
69060.000000	0.311000
69120.000000	0.311000
69180.000000	0.311000
69240.000000	0.311000
69300.000000	0.386000
69360.000000	2.569000
69420.000000	2.569000
69480.000000	2.569000
69540.000000	0.386000
69600.000000	0.386000
69660.000000	0.386000
69720.000000	0.215000
69780.000000	0.215000
69840.000000	0.275000
69900.000000	0.275000
69960.000000	0.284000
70020.000000	0.284000
70080.000000	0.284000
70140.000000	0.784000
70200.000000	2.943000
70260.000000	2.859000
70320.000000	2.859000
70380.000000	2.859000
70440.000000	2.859000
70500.000000	2.859000
70560.000000	2.959000
70620.000000	2.959000
70680.000000	2.899000
70740.000000	2.899000
70800.000000	2.899000
70860.000000	2.899000
70920.000000	2.799000
70980.000000	2.799000
71040.000000	2.799000
71100.000000	2.799000
71160.000000	2.799000
71220.000000	2.799000
71280.000000	2.799000
71340.000000	2.799000
71400.000000	2.799000
71460.000000	3.299000
71520.000000	3.299000
71580.000000	3.299000
71640.000000	3.299000
71700.000000	3.299000
71760.000000	3.299000
71820.000000	1.140000
71880.000000	1.200000
71940.000000	1.200000
72000.000000	1.108000
72060.000000	1.108000
72120.000000	1.108000
72180.000000	1.108000
72240.000000	1.108000
72300.000000	1.108000
72360.000000	1.108000
72420.000000	1.108000
72480.000000	1.108000
72540.000000	1.108000
72600.000000	1.108000
72660.000000	1.108000
72720.000000	1.108000
72780.000000	1.168000
72840.000000	1.339000
72900.000000	1.439000
72960.000000	1.439000
73020.000000	1.499000
73080.000000	1.514000
73140.000000	1.514000
73200.000000	1.379000
73260.000000	1.379000
73320.000000	1.392000
73380.000000	0.892000
73440.000000	0.892000
73500.000000	0.892000
73560.000000	0.892000
73620.000000	0.952000
73680.000000	0.952000
73740.000000	0.952000
73800.000000	0.952000
73860.000000	1.012000
73920.000000	1.012000
73980.000000	0.512000
74040.000000	0.452000
74100.000000	0.452000
74160.000000	0.281000
74220.000000	0.281000
74280.000000	0.281000
74340.000000	0.281000
74400.000000	0.281000
74460.000000	0.221000
74520.000000	0.221000
74580.000000	0.281000
74640.000000	0.281000
74700.000000	0.281000
74760.000000	0.221000
74820.000000	0.221000
74880.000000	0.221000
74940.000000	0.221000
75000.000000	0.221000
75060.000000	0.221000
75120.000000	0.221000
75180.000000	0.221000
75240.000000	0.161000
75300.000000	0.161000
75360.000000	0.161000
75420.000000	0.161000
75480.000000	0.161000
75540.000000	0.161000
75600.000000	0.661000
75660.000000	0.161000
75720.000000	0.161000
75780.000000	0.161000
75840.000000	0.161000
75900.000000	0.161000
75960.000000	0.161000
76020.000000	0.253000
76080.000000	0.253000
76140.000000	0.253000
76200.000000	0.253000
76260.000000	0.253000
76320.000000	0.253000
76380.000000	0.253000
76440.000000	0.313000
76500.000000	0.313000
76560.000000	0.313000
76620.000000	0.409000
76680.000000	0.409000
76740.000000	0.409000
76800.000000	0.409000
76860.000000	0.409000
76920.000000	0.396000
76980.000000	0.396000
77040.000000	0.396000
77100.000000	0.396000
77160.000000	0.316000
77220.000000	0.316000
77280.000000	0.476000
77340.000000	0.476000
77400.000000	0.476000
77460.000000	0.376000
77520.000000	0.385000
77580.000000	0.375000
77640.000000	0.375000
77700.000000	0.375000
77760.000000	0.375000
77820.000000	0.375000
77880.000000	0.375000
77940.000000	0.375000
78000.000000	0.375000
78060.000000	0.375000
78120.000000	0.375000
78180.000000	0.435000
78240.000000	0.435000
78300.000000	0.435000
78360.000000	0.435000
78420.000000	0.435000
78480.000000	0.435000
78540.000000	0.435000
78600.000000	0.435000
78660.000000	0.435000
78720.000000	0.435000
78780.000000	0.435000
78840.000000	0.435000
78900.000000	0.435000
78960.000000	0.435000
79020.000000	0.470000
79080.000000	0.483000
79140.000000	0.483000
79200.000000	0.983000
79260.000000	0.948000
79320.000000	0.948000
79380.000000	0.948000
79440.000000	0.948000
79500.000000	0.948000
79560.000000	0.948000
79620.000000	0.948000
79680.000000	1.048000
79740.000000	1.048000
79800.000000	1.048000
79860.000000	1.148000
79920.000000	1.048000
79980.000000	1.048000
80040.000000	1.048000
80100.000000	1.048000
80160.000000	1.048000
80220.000000	1.048000
80280.000000	1.048000
80340.000000	1.036000
80400.000000	1.128000
80460.000000	1.128000
80520.000000	1.128000
80580.000000	1.568000
80640.000000	1.568000
80700.000000	1.068000
80760.000000	1.068000
80820.000000	1.068000
80880.000000	1.080000
80940.000000	1.080000
81000.000000	1.080000
81060.000000	1.080000
81120.000000	1.080000
81180.000000	1.080000
81240.000000	1.140000
81300.000000	1.311000
81360.000000	0.811000
81420.000000	0.811000
81480.000000	0.751000
81540.000000	0.751000
81600.000000	1.251000
81660.000000	1.251000
81720.000000	1.191000
81780.000000	1.191000
81840.000000	1.131000
81900.000000	1.131000
81960.000000	1.060000
82020.000000	1.072000
82080.000000	1.072000
82140.000000	1.072000
82200.000000	1.072000
82260.000000	1.072000
82320.000000	1.072000
82380.000000	1.072000
82440.000000	1.072000
82500.000000	1.132000
82560.000000	1.132000
82620.000000	0.901000
82680.000000	0.888000
82740.000000	0.888000
82800.000000	0.888000
82860.000000	0.888000
82920.000000	0.888000
82980.000000	0.888000
83040.000000	0.888000
83100.000000	0.848000
83160.000000	0.848000
83220.000000	0.848000
83280.000000	0.848000
83340.000000	0.748000
83400.000000	0.656000
83460.000000	0.731000
83520.000000	0.731000
83580.000000	0.731000
83640.000000	0.731000
83700.000000	0.731000
83760.000000	0.740000
83820.000000	0.740000
83880.000000	0.725000
83940.000000	0.716000
84000.000000	0.716000
84060.000000	0.716000
84120.000000	0.716000
84180.000000	0.716000
84240.000000	0.716000
84300.000000	0.716000
84360.000000	0.716000
84420.000000	0.656000
84480.000000	0.656000
84540.000000	0.656000
84600.000000	0.676000
84660.000000	0.768000
84720.000000	0.768000
84780.000000	0.768000
84840.000000	0.768000
84900.000000	0.768000
84960.000000	0.768000
85020.000000	0.768000
85080.000000	0.768000
85140.000000	0.828000
85200.000000	0.768000
85260.000000	0.048000
85320.000000	0.048000
85380.000000	0.048000
85440.000000	0.048000
85500.000000	0.048000
85560.000000	0.048000
85620.000000	0.048000
85680.000000	0.048000
85740.000000	0.048000
85800.000000	0.048000
85860.000000	0.048000
85920.000000	0.048000
85980.000000	0.048000
86040.000000	0.048000
86100.000000	0.048000
86160.000000	0.048000
86220.000000	0.048000
86280.000000	0.048000
86340.000000	0.048000
86400.000000	0.048000
