#1
double SolarProfile(24,4)
	   0	0	0	17.9000000000000
	3600	0	0	17.8000000000000
	7200	0	0	18.2000000000000
	10800	0	0	17.9000000000000
	14400	0	0	17.9000000000000
	18000	0	7	17.9000000000000
	21600	0	45	17.9000000000000
	25200	0	90	17.7000000000000
	28800	35	216	17.8000000000000
	32400	49	270	19
	36000	121	375	21.1000000000000
	39600	133	399	22.6000000000000
	43200	201	430	24
	46800	187	411	25.7000000000000
	50400	157	370	25.7000000000000
	54000	117	310	25.1000000000000
	57600	96	237	24.9000000000000
	61200	41	143	24.4000000000000
	64800	7	41	24.3000000000000
	68400	0	0	22.2000000000000
	72000	0	0	21.3000000000000
	75600	0	0	20.8000000000000
	79200	0	0	20.4000000000000
	82800	0	0	19.8000000000000
