#1
double LoadProfile(1440,2)
60.000000	0.049000
120.000000	0.049000
180.000000	0.049000
240.000000	0.049000
300.000000	0.049000
360.000000	0.049000
420.000000	0.049000
480.000000	0.049000
540.000000	0.049000
600.000000	0.049000
660.000000	0.049000
720.000000	0.049000
780.000000	0.049000
840.000000	0.049000
900.000000	0.049000
960.000000	0.049000
1020.000000	0.049000
1080.000000	0.049000
1140.000000	0.049000
1200.000000	0.049000
1260.000000	0.049000
1320.000000	0.049000
1380.000000	0.049000
1440.000000	0.049000
1500.000000	0.049000
1560.000000	0.049000
1620.000000	0.049000
1680.000000	0.049000
1740.000000	0.049000
1800.000000	0.049000
1860.000000	0.049000
1920.000000	0.049000
1980.000000	0.049000
2040.000000	0.049000
2100.000000	0.049000
2160.000000	0.049000
2220.000000	0.049000
2280.000000	0.049000
2340.000000	0.049000
2400.000000	0.049000
2460.000000	0.049000
2520.000000	0.049000
2580.000000	0.049000
2640.000000	0.049000
2700.000000	0.049000
2760.000000	0.049000
2820.000000	0.049000
2880.000000	0.049000
2940.000000	0.049000
3000.000000	0.049000
3060.000000	0.049000
3120.000000	0.049000
3180.000000	0.049000
3240.000000	0.049000
3300.000000	0.049000
3360.000000	0.049000
3420.000000	0.049000
3480.000000	0.049000
3540.000000	0.049000
3600.000000	0.049000
3660.000000	0.049000
3720.000000	0.188000
3780.000000	0.188000
3840.000000	0.188000
3900.000000	0.188000
3960.000000	0.188000
4020.000000	0.188000
4080.000000	0.188000
4140.000000	0.188000
4200.000000	0.188000
4260.000000	0.188000
4320.000000	0.188000
4380.000000	0.188000
4440.000000	0.188000
4500.000000	0.188000
4560.000000	0.188000
4620.000000	0.188000
4680.000000	0.188000
4740.000000	0.188000
4800.000000	0.188000
4860.000000	0.188000
4920.000000	0.049000
4980.000000	0.049000
5040.000000	0.049000
5100.000000	0.049000
5160.000000	0.049000
5220.000000	0.049000
5280.000000	0.049000
5340.000000	0.049000
5400.000000	0.049000
5460.000000	0.049000
5520.000000	0.049000
5580.000000	0.049000
5640.000000	0.049000
5700.000000	0.049000
5760.000000	0.049000
5820.000000	0.049000
5880.000000	0.049000
5940.000000	0.049000
6000.000000	0.049000
6060.000000	0.049000
6120.000000	0.049000
6180.000000	0.049000
6240.000000	0.049000
6300.000000	0.049000
6360.000000	0.049000
6420.000000	0.049000
6480.000000	0.049000
6540.000000	0.049000
6600.000000	0.049000
6660.000000	0.049000
6720.000000	0.049000
6780.000000	0.049000
6840.000000	0.049000
6900.000000	0.049000
6960.000000	0.049000
7020.000000	0.049000
7080.000000	0.049000
7140.000000	0.049000
7200.000000	0.049000
7260.000000	0.049000
7320.000000	0.188000
7380.000000	0.188000
7440.000000	0.188000
7500.000000	0.188000
7560.000000	0.188000
7620.000000	0.188000
7680.000000	0.188000
7740.000000	0.188000
7800.000000	0.188000
7860.000000	0.188000
7920.000000	0.188000
7980.000000	0.188000
8040.000000	0.188000
8100.000000	0.188000
8160.000000	0.188000
8220.000000	0.188000
8280.000000	0.188000
8340.000000	0.188000
8400.000000	0.188000
8460.000000	0.188000
8520.000000	0.049000
8580.000000	0.049000
8640.000000	0.049000
8700.000000	0.049000
8760.000000	0.049000
8820.000000	0.049000
8880.000000	0.049000
8940.000000	0.049000
9000.000000	0.049000
9060.000000	0.049000
9120.000000	0.049000
9180.000000	0.049000
9240.000000	0.049000
9300.000000	0.049000
9360.000000	0.049000
9420.000000	0.049000
9480.000000	0.049000
9540.000000	0.049000
9600.000000	0.049000
9660.000000	0.049000
9720.000000	0.049000
9780.000000	0.049000
9840.000000	0.049000
9900.000000	0.049000
9960.000000	0.049000
10020.000000	0.049000
10080.000000	0.049000
10140.000000	0.049000
10200.000000	0.049000
10260.000000	0.049000
10320.000000	0.049000
10380.000000	0.049000
10440.000000	0.049000
10500.000000	0.049000
10560.000000	0.049000
10620.000000	0.049000
10680.000000	0.049000
10740.000000	0.049000
10800.000000	0.049000
10860.000000	0.049000
10920.000000	0.049000
10980.000000	0.049000
11040.000000	0.049000
11100.000000	0.049000
11160.000000	0.049000
11220.000000	0.049000
11280.000000	0.049000
11340.000000	0.049000
11400.000000	0.049000
11460.000000	0.049000
11520.000000	0.049000
11580.000000	0.049000
11640.000000	0.049000
11700.000000	0.049000
11760.000000	0.049000
11820.000000	0.049000
11880.000000	0.049000
11940.000000	0.049000
12000.000000	0.049000
12060.000000	0.049000
12120.000000	0.049000
12180.000000	0.049000
12240.000000	0.049000
12300.000000	0.049000
12360.000000	0.049000
12420.000000	0.049000
12480.000000	0.049000
12540.000000	0.049000
12600.000000	0.049000
12660.000000	0.049000
12720.000000	0.049000
12780.000000	0.049000
12840.000000	0.049000
12900.000000	0.049000
12960.000000	0.049000
13020.000000	0.049000
13080.000000	0.049000
13140.000000	0.049000
13200.000000	0.049000
13260.000000	0.049000
13320.000000	0.049000
13380.000000	0.049000
13440.000000	0.049000
13500.000000	0.049000
13560.000000	0.049000
13620.000000	0.049000
13680.000000	0.049000
13740.000000	0.049000
13800.000000	0.049000
13860.000000	0.049000
13920.000000	0.049000
13980.000000	0.049000
14040.000000	0.188000
14100.000000	0.188000
14160.000000	0.188000
14220.000000	0.188000
14280.000000	0.188000
14340.000000	0.188000
14400.000000	0.188000
14460.000000	0.188000
14520.000000	0.188000
14580.000000	0.188000
14640.000000	0.188000
14700.000000	0.188000
14760.000000	0.188000
14820.000000	0.188000
14880.000000	0.188000
14940.000000	0.188000
15000.000000	0.188000
15060.000000	0.188000
15120.000000	0.188000
15180.000000	0.188000
15240.000000	0.049000
15300.000000	0.049000
15360.000000	0.049000
15420.000000	0.049000
15480.000000	0.049000
15540.000000	0.049000
15600.000000	0.049000
15660.000000	0.049000
15720.000000	0.049000
15780.000000	0.049000
15840.000000	0.049000
15900.000000	0.049000
15960.000000	0.049000
16020.000000	0.049000
16080.000000	0.049000
16140.000000	0.049000
16200.000000	0.049000
16260.000000	0.049000
16320.000000	0.049000
16380.000000	0.049000
16440.000000	0.049000
16500.000000	0.049000
16560.000000	0.049000
16620.000000	0.049000
16680.000000	0.049000
16740.000000	0.049000
16800.000000	0.049000
16860.000000	0.049000
16920.000000	0.049000
16980.000000	0.049000
17040.000000	0.049000
17100.000000	0.049000
17160.000000	0.049000
17220.000000	0.049000
17280.000000	0.049000
17340.000000	0.049000
17400.000000	0.049000
17460.000000	0.049000
17520.000000	0.049000
17580.000000	0.049000
17640.000000	0.049000
17700.000000	0.049000
17760.000000	0.049000
17820.000000	0.049000
17880.000000	0.049000
17940.000000	0.049000
18000.000000	0.049000
18060.000000	0.049000
18120.000000	0.049000
18180.000000	0.049000
18240.000000	0.049000
18300.000000	0.049000
18360.000000	0.049000
18420.000000	0.049000
18480.000000	0.049000
18540.000000	0.049000
18600.000000	0.049000
18660.000000	0.049000
18720.000000	0.049000
18780.000000	0.049000
18840.000000	0.049000
18900.000000	0.049000
18960.000000	0.049000
19020.000000	0.049000
19080.000000	0.188000
19140.000000	0.188000
19200.000000	0.188000
19260.000000	0.188000
19320.000000	0.188000
19380.000000	0.188000
19440.000000	0.188000
19500.000000	0.188000
19560.000000	0.188000
19620.000000	0.188000
19680.000000	0.188000
19740.000000	0.188000
19800.000000	0.188000
19860.000000	0.188000
19920.000000	0.188000
19980.000000	0.188000
20040.000000	0.188000
20100.000000	0.188000
20160.000000	0.188000
20220.000000	0.188000
20280.000000	0.049000
20340.000000	0.049000
20400.000000	0.049000
20460.000000	0.049000
20520.000000	0.049000
20580.000000	0.049000
20640.000000	0.049000
20700.000000	0.049000
20760.000000	0.049000
20820.000000	0.049000
20880.000000	0.049000
20940.000000	0.049000
21000.000000	0.049000
21060.000000	0.049000
21120.000000	0.049000
21180.000000	0.049000
21240.000000	0.049000
21300.000000	0.049000
21360.000000	0.049000
21420.000000	0.049000
21480.000000	0.049000
21540.000000	0.049000
21600.000000	0.049000
21660.000000	0.049000
21720.000000	0.049000
21780.000000	0.049000
21840.000000	0.049000
21900.000000	0.049000
21960.000000	0.049000
22020.000000	0.049000
22080.000000	0.049000
22140.000000	0.049000
22200.000000	0.049000
22260.000000	0.049000
22320.000000	0.049000
22380.000000	0.049000
22440.000000	0.049000
22500.000000	0.049000
22560.000000	0.049000
22620.000000	0.049000
22680.000000	0.049000
22740.000000	0.049000
22800.000000	0.049000
22860.000000	0.049000
22920.000000	0.049000
22980.000000	0.049000
23040.000000	0.049000
23100.000000	0.049000
23160.000000	0.049000
23220.000000	0.049000
23280.000000	0.188000
23340.000000	0.188000
23400.000000	0.188000
23460.000000	0.188000
23520.000000	0.188000
23580.000000	0.188000
23640.000000	0.188000
23700.000000	0.188000
23760.000000	0.188000
23820.000000	0.188000
23880.000000	0.188000
23940.000000	0.188000
24000.000000	0.188000
24060.000000	0.188000
24120.000000	0.188000
24180.000000	0.188000
24240.000000	0.188000
24300.000000	0.188000
24360.000000	0.188000
24420.000000	0.188000
24480.000000	0.049000
24540.000000	0.049000
24600.000000	0.049000
24660.000000	0.049000
24720.000000	0.049000
24780.000000	0.049000
24840.000000	0.049000
24900.000000	0.049000
24960.000000	0.049000
25020.000000	0.049000
25080.000000	0.049000
25140.000000	0.049000
25200.000000	0.049000
25260.000000	0.049000
25320.000000	0.049000
25380.000000	0.069000
25440.000000	0.069000
25500.000000	0.069000
25560.000000	0.069000
25620.000000	0.069000
25680.000000	0.069000
25740.000000	0.069000
25800.000000	0.109000
25860.000000	0.109000
25920.000000	0.069000
25980.000000	0.069000
26040.000000	0.069000
26100.000000	0.069000
26160.000000	0.069000
26220.000000	0.069000
26280.000000	0.069000
26340.000000	0.069000
26400.000000	0.089000
26460.000000	0.189000
26520.000000	0.189000
26580.000000	0.129000
26640.000000	0.149000
26700.000000	0.149000
26760.000000	0.129000
26820.000000	0.189000
26880.000000	0.189000
26940.000000	0.189000
27000.000000	0.189000
27060.000000	0.189000
27120.000000	0.189000
27180.000000	0.189000
27240.000000	0.189000
27300.000000	0.129000
27360.000000	0.129000
27420.000000	0.129000
27480.000000	0.129000
27540.000000	0.129000
27600.000000	0.129000
27660.000000	0.049000
27720.000000	0.049000
27780.000000	0.049000
27840.000000	0.049000
27900.000000	0.049000
27960.000000	0.049000
28020.000000	0.049000
28080.000000	0.049000
28140.000000	0.049000
28200.000000	0.049000
28260.000000	0.049000
28320.000000	0.049000
28380.000000	0.049000
28440.000000	0.049000
28500.000000	0.049000
28560.000000	0.049000
28620.000000	0.049000
28680.000000	0.049000
28740.000000	0.049000
28800.000000	0.049000
28860.000000	0.049000
28920.000000	0.049000
28980.000000	0.049000
29040.000000	0.049000
29100.000000	0.049000
29160.000000	0.049000
29220.000000	0.049000
29280.000000	0.049000
29340.000000	0.049000
29400.000000	0.049000
29460.000000	0.049000
29520.000000	0.049000
29580.000000	0.049000
29640.000000	0.049000
29700.000000	0.049000
29760.000000	0.049000
29820.000000	0.049000
29880.000000	0.049000
29940.000000	0.049000
30000.000000	0.049000
30060.000000	0.049000
30120.000000	0.049000
30180.000000	0.049000
30240.000000	0.049000
30300.000000	0.049000
30360.000000	0.188000
30420.000000	0.188000
30480.000000	0.188000
30540.000000	0.188000
30600.000000	0.188000
30660.000000	0.188000
30720.000000	0.188000
30780.000000	0.188000
30840.000000	0.188000
30900.000000	0.188000
30960.000000	0.188000
31020.000000	0.188000
31080.000000	0.188000
31140.000000	0.188000
31200.000000	0.188000
31260.000000	0.188000
31320.000000	0.188000
31380.000000	0.188000
31440.000000	0.188000
31500.000000	0.188000
31560.000000	0.049000
31620.000000	0.049000
31680.000000	0.049000
31740.000000	0.049000
31800.000000	0.049000
31860.000000	0.049000
31920.000000	0.049000
31980.000000	0.049000
32040.000000	0.049000
32100.000000	0.049000
32160.000000	0.049000
32220.000000	0.049000
32280.000000	0.049000
32340.000000	0.049000
32400.000000	0.049000
32460.000000	0.049000
32520.000000	0.049000
32580.000000	0.049000
32640.000000	0.049000
32700.000000	0.049000
32760.000000	0.049000
32820.000000	0.049000
32880.000000	0.049000
32940.000000	0.049000
33000.000000	0.049000
33060.000000	0.049000
33120.000000	0.049000
33180.000000	0.049000
33240.000000	0.049000
33300.000000	0.049000
33360.000000	0.049000
33420.000000	0.049000
33480.000000	0.049000
33540.000000	0.049000
33600.000000	0.049000
33660.000000	0.049000
33720.000000	0.049000
33780.000000	0.049000
33840.000000	0.049000
33900.000000	0.049000
33960.000000	0.049000
34020.000000	0.049000
34080.000000	0.049000
34140.000000	0.049000
34200.000000	0.049000
34260.000000	0.049000
34320.000000	0.188000
34380.000000	0.188000
34440.000000	0.188000
34500.000000	0.188000
34560.000000	0.188000
34620.000000	0.188000
34680.000000	0.188000
34740.000000	0.188000
34800.000000	0.188000
34860.000000	0.188000
34920.000000	0.188000
34980.000000	0.188000
35040.000000	0.188000
35100.000000	0.188000
35160.000000	0.188000
35220.000000	0.188000
35280.000000	0.188000
35340.000000	0.188000
35400.000000	0.188000
35460.000000	0.208000
35520.000000	0.069000
35580.000000	0.049000
35640.000000	0.049000
35700.000000	0.049000
35760.000000	0.049000
35820.000000	0.049000
35880.000000	0.049000
35940.000000	0.049000
36000.000000	0.049000
36060.000000	0.049000
36120.000000	0.049000
36180.000000	0.049000
36240.000000	0.049000
36300.000000	0.049000
36360.000000	0.049000
36420.000000	0.049000
36480.000000	0.049000
36540.000000	0.049000
36600.000000	0.049000
36660.000000	0.049000
36720.000000	0.049000
36780.000000	0.049000
36840.000000	0.049000
36900.000000	0.049000
36960.000000	0.049000
37020.000000	0.049000
37080.000000	0.049000
37140.000000	0.049000
37200.000000	0.049000
37260.000000	0.049000
37320.000000	0.049000
37380.000000	0.049000
37440.000000	0.049000
37500.000000	0.049000
37560.000000	0.049000
37620.000000	0.049000
37680.000000	0.049000
37740.000000	0.049000
37800.000000	0.049000
37860.000000	0.049000
37920.000000	0.049000
37980.000000	0.049000
38040.000000	0.149000
38100.000000	0.149000
38160.000000	0.149000
38220.000000	0.149000
38280.000000	0.049000
38340.000000	0.049000
38400.000000	0.049000
38460.000000	0.049000
38520.000000	0.049000
38580.000000	1.809000
38640.000000	1.809000
38700.000000	1.809000
38760.000000	0.049000
38820.000000	0.188000
38880.000000	0.188000
38940.000000	0.188000
39000.000000	0.188000
39060.000000	0.188000
39120.000000	0.188000
39180.000000	0.188000
39240.000000	0.188000
39300.000000	0.188000
39360.000000	0.188000
39420.000000	0.188000
39480.000000	0.188000
39540.000000	0.188000
39600.000000	0.188000
39660.000000	0.188000
39720.000000	0.188000
39780.000000	0.188000
39840.000000	0.188000
39900.000000	0.188000
39960.000000	0.188000
40020.000000	0.049000
40080.000000	0.049000
40140.000000	0.049000
40200.000000	0.049000
40260.000000	0.049000
40320.000000	0.049000
40380.000000	0.049000
40440.000000	0.049000
40500.000000	0.049000
40560.000000	0.049000
40620.000000	0.049000
40680.000000	0.049000
40740.000000	0.049000
40800.000000	0.049000
40860.000000	0.049000
40920.000000	0.049000
40980.000000	0.049000
41040.000000	0.049000
41100.000000	0.057000
41160.000000	0.057000
41220.000000	0.057000
41280.000000	0.057000
41340.000000	0.057000
41400.000000	0.057000
41460.000000	0.057000
41520.000000	0.057000
41580.000000	0.057000
41640.000000	0.057000
41700.000000	0.821000
41760.000000	0.821000
41820.000000	0.821000
41880.000000	0.821000
41940.000000	0.821000
42000.000000	0.821000
42060.000000	0.821000
42120.000000	0.821000
42180.000000	0.821000
42240.000000	0.821000
42300.000000	0.821000
42360.000000	0.821000
42420.000000	0.821000
42480.000000	0.821000
42540.000000	0.821000
42600.000000	0.821000
42660.000000	0.821000
42720.000000	0.821000
42780.000000	0.821000
42840.000000	0.821000
42900.000000	0.821000
42960.000000	0.821000
43020.000000	0.821000
43080.000000	0.821000
43140.000000	0.821000
43200.000000	0.821000
43260.000000	0.821000
43320.000000	0.821000
43380.000000	0.821000
43440.000000	0.821000
43500.000000	0.057000
43560.000000	0.057000
43620.000000	0.057000
43680.000000	0.057000
43740.000000	0.057000
43800.000000	0.057000
43860.000000	0.049000
43920.000000	0.049000
43980.000000	0.049000
44040.000000	0.049000
44100.000000	0.188000
44160.000000	0.188000
44220.000000	0.188000
44280.000000	0.188000
44340.000000	0.188000
44400.000000	0.188000
44460.000000	0.188000
44520.000000	0.188000
44580.000000	0.188000
44640.000000	0.188000
44700.000000	0.188000
44760.000000	0.188000
44820.000000	0.188000
44880.000000	0.188000
44940.000000	0.188000
45000.000000	0.188000
45060.000000	0.188000
45120.000000	0.188000
45180.000000	0.188000
45240.000000	0.188000
45300.000000	0.049000
45360.000000	0.049000
45420.000000	0.049000
45480.000000	0.049000
45540.000000	0.049000
45600.000000	0.049000
45660.000000	0.049000
45720.000000	0.049000
45780.000000	0.049000
45840.000000	0.049000
45900.000000	0.049000
45960.000000	0.049000
46020.000000	0.049000
46080.000000	0.049000
46140.000000	0.049000
46200.000000	0.049000
46260.000000	0.049000
46320.000000	0.049000
46380.000000	0.049000
46440.000000	0.049000
46500.000000	0.049000
46560.000000	0.049000
46620.000000	0.049000
46680.000000	0.049000
46740.000000	0.049000
46800.000000	0.049000
46860.000000	0.049000
46920.000000	0.049000
46980.000000	0.049000
47040.000000	0.049000
47100.000000	0.049000
47160.000000	0.049000
47220.000000	0.049000
47280.000000	0.049000
47340.000000	0.049000
47400.000000	0.049000
47460.000000	0.049000
47520.000000	0.049000
47580.000000	0.049000
47640.000000	0.049000
47700.000000	0.049000
47760.000000	0.049000
47820.000000	0.049000
47880.000000	0.049000
47940.000000	0.049000
48000.000000	0.049000
48060.000000	0.049000
48120.000000	0.049000
48180.000000	0.049000
48240.000000	0.049000
48300.000000	0.049000
48360.000000	0.049000
48420.000000	0.049000
48480.000000	0.049000
48540.000000	0.049000
48600.000000	0.049000
48660.000000	0.049000
48720.000000	0.049000
48780.000000	0.049000
48840.000000	0.049000
48900.000000	0.049000
48960.000000	0.049000
49020.000000	0.049000
49080.000000	0.049000
49140.000000	0.049000
49200.000000	0.049000
49260.000000	0.049000
49320.000000	0.049000
49380.000000	0.049000
49440.000000	0.049000
49500.000000	0.049000
49560.000000	0.049000
49620.000000	0.049000
49680.000000	0.049000
49740.000000	0.049000
49800.000000	0.049000
49860.000000	0.049000
49920.000000	0.049000
49980.000000	0.049000
50040.000000	0.049000
50100.000000	0.049000
50160.000000	0.049000
50220.000000	0.049000
50280.000000	0.049000
50340.000000	0.049000
50400.000000	0.049000
50460.000000	0.049000
50520.000000	0.049000
50580.000000	0.188000
50640.000000	0.188000
50700.000000	0.188000
50760.000000	0.188000
50820.000000	0.188000
50880.000000	0.188000
50940.000000	0.188000
51000.000000	0.188000
51060.000000	0.188000
51120.000000	0.188000
51180.000000	0.188000
51240.000000	0.188000
51300.000000	0.188000
51360.000000	0.188000
51420.000000	0.188000
51480.000000	0.188000
51540.000000	0.188000
51600.000000	0.188000
51660.000000	0.188000
51720.000000	0.188000
51780.000000	0.049000
51840.000000	0.049000
51900.000000	0.049000
51960.000000	0.049000
52020.000000	0.049000
52080.000000	0.049000
52140.000000	0.049000
52200.000000	0.049000
52260.000000	0.049000
52320.000000	0.049000
52380.000000	0.049000
52440.000000	0.049000
52500.000000	0.049000
52560.000000	0.049000
52620.000000	0.049000
52680.000000	0.049000
52740.000000	0.049000
52800.000000	0.049000
52860.000000	0.049000
52920.000000	0.049000
52980.000000	0.049000
53040.000000	0.049000
53100.000000	0.049000
53160.000000	0.049000
53220.000000	0.049000
53280.000000	0.049000
53340.000000	0.049000
53400.000000	0.049000
53460.000000	0.049000
53520.000000	0.049000
53580.000000	0.049000
53640.000000	0.049000
53700.000000	0.049000
53760.000000	0.049000
53820.000000	0.049000
53880.000000	0.049000
53940.000000	0.049000
54000.000000	0.049000
54060.000000	0.049000
54120.000000	0.049000
54180.000000	0.049000
54240.000000	0.049000
54300.000000	0.049000
54360.000000	0.049000
54420.000000	0.049000
54480.000000	0.049000
54540.000000	0.049000
54600.000000	0.049000
54660.000000	0.049000
54720.000000	0.049000
54780.000000	0.049000
54840.000000	0.049000
54900.000000	0.049000
54960.000000	0.049000
55020.000000	0.049000
55080.000000	0.049000
55140.000000	0.049000
55200.000000	0.049000
55260.000000	0.049000
55320.000000	0.049000
55380.000000	0.049000
55440.000000	0.049000
55500.000000	0.049000
55560.000000	0.049000
55620.000000	0.049000
55680.000000	0.049000
55740.000000	0.049000
55800.000000	0.049000
55860.000000	0.057000
55920.000000	0.057000
55980.000000	0.057000
56040.000000	0.057000
56100.000000	0.057000
56160.000000	0.057000
56220.000000	0.057000
56280.000000	0.057000
56340.000000	0.057000
56400.000000	0.057000
56460.000000	0.057000
56520.000000	0.057000
56580.000000	0.057000
56640.000000	0.057000
56700.000000	0.057000
56760.000000	0.057000
56820.000000	0.057000
56880.000000	0.057000
56940.000000	0.057000
57000.000000	0.057000
57060.000000	0.057000
57120.000000	0.057000
57180.000000	0.057000
57240.000000	0.057000
57300.000000	0.196000
57360.000000	0.196000
57420.000000	0.196000
57480.000000	0.188000
57540.000000	0.188000
57600.000000	0.260000
57660.000000	0.260000
57720.000000	0.260000
57780.000000	0.260000
57840.000000	0.260000
57900.000000	0.260000
57960.000000	0.260000
58020.000000	0.260000
58080.000000	2.243000
58140.000000	2.243000
58200.000000	2.243000
58260.000000	2.243000
58320.000000	2.303000
58380.000000	2.303000
58440.000000	2.303000
58500.000000	2.164000
58560.000000	2.164000
58620.000000	2.164000
58680.000000	2.164000
58740.000000	2.164000
58800.000000	2.164000
58860.000000	2.164000
58920.000000	2.224000
58980.000000	2.224000
59040.000000	2.292000
59100.000000	2.292000
59160.000000	2.292000
59220.000000	2.292000
59280.000000	2.305000
59340.000000	0.322000
59400.000000	0.407000
59460.000000	0.407000
59520.000000	0.347000
59580.000000	0.347000
59640.000000	0.347000
59700.000000	0.347000
59760.000000	0.347000
59820.000000	0.347000
59880.000000	0.347000
59940.000000	0.347000
60000.000000	0.347000
60060.000000	0.347000
60120.000000	0.367000
60180.000000	0.307000
60240.000000	0.307000
60300.000000	0.307000
60360.000000	2.067000
60420.000000	2.067000
60480.000000	2.067000
60540.000000	0.307000
60600.000000	0.307000
60660.000000	0.307000
60720.000000	0.307000
60780.000000	0.307000
60840.000000	0.327000
60900.000000	0.327000
60960.000000	0.327000
61020.000000	0.327000
61080.000000	0.327000
61140.000000	0.327000
61200.000000	0.327000
61260.000000	0.327000
61320.000000	0.327000
61380.000000	0.327000
61440.000000	2.087000
61500.000000	2.087000
61560.000000	2.087000
61620.000000	0.327000
61680.000000	0.307000
61740.000000	0.307000
61800.000000	0.307000
61860.000000	0.307000
61920.000000	0.307000
61980.000000	0.307000
62040.000000	0.307000
62100.000000	0.307000
62160.000000	0.307000
62220.000000	0.307000
62280.000000	0.446000
62340.000000	0.446000
62400.000000	0.486000
62460.000000	0.486000
62520.000000	0.446000
62580.000000	0.446000
62640.000000	0.446000
62700.000000	0.446000
62760.000000	0.446000
62820.000000	0.446000
62880.000000	0.493000
62940.000000	0.493000
63000.000000	0.433000
63060.000000	0.433000
63120.000000	0.525000
63180.000000	0.525000
63240.000000	0.348000
63300.000000	0.348000
63360.000000	0.348000
63420.000000	0.340000
63480.000000	0.201000
63540.000000	0.201000
63600.000000	0.201000
63660.000000	0.201000
63720.000000	0.201000
63780.000000	0.201000
63840.000000	0.201000
63900.000000	0.378000
63960.000000	0.378000
64020.000000	0.201000
64080.000000	0.201000
64140.000000	0.201000
64200.000000	0.214000
64260.000000	0.214000
64320.000000	0.214000
64380.000000	0.214000
64440.000000	0.274000
64500.000000	0.274000
64560.000000	0.274000
64620.000000	0.274000
64680.000000	0.451000
64740.000000	0.451000
64800.000000	0.274000
64860.000000	0.274000
64920.000000	0.274000
64980.000000	0.274000
65040.000000	0.274000
65100.000000	0.274000
65160.000000	0.274000
65220.000000	0.274000
65280.000000	0.274000
65340.000000	0.274000
65400.000000	0.214000
65460.000000	0.391000
65520.000000	0.391000
65580.000000	0.709000
65640.000000	0.709000
65700.000000	0.709000
65760.000000	0.709000
65820.000000	0.709000
65880.000000	0.142000
65940.000000	0.142000
66000.000000	0.142000
66060.000000	0.142000
66120.000000	0.142000
66180.000000	0.142000
66240.000000	0.142000
66300.000000	0.142000
66360.000000	0.142000
66420.000000	0.142000
66480.000000	0.142000
66540.000000	0.142000
66600.000000	0.142000
66660.000000	0.142000
66720.000000	0.142000
66780.000000	0.082000
66840.000000	0.082000
66900.000000	0.082000
66960.000000	0.082000
67020.000000	0.142000
67080.000000	0.202000
67140.000000	0.202000
67200.000000	0.202000
67260.000000	0.202000
67320.000000	0.202000
67380.000000	0.202000
67440.000000	0.202000
67500.000000	0.202000
67560.000000	0.202000
67620.000000	0.142000
67680.000000	0.142000
67740.000000	0.142000
67800.000000	0.129000
67860.000000	0.069000
67920.000000	0.069000
67980.000000	0.069000
68040.000000	0.069000
68100.000000	0.069000
68160.000000	0.077000
68220.000000	0.077000
68280.000000	0.077000
68340.000000	0.077000
68400.000000	0.077000
68460.000000	0.077000
68520.000000	0.216000
68580.000000	0.276000
68640.000000	0.506000
68700.000000	0.540000
68760.000000	0.540000
68820.000000	0.540000
68880.000000	0.540000
68940.000000	0.540000
69000.000000	0.540000
69060.000000	0.540000
69120.000000	0.540000
69180.000000	0.540000
69240.000000	0.540000
69300.000000	0.540000
69360.000000	0.414000
69420.000000	0.414000
69480.000000	0.414000
69540.000000	0.414000
69600.000000	0.414000
69660.000000	0.600000
69720.000000	0.461000
69780.000000	0.461000
69840.000000	0.461000
69900.000000	0.461000
69960.000000	0.461000
70020.000000	0.461000
70080.000000	0.401000
70140.000000	0.401000
70200.000000	0.401000
70260.000000	0.401000
70320.000000	0.401000
70380.000000	0.414000
70440.000000	0.414000
70500.000000	0.414000
70560.000000	0.394000
70620.000000	0.394000
70680.000000	0.394000
70740.000000	0.394000
70800.000000	0.394000
70860.000000	0.434000
70920.000000	0.434000
70980.000000	0.494000
71040.000000	0.494000
71100.000000	0.454000
71160.000000	0.454000
71220.000000	0.454000
71280.000000	0.454000
71340.000000	0.454000
71400.000000	0.454000
71460.000000	0.454000
71520.000000	0.454000
71580.000000	0.514000
71640.000000	0.514000
71700.000000	0.514000
71760.000000	0.454000
71820.000000	0.454000
71880.000000	0.454000
71940.000000	0.454000
72000.000000	0.454000
72060.000000	0.454000
72120.000000	0.554000
72180.000000	0.554000
72240.000000	0.614000
72300.000000	0.753000
72360.000000	0.713000
72420.000000	0.653000
72480.000000	0.693000
72540.000000	0.685000
72600.000000	0.685000
72660.000000	0.645000
72720.000000	0.645000
72780.000000	0.645000
72840.000000	0.645000
72900.000000	0.645000
72960.000000	0.645000
73020.000000	0.645000
73080.000000	0.611000
73140.000000	0.611000
73200.000000	0.611000
73260.000000	0.611000
73320.000000	0.611000
73380.000000	0.611000
73440.000000	0.611000
73500.000000	0.472000
73560.000000	0.472000
73620.000000	0.472000
73680.000000	0.472000
73740.000000	0.472000
73800.000000	0.472000
73860.000000	0.472000
73920.000000	0.472000
73980.000000	0.459000
74040.000000	0.459000
74100.000000	0.459000
74160.000000	0.459000
74220.000000	0.459000
74280.000000	1.723000
74340.000000	1.723000
74400.000000	1.723000
74460.000000	0.459000
74520.000000	0.459000
74580.000000	0.459000
74640.000000	0.459000
74700.000000	0.459000
74760.000000	0.459000
74820.000000	0.459000
74880.000000	0.459000
74940.000000	0.459000
75000.000000	0.519000
75060.000000	0.519000
75120.000000	0.519000
75180.000000	0.619000
75240.000000	0.619000
75300.000000	0.619000
75360.000000	0.619000
75420.000000	0.619000
75480.000000	0.619000
75540.000000	0.619000
75600.000000	0.619000
75660.000000	0.619000
75720.000000	0.619000
75780.000000	0.501000
75840.000000	0.501000
75900.000000	0.501000
75960.000000	0.481000
76020.000000	0.481000
76080.000000	0.481000
76140.000000	0.421000
76200.000000	0.560000
76260.000000	0.686000
76320.000000	0.686000
76380.000000	0.686000
76440.000000	0.686000
76500.000000	0.686000
76560.000000	0.686000
76620.000000	0.686000
76680.000000	0.686000
76740.000000	0.686000
76800.000000	0.686000
76860.000000	0.586000
76920.000000	0.586000
76980.000000	0.546000
77040.000000	0.546000
77100.000000	0.546000
77160.000000	0.546000
77220.000000	0.546000
77280.000000	2.306000
77340.000000	2.306000
77400.000000	2.167000
77460.000000	0.407000
77520.000000	0.407000
77580.000000	0.407000
77640.000000	0.407000
77700.000000	0.407000
77760.000000	0.407000
77820.000000	0.407000
77880.000000	0.407000
77940.000000	0.407000
78000.000000	0.407000
78060.000000	0.407000
78120.000000	0.407000
78180.000000	0.407000
78240.000000	0.407000
78300.000000	0.407000
78360.000000	0.407000
78420.000000	0.420000
78480.000000	0.420000
78540.000000	0.420000
78600.000000	0.420000
78660.000000	0.420000
78720.000000	0.505000
78780.000000	0.420000
78840.000000	0.316000
78900.000000	0.316000
78960.000000	0.356000
79020.000000	0.416000
79080.000000	0.416000
79140.000000	0.416000
79200.000000	0.416000
79260.000000	0.416000
79320.000000	0.416000
79380.000000	0.456000
79440.000000	0.416000
79500.000000	0.416000
79560.000000	0.416000
79620.000000	0.416000
79680.000000	0.416000
79740.000000	0.416000
79800.000000	0.416000
79860.000000	0.416000
79920.000000	0.416000
79980.000000	0.501000
80040.000000	0.501000
80100.000000	0.501000
80160.000000	0.493000
80220.000000	0.493000
80280.000000	0.513000
80340.000000	0.513000
80400.000000	0.513000
80460.000000	0.513000
80520.000000	0.513000
80580.000000	0.513000
80640.000000	0.513000
80700.000000	0.513000
80760.000000	0.513000
80820.000000	0.547000
80880.000000	0.507000
80940.000000	0.507000
81000.000000	0.507000
81060.000000	0.507000
81120.000000	0.507000
81180.000000	0.507000
81240.000000	0.507000
81300.000000	0.507000
81360.000000	0.507000
81420.000000	0.507000
81480.000000	0.507000
81540.000000	0.507000
81600.000000	0.481000
81660.000000	0.501000
81720.000000	0.521000
81780.000000	0.481000
81840.000000	0.421000
81900.000000	0.421000
81960.000000	0.421000
82020.000000	0.508000
82080.000000	0.508000
82140.000000	0.408000
82200.000000	0.784000
82260.000000	0.784000
82320.000000	0.784000
82380.000000	0.784000
82440.000000	0.408000
82500.000000	0.408000
82560.000000	0.408000
82620.000000	0.468000
82680.000000	0.468000
82740.000000	0.468000
82800.000000	0.468000
82860.000000	0.049000
82920.000000	0.049000
82980.000000	0.049000
83040.000000	0.049000
83100.000000	0.049000
83160.000000	0.049000
83220.000000	0.049000
83280.000000	0.049000
83340.000000	0.049000
83400.000000	0.049000
83460.000000	0.049000
83520.000000	0.049000
83580.000000	0.049000
83640.000000	0.049000
83700.000000	0.049000
83760.000000	0.049000
83820.000000	0.049000
83880.000000	0.049000
83940.000000	0.049000
84000.000000	0.049000
84060.000000	0.049000
84120.000000	0.049000
84180.000000	0.049000
84240.000000	0.049000
84300.000000	0.049000
84360.000000	0.049000
84420.000000	0.049000
84480.000000	0.188000
84540.000000	0.188000
84600.000000	0.188000
84660.000000	0.188000
84720.000000	0.188000
84780.000000	0.188000
84840.000000	0.188000
84900.000000	0.188000
84960.000000	0.188000
85020.000000	0.188000
85080.000000	0.188000
85140.000000	0.188000
85200.000000	0.188000
85260.000000	0.188000
85320.000000	0.188000
85380.000000	0.188000
85440.000000	0.188000
85500.000000	0.188000
85560.000000	0.188000
85620.000000	0.188000
85680.000000	0.049000
85740.000000	0.049000
85800.000000	0.049000
85860.000000	0.049000
85920.000000	0.049000
85980.000000	0.049000
86040.000000	0.049000
86100.000000	0.049000
86160.000000	0.049000
86220.000000	0.049000
86280.000000	0.049000
86340.000000	0.049000
86400.000000	0.049000
