#1
double LoadProfile(1440,2)
60.000000	0.051000
120.000000	0.051000
180.000000	0.051000
240.000000	0.051000
300.000000	0.051000
360.000000	0.051000
420.000000	0.051000
480.000000	0.051000
540.000000	0.051000
600.000000	0.051000
660.000000	0.051000
720.000000	0.051000
780.000000	0.051000
840.000000	0.051000
900.000000	0.051000
960.000000	0.051000
1020.000000	0.051000
1080.000000	0.051000
1140.000000	0.051000
1200.000000	0.051000
1260.000000	0.051000
1320.000000	0.051000
1380.000000	0.051000
1440.000000	0.051000
1500.000000	0.051000
1560.000000	0.051000
1620.000000	0.051000
1680.000000	0.051000
1740.000000	0.051000
1800.000000	0.051000
1860.000000	0.051000
1920.000000	0.051000
1980.000000	0.051000
2040.000000	0.051000
2100.000000	0.051000
2160.000000	0.051000
2220.000000	0.051000
2280.000000	0.051000
2340.000000	0.051000
2400.000000	0.051000
2460.000000	0.051000
2520.000000	0.051000
2580.000000	0.051000
2640.000000	0.051000
2700.000000	0.051000
2760.000000	0.051000
2820.000000	0.051000
2880.000000	0.173000
2940.000000	0.173000
3000.000000	0.173000
3060.000000	0.173000
3120.000000	0.173000
3180.000000	0.173000
3240.000000	0.173000
3300.000000	0.173000
3360.000000	0.173000
3420.000000	0.173000
3480.000000	0.173000
3540.000000	0.173000
3600.000000	0.173000
3660.000000	0.173000
3720.000000	0.173000
3780.000000	0.173000
3840.000000	0.173000
3900.000000	0.173000
3960.000000	0.051000
4020.000000	0.051000
4080.000000	0.051000
4140.000000	0.051000
4200.000000	0.051000
4260.000000	0.051000
4320.000000	0.051000
4380.000000	0.051000
4440.000000	0.051000
4500.000000	0.051000
4560.000000	0.051000
4620.000000	0.051000
4680.000000	0.051000
4740.000000	0.051000
4800.000000	0.051000
4860.000000	0.051000
4920.000000	0.051000
4980.000000	0.051000
5040.000000	0.051000
5100.000000	0.051000
5160.000000	0.051000
5220.000000	0.051000
5280.000000	0.051000
5340.000000	0.051000
5400.000000	0.051000
5460.000000	0.051000
5520.000000	0.051000
5580.000000	0.051000
5640.000000	0.051000
5700.000000	0.051000
5760.000000	0.051000
5820.000000	0.051000
5880.000000	0.051000
5940.000000	0.051000
6000.000000	0.051000
6060.000000	0.051000
6120.000000	0.173000
6180.000000	0.173000
6240.000000	0.173000
6300.000000	0.173000
6360.000000	0.173000
6420.000000	0.315000
6480.000000	0.315000
6540.000000	0.315000
6600.000000	0.315000
6660.000000	0.315000
6720.000000	0.315000
6780.000000	0.315000
6840.000000	0.315000
6900.000000	0.534000
6960.000000	0.534000
7020.000000	0.534000
7080.000000	0.534000
7140.000000	0.534000
7200.000000	0.412000
7260.000000	0.412000
7320.000000	0.412000
7380.000000	0.412000
7440.000000	0.412000
7500.000000	0.412000
7560.000000	0.412000
7620.000000	0.270000
7680.000000	0.270000
7740.000000	0.270000
7800.000000	0.270000
7860.000000	0.270000
7920.000000	0.270000
7980.000000	0.270000
8040.000000	0.270000
8100.000000	0.270000
8160.000000	0.270000
8220.000000	0.051000
8280.000000	0.051000
8340.000000	0.051000
8400.000000	0.051000
8460.000000	0.051000
8520.000000	0.051000
8580.000000	0.051000
8640.000000	0.051000
8700.000000	0.051000
8760.000000	0.051000
8820.000000	0.051000
8880.000000	0.051000
8940.000000	0.051000
9000.000000	0.051000
9060.000000	0.051000
9120.000000	0.051000
9180.000000	0.051000
9240.000000	0.051000
9300.000000	0.051000
9360.000000	0.051000
9420.000000	0.051000
9480.000000	0.051000
9540.000000	0.051000
9600.000000	0.051000
9660.000000	0.051000
9720.000000	0.051000
9780.000000	0.051000
9840.000000	0.051000
9900.000000	0.051000
9960.000000	0.051000
10020.000000	0.051000
10080.000000	0.051000
10140.000000	0.051000
10200.000000	0.051000
10260.000000	0.051000
10320.000000	0.051000
10380.000000	0.051000
10440.000000	0.051000
10500.000000	0.051000
10560.000000	0.051000
10620.000000	0.051000
10680.000000	0.051000
10740.000000	0.051000
10800.000000	0.051000
10860.000000	0.051000
10920.000000	0.051000
10980.000000	0.051000
11040.000000	0.051000
11100.000000	0.173000
11160.000000	0.173000
11220.000000	0.173000
11280.000000	0.173000
11340.000000	0.173000
11400.000000	0.173000
11460.000000	0.173000
11520.000000	0.173000
11580.000000	0.173000
11640.000000	0.173000
11700.000000	0.173000
11760.000000	0.173000
11820.000000	0.173000
11880.000000	0.173000
11940.000000	0.173000
12000.000000	0.173000
12060.000000	0.392000
12120.000000	0.392000
12180.000000	0.270000
12240.000000	0.270000
12300.000000	0.270000
12360.000000	0.270000
12420.000000	0.270000
12480.000000	0.270000
12540.000000	0.270000
12600.000000	0.270000
12660.000000	0.270000
12720.000000	0.270000
12780.000000	0.270000
12840.000000	0.270000
12900.000000	0.270000
12960.000000	0.270000
13020.000000	0.270000
13080.000000	0.270000
13140.000000	0.270000
13200.000000	0.270000
13260.000000	0.412000
13320.000000	0.412000
13380.000000	0.193000
13440.000000	0.193000
13500.000000	0.193000
13560.000000	0.193000
13620.000000	0.193000
13680.000000	0.193000
13740.000000	0.193000
13800.000000	0.193000
13860.000000	0.193000
13920.000000	0.193000
13980.000000	0.193000
14040.000000	0.193000
14100.000000	0.193000
14160.000000	0.193000
14220.000000	0.193000
14280.000000	0.193000
14340.000000	0.193000
14400.000000	0.193000
14460.000000	0.051000
14520.000000	0.173000
14580.000000	0.173000
14640.000000	0.173000
14700.000000	0.173000
14760.000000	0.173000
14820.000000	0.173000
14880.000000	0.173000
14940.000000	0.173000
15000.000000	0.173000
15060.000000	0.173000
15120.000000	0.173000
15180.000000	0.173000
15240.000000	0.173000
15300.000000	0.173000
15360.000000	0.173000
15420.000000	0.173000
15480.000000	0.173000
15540.000000	0.173000
15600.000000	0.051000
15660.000000	0.051000
15720.000000	0.051000
15780.000000	0.051000
15840.000000	0.051000
15900.000000	0.051000
15960.000000	0.051000
16020.000000	0.051000
16080.000000	0.051000
16140.000000	0.051000
16200.000000	0.051000
16260.000000	0.051000
16320.000000	0.051000
16380.000000	0.051000
16440.000000	0.051000
16500.000000	0.051000
16560.000000	0.051000
16620.000000	0.051000
16680.000000	0.270000
16740.000000	0.270000
16800.000000	0.270000
16860.000000	0.270000
16920.000000	0.270000
16980.000000	0.270000
17040.000000	0.270000
17100.000000	0.270000
17160.000000	0.270000
17220.000000	0.270000
17280.000000	0.270000
17340.000000	0.270000
17400.000000	0.270000
17460.000000	0.270000
17520.000000	0.270000
17580.000000	0.270000
17640.000000	0.270000
17700.000000	0.270000
17760.000000	0.270000
17820.000000	0.270000
17880.000000	0.412000
17940.000000	0.412000
18000.000000	0.193000
18060.000000	0.315000
18120.000000	0.315000
18180.000000	0.315000
18240.000000	0.315000
18300.000000	0.315000
18360.000000	0.315000
18420.000000	0.315000
18480.000000	0.315000
18540.000000	0.315000
18600.000000	0.315000
18660.000000	0.315000
18720.000000	0.315000
18780.000000	0.315000
18840.000000	0.315000
18900.000000	0.315000
18960.000000	0.315000
19020.000000	0.315000
19080.000000	0.173000
19140.000000	0.051000
19200.000000	0.051000
19260.000000	0.051000
19320.000000	0.051000
19380.000000	0.051000
19440.000000	0.051000
19500.000000	0.051000
19560.000000	0.051000
19620.000000	0.051000
19680.000000	0.051000
19740.000000	0.051000
19800.000000	0.051000
19860.000000	0.051000
19920.000000	0.051000
19980.000000	0.051000
20040.000000	0.051000
20100.000000	0.051000
20160.000000	0.051000
20220.000000	0.051000
20280.000000	0.051000
20340.000000	0.051000
20400.000000	0.051000
20460.000000	0.051000
20520.000000	0.051000
20580.000000	0.051000
20640.000000	0.051000
20700.000000	0.051000
20760.000000	0.051000
20820.000000	0.051000
20880.000000	0.051000
20940.000000	0.051000
21000.000000	0.051000
21060.000000	0.051000
21120.000000	0.051000
21180.000000	0.051000
21240.000000	0.051000
21300.000000	0.051000
21360.000000	0.051000
21420.000000	0.270000
21480.000000	0.270000
21540.000000	0.270000
21600.000000	0.270000
21660.000000	0.270000
21720.000000	0.270000
21780.000000	0.392000
21840.000000	0.534000
21900.000000	0.534000
21960.000000	0.534000
22020.000000	0.534000
22080.000000	0.534000
22140.000000	0.534000
22200.000000	0.534000
22260.000000	0.534000
22320.000000	0.534000
22380.000000	0.534000
22440.000000	0.534000
22500.000000	0.534000
22560.000000	0.534000
22620.000000	0.534000
22680.000000	0.534000
22740.000000	0.315000
22800.000000	0.315000
22860.000000	0.193000
22920.000000	0.193000
22980.000000	0.193000
23040.000000	0.051000
23100.000000	0.051000
23160.000000	0.051000
23220.000000	0.051000
23280.000000	0.051000
23340.000000	0.051000
23400.000000	0.051000
23460.000000	0.051000
23520.000000	0.051000
23580.000000	0.051000
23640.000000	0.051000
23700.000000	0.051000
23760.000000	0.051000
23820.000000	0.051000
23880.000000	0.051000
23940.000000	0.051000
24000.000000	0.051000
24060.000000	0.051000
24120.000000	0.051000
24180.000000	0.051000
24240.000000	0.051000
24300.000000	0.051000
24360.000000	0.051000
24420.000000	0.051000
24480.000000	0.051000
24540.000000	0.051000
24600.000000	0.051000
24660.000000	0.051000
24720.000000	0.051000
24780.000000	0.051000
24840.000000	0.051000
24900.000000	0.051000
24960.000000	0.051000
25020.000000	0.051000
25080.000000	0.051000
25140.000000	0.051000
25200.000000	0.051000
25260.000000	0.051000
25320.000000	0.051000
25380.000000	0.051000
25440.000000	0.270000
25500.000000	0.270000
25560.000000	0.270000
25620.000000	0.270000
25680.000000	0.270000
25740.000000	0.270000
25800.000000	0.270000
25860.000000	0.270000
25920.000000	0.270000
25980.000000	0.270000
26040.000000	0.270000
26100.000000	0.270000
26160.000000	0.270000
26220.000000	0.270000
26280.000000	0.270000
26340.000000	0.270000
26400.000000	0.270000
26460.000000	0.270000
26520.000000	0.270000
26580.000000	0.270000
26640.000000	0.270000
26700.000000	0.270000
26760.000000	0.051000
26820.000000	0.051000
26880.000000	0.051000
26940.000000	0.051000
27000.000000	0.051000
27060.000000	0.051000
27120.000000	0.051000
27180.000000	0.051000
27240.000000	0.051000
27300.000000	0.051000
27360.000000	0.051000
27420.000000	0.051000
27480.000000	0.051000
27540.000000	0.193000
27600.000000	0.193000
27660.000000	0.193000
27720.000000	0.193000
27780.000000	0.193000
27840.000000	0.193000
27900.000000	0.193000
27960.000000	0.193000
28020.000000	0.193000
28080.000000	0.193000
28140.000000	0.193000
28200.000000	0.193000
28260.000000	0.193000
28320.000000	0.193000
28380.000000	0.193000
28440.000000	0.193000
28500.000000	0.193000
28560.000000	0.193000
28620.000000	0.193000
28680.000000	0.193000
28740.000000	0.051000
28800.000000	0.051000
28860.000000	0.051000
28920.000000	0.051000
28980.000000	0.051000
29040.000000	0.051000
29100.000000	0.051000
29160.000000	0.051000
29220.000000	0.051000
29280.000000	0.051000
29340.000000	0.051000
29400.000000	0.051000
29460.000000	0.051000
29520.000000	0.270000
29580.000000	0.270000
29640.000000	0.270000
29700.000000	0.270000
29760.000000	0.270000
29820.000000	0.270000
29880.000000	0.270000
29940.000000	0.283000
30000.000000	0.283000
30060.000000	0.283000
30120.000000	0.283000
30180.000000	0.283000
30240.000000	0.283000
30300.000000	0.283000
30360.000000	0.283000
30420.000000	0.283000
30480.000000	0.283000
30540.000000	0.283000
30600.000000	0.283000
30660.000000	0.283000
30720.000000	0.283000
30780.000000	0.283000
30840.000000	0.064000
30900.000000	0.064000
30960.000000	0.084000
31020.000000	0.084000
31080.000000	0.084000
31140.000000	0.144000
31200.000000	0.244000
31260.000000	0.244000
31320.000000	0.244000
31380.000000	0.144000
31440.000000	0.144000
31500.000000	0.144000
31560.000000	0.144000
31620.000000	0.144000
31680.000000	0.144000
31740.000000	0.204000
31800.000000	0.204000
31860.000000	0.204000
31920.000000	0.266000
31980.000000	0.266000
32040.000000	0.326000
32100.000000	0.426000
32160.000000	0.426000
32220.000000	0.426000
32280.000000	0.426000
32340.000000	0.426000
32400.000000	0.426000
32460.000000	0.426000
32520.000000	0.426000
32580.000000	0.426000
32640.000000	0.426000
32700.000000	0.426000
32760.000000	0.426000
32820.000000	0.426000
32880.000000	0.426000
32940.000000	0.426000
33000.000000	0.304000
33060.000000	0.244000
33120.000000	0.244000
33180.000000	0.244000
33240.000000	0.244000
33300.000000	0.244000
33360.000000	0.244000
33420.000000	0.244000
33480.000000	0.244000
33540.000000	0.231000
33600.000000	0.231000
33660.000000	0.051000
33720.000000	0.270000
33780.000000	0.270000
33840.000000	0.412000
33900.000000	0.412000
33960.000000	0.412000
34020.000000	0.412000
34080.000000	0.412000
34140.000000	0.412000
34200.000000	0.412000
34260.000000	0.412000
34320.000000	0.412000
34380.000000	0.412000
34440.000000	0.412000
34500.000000	0.412000
34560.000000	0.412000
34620.000000	0.412000
34680.000000	0.412000
34740.000000	0.412000
34800.000000	0.412000
34860.000000	0.412000
34920.000000	0.412000
34980.000000	0.412000
35040.000000	0.051000
35100.000000	0.051000
35160.000000	0.051000
35220.000000	0.051000
35280.000000	0.051000
35340.000000	0.051000
35400.000000	0.051000
35460.000000	0.051000
35520.000000	0.051000
35580.000000	0.051000
35640.000000	0.051000
35700.000000	0.051000
35760.000000	0.051000
35820.000000	0.051000
35880.000000	0.051000
35940.000000	0.051000
36000.000000	0.051000
36060.000000	0.051000
36120.000000	0.051000
36180.000000	0.051000
36240.000000	0.051000
36300.000000	0.051000
36360.000000	0.051000
36420.000000	0.051000
36480.000000	0.051000
36540.000000	0.051000
36600.000000	0.051000
36660.000000	0.051000
36720.000000	0.051000
36780.000000	0.051000
36840.000000	0.051000
36900.000000	0.051000
36960.000000	0.051000
37020.000000	0.051000
37080.000000	0.051000
37140.000000	0.173000
37200.000000	0.173000
37260.000000	0.173000
37320.000000	0.173000
37380.000000	0.173000
37440.000000	0.173000
37500.000000	0.173000
37560.000000	0.173000
37620.000000	0.173000
37680.000000	0.173000
37740.000000	0.173000
37800.000000	0.173000
37860.000000	0.173000
37920.000000	0.173000
37980.000000	0.173000
38040.000000	0.173000
38100.000000	0.173000
38160.000000	0.173000
38220.000000	0.051000
38280.000000	0.051000
38340.000000	0.051000
38400.000000	0.051000
38460.000000	0.270000
38520.000000	0.270000
38580.000000	0.270000
38640.000000	0.270000
38700.000000	0.412000
38760.000000	0.412000
38820.000000	0.412000
38880.000000	0.412000
38940.000000	0.412000
39000.000000	0.412000
39060.000000	0.412000
39120.000000	0.412000
39180.000000	0.412000
39240.000000	0.412000
39300.000000	0.412000
39360.000000	0.412000
39420.000000	0.412000
39480.000000	0.412000
39540.000000	0.412000
39600.000000	0.412000
39660.000000	0.412000
39720.000000	0.412000
39780.000000	0.193000
39840.000000	0.193000
39900.000000	0.051000
39960.000000	0.051000
40020.000000	0.051000
40080.000000	0.051000
40140.000000	0.051000
40200.000000	0.051000
40260.000000	0.064000
40320.000000	0.064000
40380.000000	0.064000
40440.000000	0.064000
40500.000000	0.064000
40560.000000	0.064000
40620.000000	0.064000
40680.000000	0.064000
40740.000000	0.064000
40800.000000	0.064000
40860.000000	0.181000
40920.000000	0.181000
40980.000000	0.181000
41040.000000	0.181000
41100.000000	0.303000
41160.000000	0.303000
41220.000000	0.303000
41280.000000	0.303000
41340.000000	0.303000
41400.000000	0.303000
41460.000000	0.303000
41520.000000	0.303000
41580.000000	0.303000
41640.000000	0.303000
41700.000000	0.303000
41760.000000	0.303000
41820.000000	0.303000
41880.000000	0.303000
41940.000000	0.303000
42000.000000	0.303000
42060.000000	0.303000
42120.000000	0.303000
42180.000000	0.181000
42240.000000	0.181000
42300.000000	0.181000
42360.000000	0.181000
42420.000000	0.181000
42480.000000	0.181000
42540.000000	0.181000
42600.000000	0.181000
42660.000000	0.181000
42720.000000	0.181000
42780.000000	0.181000
42840.000000	0.181000
42900.000000	0.400000
42960.000000	0.400000
43020.000000	0.400000
43080.000000	0.400000
43140.000000	0.400000
43200.000000	0.400000
43260.000000	0.270000
43320.000000	0.270000
43380.000000	0.270000
43440.000000	0.270000
43500.000000	0.270000
43560.000000	0.270000
43620.000000	0.270000
43680.000000	0.270000
43740.000000	0.270000
43800.000000	0.270000
43860.000000	0.270000
43920.000000	0.270000
43980.000000	0.270000
44040.000000	0.270000
44100.000000	0.270000
44160.000000	0.270000
44220.000000	0.051000
44280.000000	0.051000
44340.000000	0.051000
44400.000000	0.051000
44460.000000	0.051000
44520.000000	0.051000
44580.000000	0.051000
44640.000000	0.051000
44700.000000	0.051000
44760.000000	0.051000
44820.000000	0.051000
44880.000000	0.051000
44940.000000	0.051000
45000.000000	0.051000
45060.000000	0.051000
45120.000000	0.051000
45180.000000	0.051000
45240.000000	0.051000
45300.000000	0.051000
45360.000000	0.051000
45420.000000	0.051000
45480.000000	0.051000
45540.000000	0.051000
45600.000000	0.051000
45660.000000	0.051000
45720.000000	0.051000
45780.000000	0.051000
45840.000000	0.051000
45900.000000	0.193000
45960.000000	0.193000
46020.000000	0.193000
46080.000000	0.193000
46140.000000	0.193000
46200.000000	0.193000
46260.000000	0.193000
46320.000000	0.193000
46380.000000	0.193000
46440.000000	0.193000
46500.000000	0.193000
46560.000000	0.193000
46620.000000	0.193000
46680.000000	0.193000
46740.000000	0.193000
46800.000000	0.193000
46860.000000	0.315000
46920.000000	0.315000
46980.000000	0.315000
47040.000000	0.315000
47100.000000	0.173000
47160.000000	0.173000
47220.000000	0.173000
47280.000000	0.173000
47340.000000	0.173000
47400.000000	0.392000
47460.000000	0.522000
47520.000000	0.522000
47580.000000	0.522000
47640.000000	0.522000
47700.000000	0.522000
47760.000000	0.522000
47820.000000	0.522000
47880.000000	0.522000
47940.000000	0.400000
48000.000000	0.400000
48060.000000	0.387000
48120.000000	0.387000
48180.000000	0.387000
48240.000000	0.387000
48300.000000	0.387000
48360.000000	0.387000
48420.000000	0.387000
48480.000000	0.387000
48540.000000	0.387000
48600.000000	0.387000
48660.000000	0.387000
48720.000000	0.168000
48780.000000	0.168000
48840.000000	0.168000
48900.000000	0.168000
48960.000000	0.168000
49020.000000	0.168000
49080.000000	0.168000
49140.000000	0.168000
49200.000000	0.168000
49260.000000	0.168000
49320.000000	0.168000
49380.000000	0.168000
49440.000000	0.168000
49500.000000	0.168000
49560.000000	0.168000
49620.000000	0.168000
49680.000000	0.168000
49740.000000	0.168000
49800.000000	0.168000
49860.000000	0.051000
49920.000000	0.051000
49980.000000	0.051000
50040.000000	0.051000
50100.000000	0.051000
50160.000000	0.051000
50220.000000	0.051000
50280.000000	0.051000
50340.000000	0.051000
50400.000000	0.051000
50460.000000	0.051000
50520.000000	0.051000
50580.000000	0.051000
50640.000000	0.051000
50700.000000	0.051000
50760.000000	0.051000
50820.000000	0.051000
50880.000000	0.051000
50940.000000	0.051000
51000.000000	0.051000
51060.000000	0.051000
51120.000000	0.051000
51180.000000	0.173000
51240.000000	0.173000
51300.000000	0.173000
51360.000000	0.173000
51420.000000	0.173000
51480.000000	0.173000
51540.000000	0.173000
51600.000000	0.173000
51660.000000	0.173000
51720.000000	0.173000
51780.000000	0.173000
51840.000000	0.173000
51900.000000	0.173000
51960.000000	0.173000
52020.000000	0.173000
52080.000000	0.173000
52140.000000	0.392000
52200.000000	0.392000
52260.000000	0.270000
52320.000000	0.270000
52380.000000	0.270000
52440.000000	0.270000
52500.000000	0.270000
52560.000000	0.270000
52620.000000	0.270000
52680.000000	0.270000
52740.000000	0.270000
52800.000000	0.270000
52860.000000	0.270000
52920.000000	0.270000
52980.000000	0.270000
53040.000000	0.270000
53100.000000	0.270000
53160.000000	0.270000
53220.000000	0.270000
53280.000000	0.270000
53340.000000	0.270000
53400.000000	0.270000
53460.000000	0.051000
53520.000000	0.051000
53580.000000	0.051000
53640.000000	0.051000
53700.000000	0.051000
53760.000000	0.051000
53820.000000	0.051000
53880.000000	0.051000
53940.000000	0.051000
54000.000000	0.051000
54060.000000	0.051000
54120.000000	0.193000
54180.000000	0.193000
54240.000000	0.193000
54300.000000	0.193000
54360.000000	0.193000
54420.000000	0.193000
54480.000000	0.193000
54540.000000	0.193000
54600.000000	0.193000
54660.000000	0.193000
54720.000000	0.193000
54780.000000	0.193000
54840.000000	0.193000
54900.000000	0.193000
54960.000000	0.193000
55020.000000	0.193000
55080.000000	0.193000
55140.000000	0.193000
55200.000000	0.193000
55260.000000	0.193000
55320.000000	0.173000
55380.000000	0.173000
55440.000000	0.173000
55500.000000	0.173000
55560.000000	0.173000
55620.000000	0.173000
55680.000000	0.173000
55740.000000	0.173000
55800.000000	0.173000
55860.000000	0.173000
55920.000000	0.173000
55980.000000	0.173000
56040.000000	0.173000
56100.000000	0.173000
56160.000000	0.173000
56220.000000	0.173000
56280.000000	0.173000
56340.000000	0.173000
56400.000000	0.051000
56460.000000	0.051000
56520.000000	0.051000
56580.000000	0.051000
56640.000000	0.051000
56700.000000	0.051000
56760.000000	0.051000
56820.000000	0.051000
56880.000000	0.051000
56940.000000	0.051000
57000.000000	0.051000
57060.000000	0.051000
57120.000000	0.051000
57180.000000	0.051000
57240.000000	0.051000
57300.000000	0.051000
57360.000000	0.051000
57420.000000	0.051000
57480.000000	0.051000
57540.000000	0.051000
57600.000000	0.051000
57660.000000	0.051000
57720.000000	0.051000
57780.000000	0.051000
57840.000000	0.193000
57900.000000	0.193000
57960.000000	0.193000
58020.000000	0.193000
58080.000000	0.193000
58140.000000	0.193000
58200.000000	0.193000
58260.000000	0.193000
58320.000000	0.193000
58380.000000	0.193000
58440.000000	0.193000
58500.000000	0.193000
58560.000000	0.193000
58620.000000	0.193000
58680.000000	0.193000
58740.000000	0.193000
58800.000000	0.193000
58860.000000	0.193000
58920.000000	0.193000
58980.000000	0.193000
59040.000000	0.051000
59100.000000	0.051000
59160.000000	0.051000
59220.000000	0.051000
59280.000000	0.051000
59340.000000	0.051000
59400.000000	0.051000
59460.000000	0.051000
59520.000000	0.051000
59580.000000	0.051000
59640.000000	0.051000
59700.000000	0.051000
59760.000000	0.051000
59820.000000	0.051000
59880.000000	0.051000
59940.000000	0.051000
60000.000000	0.051000
60060.000000	0.051000
60120.000000	0.051000
60180.000000	0.051000
60240.000000	0.051000
60300.000000	0.051000
60360.000000	0.051000
60420.000000	0.051000
60480.000000	0.051000
60540.000000	0.051000
60600.000000	0.051000
60660.000000	0.051000
60720.000000	0.270000
60780.000000	0.270000
60840.000000	0.270000
60900.000000	0.270000
60960.000000	0.270000
61020.000000	0.270000
61080.000000	0.270000
61140.000000	0.270000
61200.000000	0.270000
61260.000000	0.392000
61320.000000	0.392000
61380.000000	0.392000
61440.000000	0.392000
61500.000000	0.392000
61560.000000	0.392000
61620.000000	0.392000
61680.000000	0.392000
61740.000000	0.534000
61800.000000	0.534000
61860.000000	0.534000
61920.000000	0.534000
61980.000000	0.534000
62040.000000	0.315000
62100.000000	0.315000
62160.000000	0.315000
62220.000000	0.315000
62280.000000	0.315000
62340.000000	0.193000
62400.000000	0.193000
62460.000000	0.193000
62520.000000	0.193000
62580.000000	0.193000
62640.000000	0.193000
62700.000000	0.193000
62760.000000	0.193000
62820.000000	0.193000
62880.000000	0.193000
62940.000000	0.051000
63000.000000	0.051000
63060.000000	0.168000
63120.000000	0.168000
63180.000000	0.168000
63240.000000	0.168000
63300.000000	0.188000
63360.000000	0.188000
63420.000000	0.188000
63480.000000	0.209000
63540.000000	0.209000
63600.000000	0.209000
63660.000000	0.209000
63720.000000	0.188000
63780.000000	0.188000
63840.000000	0.188000
63900.000000	0.188000
63960.000000	0.238000
64020.000000	0.238000
64080.000000	0.238000
64140.000000	0.238000
64200.000000	0.238000
64260.000000	0.238000
64320.000000	0.238000
64380.000000	0.238000
64440.000000	0.238000
64500.000000	0.238000
64560.000000	0.238000
64620.000000	0.238000
64680.000000	0.238000
64740.000000	0.188000
64800.000000	0.188000
64860.000000	0.188000
64920.000000	0.188000
64980.000000	0.188000
65040.000000	0.188000
65100.000000	0.188000
65160.000000	0.188000
65220.000000	0.310000
65280.000000	0.310000
65340.000000	0.310000
65400.000000	0.310000
65460.000000	0.310000
65520.000000	0.310000
65580.000000	0.310000
65640.000000	0.310000
65700.000000	0.310000
65760.000000	0.310000
65820.000000	0.310000
65880.000000	0.310000
65940.000000	0.310000
66000.000000	0.310000
66060.000000	0.310000
66120.000000	0.395000
66180.000000	0.410000
66240.000000	0.629000
66300.000000	0.507000
66360.000000	0.507000
66420.000000	0.649000
66480.000000	0.649000
66540.000000	0.649000
66600.000000	0.649000
66660.000000	0.649000
66720.000000	0.649000
66780.000000	0.649000
66840.000000	0.649000
66900.000000	0.649000
66960.000000	0.649000
67020.000000	0.649000
67080.000000	0.649000
67140.000000	0.649000
67200.000000	0.661000
67260.000000	0.661000
67320.000000	0.718000
67380.000000	0.718000
67440.000000	0.718000
67500.000000	0.641000
67560.000000	0.410000
67620.000000	0.268000
67680.000000	0.171000
67740.000000	0.171000
67800.000000	0.171000
67860.000000	0.171000
67920.000000	2.049000
67980.000000	2.049000
68040.000000	2.049000
68100.000000	0.231000
68160.000000	0.231000
68220.000000	0.171000
68280.000000	0.231000
68340.000000	0.231000
68400.000000	0.231000
68460.000000	0.231000
68520.000000	0.231000
68580.000000	0.231000
68640.000000	0.231000
68700.000000	0.231000
68760.000000	0.171000
68820.000000	0.171000
68880.000000	0.171000
68940.000000	0.171000
69000.000000	0.192000
69060.000000	0.252000
69120.000000	0.252000
69180.000000	0.252000
69240.000000	0.352000
69300.000000	0.352000
69360.000000	0.352000
69420.000000	0.352000
69480.000000	0.352000
69540.000000	0.474000
69600.000000	0.474000
69660.000000	0.474000
69720.000000	0.474000
69780.000000	0.592000
69840.000000	0.592000
69900.000000	0.592000
69960.000000	0.592000
70020.000000	0.592000
70080.000000	0.592000
70140.000000	0.592000
70200.000000	0.811000
70260.000000	0.811000
70320.000000	0.811000
70380.000000	0.811000
70440.000000	0.914000
70500.000000	0.914000
70560.000000	0.899000
70620.000000	0.777000
70680.000000	0.692000
70740.000000	0.705000
70800.000000	0.705000
70860.000000	0.705000
70920.000000	0.645000
70980.000000	0.645000
71040.000000	0.645000
71100.000000	0.645000
71160.000000	0.645000
71220.000000	0.657000
71280.000000	0.657000
71340.000000	0.657000
71400.000000	0.657000
71460.000000	0.657000
71520.000000	0.438000
71580.000000	0.438000
71640.000000	0.438000
71700.000000	0.438000
71760.000000	0.438000
71820.000000	0.438000
71880.000000	0.438000
71940.000000	0.438000
72000.000000	0.555000
72060.000000	0.555000
72120.000000	0.555000
72180.000000	0.555000
72240.000000	0.555000
72300.000000	0.555000
72360.000000	0.555000
72420.000000	0.555000
72480.000000	0.555000
72540.000000	0.535000
72600.000000	0.535000
72660.000000	0.535000
72720.000000	0.535000
72780.000000	0.535000
72840.000000	0.595000
72900.000000	0.595000
72960.000000	0.595000
73020.000000	0.595000
73080.000000	0.595000
73140.000000	0.595000
73200.000000	0.595000
73260.000000	0.595000
73320.000000	0.645000
73380.000000	0.767000
73440.000000	0.767000
73500.000000	0.767000
73560.000000	0.767000
73620.000000	0.787000
73680.000000	0.787000
73740.000000	0.767000
73800.000000	0.767000
73860.000000	0.767000
73920.000000	0.787000
73980.000000	0.787000
74040.000000	0.787000
74100.000000	0.787000
74160.000000	0.787000
74220.000000	0.787000
74280.000000	0.787000
74340.000000	0.774000
74400.000000	0.774000
74460.000000	0.552000
74520.000000	0.552000
74580.000000	0.750000
74640.000000	0.750000
74700.000000	0.750000
74760.000000	0.633000
74820.000000	0.633000
74880.000000	0.775000
74940.000000	0.788000
75000.000000	0.788000
75060.000000	0.412000
75120.000000	0.412000
75180.000000	0.412000
75240.000000	0.412000
75300.000000	0.412000
75360.000000	0.412000
75420.000000	0.412000
75480.000000	0.412000
75540.000000	0.412000
75600.000000	0.412000
75660.000000	0.412000
75720.000000	0.412000
75780.000000	0.412000
75840.000000	0.412000
75900.000000	0.193000
75960.000000	0.193000
76020.000000	0.193000
76080.000000	0.051000
76140.000000	0.051000
76200.000000	0.051000
76260.000000	0.051000
76320.000000	0.051000
76380.000000	0.051000
76440.000000	0.051000
76500.000000	0.051000
76560.000000	0.051000
76620.000000	0.051000
76680.000000	0.051000
76740.000000	0.051000
76800.000000	0.051000
76860.000000	0.051000
76920.000000	0.051000
76980.000000	0.051000
77040.000000	0.051000
77100.000000	0.051000
77160.000000	0.051000
77220.000000	0.051000
77280.000000	0.051000
77340.000000	0.051000
77400.000000	0.051000
77460.000000	0.051000
77520.000000	0.051000
77580.000000	0.051000
77640.000000	0.051000
77700.000000	0.051000
77760.000000	0.051000
77820.000000	0.051000
77880.000000	0.051000
77940.000000	0.051000
78000.000000	0.051000
78060.000000	0.051000
78120.000000	0.051000
78180.000000	0.051000
78240.000000	0.051000
78300.000000	0.051000
78360.000000	0.051000
78420.000000	0.051000
78480.000000	0.051000
78540.000000	0.051000
78600.000000	0.051000
78660.000000	0.051000
78720.000000	0.270000
78780.000000	0.270000
78840.000000	0.270000
78900.000000	0.270000
78960.000000	0.270000
79020.000000	0.270000
79080.000000	0.270000
79140.000000	0.270000
79200.000000	0.412000
79260.000000	0.412000
79320.000000	0.412000
79380.000000	0.412000
79440.000000	0.412000
79500.000000	0.412000
79560.000000	0.412000
79620.000000	0.412000
79680.000000	0.412000
79740.000000	0.412000
79800.000000	0.412000
79860.000000	0.412000
79920.000000	0.412000
79980.000000	0.412000
80040.000000	0.193000
80100.000000	0.193000
80160.000000	0.193000
80220.000000	0.193000
80280.000000	0.193000
80340.000000	0.193000
80400.000000	0.051000
80460.000000	0.051000
80520.000000	0.051000
80580.000000	0.051000
80640.000000	0.051000
80700.000000	0.051000
80760.000000	0.051000
80820.000000	0.051000
80880.000000	0.051000
80940.000000	0.051000
81000.000000	0.051000
81060.000000	0.051000
81120.000000	0.051000
81180.000000	0.051000
81240.000000	0.051000
81300.000000	0.051000
81360.000000	0.051000
81420.000000	0.051000
81480.000000	0.173000
81540.000000	0.173000
81600.000000	0.173000
81660.000000	0.173000
81720.000000	0.173000
81780.000000	0.173000
81840.000000	0.173000
81900.000000	0.173000
81960.000000	0.173000
82020.000000	0.173000
82080.000000	0.173000
82140.000000	0.173000
82200.000000	0.173000
82260.000000	0.173000
82320.000000	0.173000
82380.000000	0.173000
82440.000000	0.173000
82500.000000	0.173000
82560.000000	0.051000
82620.000000	0.051000
82680.000000	0.051000
82740.000000	0.051000
82800.000000	0.051000
82860.000000	0.051000
82920.000000	0.051000
82980.000000	0.051000
83040.000000	0.051000
83100.000000	0.051000
83160.000000	0.051000
83220.000000	0.051000
83280.000000	0.051000
83340.000000	0.051000
83400.000000	0.270000
83460.000000	0.270000
83520.000000	0.270000
83580.000000	0.270000
83640.000000	0.270000
83700.000000	0.270000
83760.000000	0.412000
83820.000000	0.412000
83880.000000	0.412000
83940.000000	0.412000
84000.000000	0.412000
84060.000000	0.412000
84120.000000	0.412000
84180.000000	0.412000
84240.000000	0.412000
84300.000000	0.412000
84360.000000	0.412000
84420.000000	0.412000
84480.000000	0.412000
84540.000000	0.412000
84600.000000	0.412000
84660.000000	0.412000
84720.000000	0.193000
84780.000000	0.193000
84840.000000	0.193000
84900.000000	0.193000
84960.000000	0.051000
85020.000000	0.051000
85080.000000	0.051000
85140.000000	0.051000
85200.000000	0.173000
85260.000000	0.173000
85320.000000	0.173000
85380.000000	0.173000
85440.000000	0.173000
85500.000000	0.173000
85560.000000	0.173000
85620.000000	0.173000
85680.000000	0.173000
85740.000000	0.173000
85800.000000	0.173000
85860.000000	0.173000
85920.000000	0.173000
85980.000000	0.173000
86040.000000	0.173000
86100.000000	0.173000
86160.000000	0.173000
86220.000000	0.173000
86280.000000	0.051000
86340.000000	0.051000
86400.000000	0.051000
