#1
double LoadProfile(1440,2)
60.000000	0.055000
120.000000	0.055000
180.000000	0.055000
240.000000	0.055000
300.000000	0.055000
360.000000	0.055000
420.000000	0.055000
480.000000	0.055000
540.000000	0.055000
600.000000	0.055000
660.000000	0.055000
720.000000	0.055000
780.000000	0.055000
840.000000	0.055000
900.000000	0.055000
960.000000	0.055000
1020.000000	0.055000
1080.000000	0.055000
1140.000000	0.055000
1200.000000	0.055000
1260.000000	0.055000
1320.000000	0.055000
1380.000000	0.055000
1440.000000	0.055000
1500.000000	0.055000
1560.000000	0.055000
1620.000000	0.055000
1680.000000	0.055000
1740.000000	0.055000
1800.000000	0.055000
1860.000000	0.055000
1920.000000	0.055000
1980.000000	0.055000
2040.000000	0.055000
2100.000000	0.055000
2160.000000	0.055000
2220.000000	0.055000
2280.000000	0.055000
2340.000000	0.055000
2400.000000	0.055000
2460.000000	0.055000
2520.000000	0.055000
2580.000000	0.055000
2640.000000	0.055000
2700.000000	0.055000
2760.000000	0.055000
2820.000000	0.144000
2880.000000	0.144000
2940.000000	0.144000
3000.000000	0.144000
3060.000000	0.144000
3120.000000	0.144000
3180.000000	0.144000
3240.000000	0.144000
3300.000000	0.144000
3360.000000	0.144000
3420.000000	0.144000
3480.000000	0.144000
3540.000000	0.144000
3600.000000	0.144000
3660.000000	0.144000
3720.000000	0.144000
3780.000000	0.144000
3840.000000	0.144000
3900.000000	0.055000
3960.000000	0.055000
4020.000000	0.055000
4080.000000	0.055000
4140.000000	0.055000
4200.000000	0.055000
4260.000000	0.055000
4320.000000	0.055000
4380.000000	0.055000
4440.000000	0.055000
4500.000000	0.055000
4560.000000	0.055000
4620.000000	0.055000
4680.000000	0.055000
4740.000000	0.055000
4800.000000	0.055000
4860.000000	0.055000
4920.000000	0.055000
4980.000000	0.055000
5040.000000	0.055000
5100.000000	0.055000
5160.000000	0.055000
5220.000000	0.055000
5280.000000	0.055000
5340.000000	0.055000
5400.000000	0.055000
5460.000000	0.055000
5520.000000	0.055000
5580.000000	0.055000
5640.000000	0.055000
5700.000000	0.055000
5760.000000	0.055000
5820.000000	0.196000
5880.000000	0.196000
5940.000000	0.196000
6000.000000	0.196000
6060.000000	0.196000
6120.000000	0.196000
6180.000000	0.196000
6240.000000	0.196000
6300.000000	0.196000
6360.000000	0.196000
6420.000000	0.196000
6480.000000	0.196000
6540.000000	0.196000
6600.000000	0.196000
6660.000000	0.196000
6720.000000	0.196000
6780.000000	0.196000
6840.000000	0.196000
6900.000000	0.196000
6960.000000	0.196000
7020.000000	0.055000
7080.000000	0.055000
7140.000000	0.055000
7200.000000	0.055000
7260.000000	0.055000
7320.000000	0.055000
7380.000000	0.055000
7440.000000	0.055000
7500.000000	0.055000
7560.000000	0.055000
7620.000000	0.055000
7680.000000	0.055000
7740.000000	0.055000
7800.000000	0.055000
7860.000000	0.055000
7920.000000	0.055000
7980.000000	0.055000
8040.000000	0.055000
8100.000000	0.055000
8160.000000	0.055000
8220.000000	0.055000
8280.000000	0.055000
8340.000000	0.055000
8400.000000	0.055000
8460.000000	0.055000
8520.000000	0.055000
8580.000000	0.055000
8640.000000	0.055000
8700.000000	0.055000
8760.000000	0.055000
8820.000000	0.055000
8880.000000	0.055000
8940.000000	0.055000
9000.000000	0.055000
9060.000000	0.055000
9120.000000	0.055000
9180.000000	0.055000
9240.000000	0.055000
9300.000000	0.055000
9360.000000	0.055000
9420.000000	0.055000
9480.000000	0.055000
9540.000000	0.055000
9600.000000	0.055000
9660.000000	0.055000
9720.000000	0.055000
9780.000000	0.055000
9840.000000	0.055000
9900.000000	0.055000
9960.000000	0.055000
10020.000000	0.055000
10080.000000	0.055000
10140.000000	0.055000
10200.000000	0.055000
10260.000000	0.055000
10320.000000	0.055000
10380.000000	0.055000
10440.000000	0.055000
10500.000000	0.055000
10560.000000	0.055000
10620.000000	0.055000
10680.000000	0.055000
10740.000000	0.055000
10800.000000	0.055000
10860.000000	0.055000
10920.000000	0.055000
10980.000000	0.144000
11040.000000	0.144000
11100.000000	0.144000
11160.000000	0.144000
11220.000000	0.144000
11280.000000	0.144000
11340.000000	0.144000
11400.000000	0.144000
11460.000000	0.144000
11520.000000	0.144000
11580.000000	0.144000
11640.000000	0.144000
11700.000000	0.144000
11760.000000	0.144000
11820.000000	0.144000
11880.000000	0.144000
11940.000000	0.144000
12000.000000	0.144000
12060.000000	0.055000
12120.000000	0.055000
12180.000000	0.055000
12240.000000	0.055000
12300.000000	0.196000
12360.000000	0.196000
12420.000000	0.196000
12480.000000	0.196000
12540.000000	0.196000
12600.000000	0.196000
12660.000000	0.196000
12720.000000	0.196000
12780.000000	0.196000
12840.000000	0.196000
12900.000000	0.196000
12960.000000	0.196000
13020.000000	0.196000
13080.000000	0.196000
13140.000000	0.196000
13200.000000	0.196000
13260.000000	0.196000
13320.000000	0.196000
13380.000000	0.196000
13440.000000	0.196000
13500.000000	0.055000
13560.000000	0.055000
13620.000000	0.055000
13680.000000	0.055000
13740.000000	0.055000
13800.000000	0.055000
13860.000000	0.055000
13920.000000	0.055000
13980.000000	0.055000
14040.000000	0.055000
14100.000000	0.055000
14160.000000	0.055000
14220.000000	0.055000
14280.000000	0.055000
14340.000000	0.055000
14400.000000	0.055000
14460.000000	0.055000
14520.000000	0.055000
14580.000000	0.055000
14640.000000	0.055000
14700.000000	0.055000
14760.000000	0.055000
14820.000000	0.055000
14880.000000	0.055000
14940.000000	0.055000
15000.000000	0.055000
15060.000000	0.144000
15120.000000	0.144000
15180.000000	0.144000
15240.000000	0.144000
15300.000000	0.144000
15360.000000	0.144000
15420.000000	0.144000
15480.000000	0.144000
15540.000000	0.144000
15600.000000	0.144000
15660.000000	0.144000
15720.000000	0.144000
15780.000000	0.144000
15840.000000	0.144000
15900.000000	0.144000
15960.000000	0.144000
16020.000000	0.144000
16080.000000	0.144000
16140.000000	0.055000
16200.000000	0.055000
16260.000000	0.055000
16320.000000	0.055000
16380.000000	0.196000
16440.000000	0.196000
16500.000000	0.196000
16560.000000	0.196000
16620.000000	0.196000
16680.000000	0.196000
16740.000000	0.196000
16800.000000	0.196000
16860.000000	0.196000
16920.000000	0.196000
16980.000000	0.196000
17040.000000	0.196000
17100.000000	0.196000
17160.000000	0.196000
17220.000000	0.196000
17280.000000	0.196000
17340.000000	0.196000
17400.000000	0.196000
17460.000000	0.196000
17520.000000	0.196000
17580.000000	0.055000
17640.000000	0.055000
17700.000000	0.055000
17760.000000	0.055000
17820.000000	0.055000
17880.000000	0.055000
17940.000000	0.055000
18000.000000	0.055000
18060.000000	0.055000
18120.000000	0.055000
18180.000000	0.055000
18240.000000	0.055000
18300.000000	0.055000
18360.000000	0.055000
18420.000000	0.055000
18480.000000	0.055000
18540.000000	0.055000
18600.000000	0.055000
18660.000000	0.055000
18720.000000	0.055000
18780.000000	0.055000
18840.000000	0.055000
18900.000000	0.055000
18960.000000	0.055000
19020.000000	0.055000
19080.000000	0.055000
19140.000000	0.055000
19200.000000	0.055000
19260.000000	0.055000
19320.000000	0.055000
19380.000000	0.055000
19440.000000	0.055000
19500.000000	0.055000
19560.000000	0.055000
19620.000000	0.055000
19680.000000	0.055000
19740.000000	0.055000
19800.000000	0.055000
19860.000000	0.055000
19920.000000	0.055000
19980.000000	0.055000
20040.000000	0.055000
20100.000000	0.055000
20160.000000	0.055000
20220.000000	0.055000
20280.000000	0.055000
20340.000000	0.055000
20400.000000	0.055000
20460.000000	0.055000
20520.000000	0.055000
20580.000000	0.055000
20640.000000	0.055000
20700.000000	0.055000
20760.000000	0.055000
20820.000000	0.055000
20880.000000	0.055000
20940.000000	0.055000
21000.000000	0.055000
21060.000000	0.055000
21120.000000	0.055000
21180.000000	0.055000
21240.000000	0.055000
21300.000000	0.055000
21360.000000	0.055000
21420.000000	0.055000
21480.000000	0.055000
21540.000000	0.196000
21600.000000	0.285000
21660.000000	0.285000
21720.000000	0.285000
21780.000000	0.285000
21840.000000	0.285000
21900.000000	0.285000
21960.000000	0.285000
22020.000000	0.285000
22080.000000	0.285000
22140.000000	0.285000
22200.000000	0.285000
22260.000000	0.285000
22320.000000	0.285000
22380.000000	0.285000
22440.000000	0.285000
22500.000000	0.285000
22560.000000	0.285000
22620.000000	0.285000
22680.000000	0.196000
22740.000000	0.055000
22800.000000	0.055000
22860.000000	0.055000
22920.000000	0.055000
22980.000000	0.055000
23040.000000	0.055000
23100.000000	0.055000
23160.000000	0.055000
23220.000000	0.055000
23280.000000	0.055000
23340.000000	0.055000
23400.000000	0.055000
23460.000000	0.055000
23520.000000	0.055000
23580.000000	0.055000
23640.000000	0.055000
23700.000000	0.055000
23760.000000	0.055000
23820.000000	0.055000
23880.000000	0.055000
23940.000000	0.055000
24000.000000	0.055000
24060.000000	0.055000
24120.000000	0.055000
24180.000000	0.055000
24240.000000	0.055000
24300.000000	0.055000
24360.000000	0.055000
24420.000000	0.055000
24480.000000	0.055000
24540.000000	0.055000
24600.000000	0.055000
24660.000000	0.055000
24720.000000	0.055000
24780.000000	0.055000
24840.000000	0.055000
24900.000000	0.055000
24960.000000	0.055000
25020.000000	0.055000
25080.000000	0.055000
25140.000000	0.055000
25200.000000	0.055000
25260.000000	0.055000
25320.000000	0.055000
25380.000000	0.055000
25440.000000	0.055000
25500.000000	0.055000
25560.000000	0.055000
25620.000000	0.144000
25680.000000	0.144000
25740.000000	0.144000
25800.000000	0.144000
25860.000000	0.144000
25920.000000	0.144000
25980.000000	0.144000
26040.000000	0.144000
26100.000000	0.144000
26160.000000	0.144000
26220.000000	0.144000
26280.000000	0.144000
26340.000000	0.144000
26400.000000	0.144000
26460.000000	0.144000
26520.000000	0.285000
26580.000000	0.285000
26640.000000	0.285000
26700.000000	0.196000
26760.000000	0.196000
26820.000000	0.196000
26880.000000	0.196000
26940.000000	0.196000
27000.000000	0.196000
27060.000000	0.196000
27120.000000	0.196000
27180.000000	0.196000
27240.000000	0.196000
27300.000000	0.196000
27360.000000	0.196000
27420.000000	0.196000
27480.000000	0.196000
27540.000000	0.196000
27600.000000	0.196000
27660.000000	0.196000
27720.000000	0.055000
27780.000000	0.055000
27840.000000	0.055000
27900.000000	0.055000
27960.000000	0.055000
28020.000000	0.055000
28080.000000	0.055000
28140.000000	0.055000
28200.000000	0.055000
28260.000000	0.055000
28320.000000	0.055000
28380.000000	0.055000
28440.000000	0.055000
28500.000000	0.055000
28560.000000	0.055000
28620.000000	0.055000
28680.000000	0.055000
28740.000000	0.055000
28800.000000	0.055000
28860.000000	0.055000
28920.000000	0.055000
28980.000000	0.144000
29040.000000	0.144000
29100.000000	0.144000
29160.000000	0.144000
29220.000000	0.144000
29280.000000	0.144000
29340.000000	0.144000
29400.000000	0.144000
29460.000000	0.144000
29520.000000	0.144000
29580.000000	0.144000
29640.000000	0.144000
29700.000000	0.144000
29760.000000	0.144000
29820.000000	0.144000
29880.000000	0.144000
29940.000000	0.144000
30000.000000	0.144000
30060.000000	0.055000
30120.000000	0.055000
30180.000000	0.055000
30240.000000	0.055000
30300.000000	0.055000
30360.000000	0.055000
30420.000000	0.055000
30480.000000	0.055000
30540.000000	0.055000
30600.000000	0.055000
30660.000000	0.055000
30720.000000	0.055000
30780.000000	0.055000
30840.000000	0.055000
30900.000000	0.067000
30960.000000	0.067000
31020.000000	0.067000
31080.000000	0.067000
31140.000000	0.067000
31200.000000	0.067000
31260.000000	0.067000
31320.000000	0.067000
31380.000000	0.067000
31440.000000	0.067000
31500.000000	0.067000
31560.000000	0.067000
31620.000000	0.067000
31680.000000	0.067000
31740.000000	0.067000
31800.000000	0.067000
31860.000000	0.067000
31920.000000	0.067000
31980.000000	0.067000
32040.000000	0.067000
32100.000000	0.067000
32160.000000	0.067000
32220.000000	0.067000
32280.000000	0.067000
32340.000000	0.067000
32400.000000	0.067000
32460.000000	0.067000
32520.000000	0.067000
32580.000000	0.067000
32640.000000	0.067000
32700.000000	0.208000
32760.000000	0.208000
32820.000000	0.208000
32880.000000	0.208000
32940.000000	0.208000
33000.000000	0.208000
33060.000000	0.208000
33120.000000	0.208000
33180.000000	0.208000
33240.000000	0.208000
33300.000000	0.208000
33360.000000	0.208000
33420.000000	0.208000
33480.000000	0.208000
33540.000000	0.208000
33600.000000	0.208000
33660.000000	0.208000
33720.000000	0.208000
33780.000000	0.297000
33840.000000	0.297000
33900.000000	0.156000
33960.000000	0.156000
34020.000000	0.156000
34080.000000	0.156000
34140.000000	0.156000
34200.000000	0.156000
34260.000000	0.156000
34320.000000	0.156000
34380.000000	0.156000
34440.000000	0.156000
34500.000000	0.144000
34560.000000	0.144000
34620.000000	0.144000
34680.000000	0.144000
34740.000000	0.144000
34800.000000	0.144000
34860.000000	0.055000
34920.000000	0.055000
34980.000000	0.055000
35040.000000	0.055000
35100.000000	0.055000
35160.000000	0.055000
35220.000000	0.055000
35280.000000	0.055000
35340.000000	0.055000
35400.000000	0.055000
35460.000000	0.055000
35520.000000	0.055000
35580.000000	0.055000
35640.000000	2.032000
35700.000000	2.032000
35760.000000	2.032000
35820.000000	0.055000
35880.000000	0.055000
35940.000000	0.343000
36000.000000	0.355000
36060.000000	0.355000
36120.000000	0.355000
36180.000000	0.067000
36240.000000	0.067000
36300.000000	0.067000
36360.000000	0.067000
36420.000000	0.067000
36480.000000	0.067000
36540.000000	0.067000
36600.000000	0.067000
36660.000000	0.067000
36720.000000	0.067000
36780.000000	0.067000
36840.000000	0.067000
36900.000000	0.067000
36960.000000	0.067000
37020.000000	0.067000
37080.000000	2.044000
37140.000000	2.044000
37200.000000	2.044000
37260.000000	0.067000
37320.000000	0.067000
37380.000000	0.208000
37440.000000	0.208000
37500.000000	0.208000
37560.000000	0.208000
37620.000000	0.268000
37680.000000	0.268000
37740.000000	0.268000
37800.000000	0.268000
37860.000000	0.268000
37920.000000	0.268000
37980.000000	0.268000
38040.000000	0.268000
38100.000000	0.268000
38160.000000	0.268000
38220.000000	0.357000
38280.000000	0.357000
38340.000000	0.357000
38400.000000	0.357000
38460.000000	0.357000
38520.000000	0.357000
38580.000000	0.216000
38640.000000	0.216000
38700.000000	0.216000
38760.000000	0.216000
38820.000000	0.216000
38880.000000	0.216000
38940.000000	0.216000
39000.000000	0.216000
39060.000000	0.216000
39120.000000	0.216000
39180.000000	0.216000
39240.000000	0.216000
39300.000000	0.127000
39360.000000	0.127000
39420.000000	0.127000
39480.000000	0.067000
39540.000000	0.067000
39600.000000	0.055000
39660.000000	0.055000
39720.000000	0.055000
39780.000000	0.055000
39840.000000	0.055000
39900.000000	0.055000
39960.000000	0.055000
40020.000000	0.055000
40080.000000	0.055000
40140.000000	0.055000
40200.000000	0.055000
40260.000000	0.055000
40320.000000	0.055000
40380.000000	0.055000
40440.000000	0.055000
40500.000000	0.055000
40560.000000	0.055000
40620.000000	0.055000
40680.000000	0.055000
40740.000000	0.055000
40800.000000	0.055000
40860.000000	0.067000
40920.000000	0.067000
40980.000000	0.208000
41040.000000	0.208000
41100.000000	0.208000
41160.000000	0.208000
41220.000000	0.208000
41280.000000	0.208000
41340.000000	0.208000
41400.000000	0.208000
41460.000000	0.196000
41520.000000	0.196000
41580.000000	0.196000
41640.000000	0.196000
41700.000000	0.196000
41760.000000	0.196000
41820.000000	0.196000
41880.000000	0.196000
41940.000000	0.196000
42000.000000	0.196000
42060.000000	0.196000
42120.000000	0.196000
42180.000000	0.055000
42240.000000	0.055000
42300.000000	0.055000
42360.000000	0.055000
42420.000000	0.055000
42480.000000	0.055000
42540.000000	0.055000
42600.000000	0.055000
42660.000000	0.055000
42720.000000	0.055000
42780.000000	0.055000
42840.000000	0.055000
42900.000000	0.055000
42960.000000	0.055000
43020.000000	0.055000
43080.000000	0.055000
43140.000000	0.055000
43200.000000	0.055000
43260.000000	0.055000
43320.000000	0.055000
43380.000000	0.055000
43440.000000	0.055000
43500.000000	0.055000
43560.000000	0.055000
43620.000000	0.055000
43680.000000	0.055000
43740.000000	0.055000
43800.000000	0.055000
43860.000000	0.055000
43920.000000	0.055000
43980.000000	0.055000
44040.000000	0.055000
44100.000000	0.055000
44160.000000	0.055000
44220.000000	0.055000
44280.000000	0.055000
44340.000000	0.055000
44400.000000	0.055000
44460.000000	0.055000
44520.000000	0.055000
44580.000000	0.055000
44640.000000	0.055000
44700.000000	0.055000
44760.000000	0.055000
44820.000000	0.055000
44880.000000	0.055000
44940.000000	0.055000
45000.000000	0.055000
45060.000000	0.055000
45120.000000	0.055000
45180.000000	0.055000
45240.000000	0.055000
45300.000000	0.055000
45360.000000	0.055000
45420.000000	0.196000
45480.000000	0.196000
45540.000000	0.196000
45600.000000	0.196000
45660.000000	0.196000
45720.000000	0.196000
45780.000000	0.196000
45840.000000	0.196000
45900.000000	0.196000
45960.000000	0.196000
46020.000000	0.196000
46080.000000	0.196000
46140.000000	0.196000
46200.000000	0.196000
46260.000000	0.196000
46320.000000	0.196000
46380.000000	0.196000
46440.000000	0.196000
46500.000000	0.196000
46560.000000	0.196000
46620.000000	0.055000
46680.000000	0.055000
46740.000000	0.055000
46800.000000	0.055000
46860.000000	0.055000
46920.000000	0.055000
46980.000000	0.055000
47040.000000	0.055000
47100.000000	0.055000
47160.000000	0.055000
47220.000000	0.055000
47280.000000	0.055000
47340.000000	0.055000
47400.000000	0.144000
47460.000000	0.144000
47520.000000	0.144000
47580.000000	0.144000
47640.000000	0.144000
47700.000000	0.144000
47760.000000	0.144000
47820.000000	0.144000
47880.000000	0.144000
47940.000000	0.144000
48000.000000	0.144000
48060.000000	0.144000
48120.000000	0.144000
48180.000000	0.144000
48240.000000	0.144000
48300.000000	0.144000
48360.000000	0.144000
48420.000000	0.144000
48480.000000	0.055000
48540.000000	0.055000
48600.000000	0.055000
48660.000000	0.055000
48720.000000	0.055000
48780.000000	0.055000
48840.000000	0.055000
48900.000000	0.055000
48960.000000	0.055000
49020.000000	0.055000
49080.000000	0.055000
49140.000000	0.055000
49200.000000	0.055000
49260.000000	0.055000
49320.000000	0.055000
49380.000000	0.055000
49440.000000	0.055000
49500.000000	0.055000
49560.000000	0.055000
49620.000000	0.055000
49680.000000	0.055000
49740.000000	0.055000
49800.000000	0.055000
49860.000000	0.055000
49920.000000	0.055000
49980.000000	0.055000
50040.000000	0.196000
50100.000000	0.196000
50160.000000	0.196000
50220.000000	0.196000
50280.000000	0.196000
50340.000000	0.196000
50400.000000	0.196000
50460.000000	0.196000
50520.000000	0.196000
50580.000000	0.196000
50640.000000	0.196000
50700.000000	0.196000
50760.000000	0.285000
50820.000000	0.285000
50880.000000	0.285000
50940.000000	0.285000
51000.000000	0.285000
51060.000000	0.285000
51120.000000	0.285000
51180.000000	0.285000
51240.000000	0.144000
51300.000000	0.144000
51360.000000	0.144000
51420.000000	0.144000
51480.000000	0.144000
51540.000000	0.144000
51600.000000	0.144000
51660.000000	0.144000
51720.000000	0.144000
51780.000000	0.144000
51840.000000	0.055000
51900.000000	0.055000
51960.000000	0.055000
52020.000000	0.055000
52080.000000	0.055000
52140.000000	0.055000
52200.000000	0.055000
52260.000000	0.055000
52320.000000	0.055000
52380.000000	0.055000
52440.000000	0.055000
52500.000000	0.055000
52560.000000	0.055000
52620.000000	0.055000
52680.000000	0.055000
52740.000000	0.055000
52800.000000	0.055000
52860.000000	0.055000
52920.000000	0.055000
52980.000000	0.055000
53040.000000	0.055000
53100.000000	0.055000
53160.000000	0.055000
53220.000000	0.055000
53280.000000	0.055000
53340.000000	0.055000
53400.000000	0.055000
53460.000000	0.055000
53520.000000	0.055000
53580.000000	0.055000
53640.000000	0.055000
53700.000000	0.055000
53760.000000	0.055000
53820.000000	0.055000
53880.000000	0.055000
53940.000000	0.055000
54000.000000	0.055000
54060.000000	0.055000
54120.000000	0.055000
54180.000000	0.055000
54240.000000	0.055000
54300.000000	0.055000
54360.000000	0.055000
54420.000000	0.055000
54480.000000	0.055000
54540.000000	0.196000
54600.000000	0.196000
54660.000000	0.196000
54720.000000	0.196000
54780.000000	0.196000
54840.000000	0.196000
54900.000000	0.196000
54960.000000	0.196000
55020.000000	0.196000
55080.000000	0.196000
55140.000000	0.196000
55200.000000	0.196000
55260.000000	0.196000
55320.000000	0.196000
55380.000000	0.196000
55440.000000	0.285000
55500.000000	0.285000
55560.000000	0.285000
55620.000000	0.285000
55680.000000	0.285000
55740.000000	0.144000
55800.000000	0.144000
55860.000000	0.144000
55920.000000	0.144000
55980.000000	0.144000
56040.000000	0.144000
56100.000000	0.144000
56160.000000	0.144000
56220.000000	0.144000
56280.000000	0.144000
56340.000000	0.144000
56400.000000	0.144000
56460.000000	0.144000
56520.000000	0.055000
56580.000000	0.055000
56640.000000	0.055000
56700.000000	0.055000
56760.000000	0.055000
56820.000000	0.055000
56880.000000	0.055000
56940.000000	0.055000
57000.000000	0.055000
57060.000000	0.055000
57120.000000	0.055000
57180.000000	0.055000
57240.000000	0.055000
57300.000000	0.055000
57360.000000	0.055000
57420.000000	0.055000
57480.000000	0.055000
57540.000000	0.055000
57600.000000	0.055000
57660.000000	0.055000
57720.000000	0.055000
57780.000000	0.055000
57840.000000	0.055000
57900.000000	0.055000
57960.000000	0.055000
58020.000000	0.055000
58080.000000	0.055000
58140.000000	0.055000
58200.000000	0.055000
58260.000000	0.055000
58320.000000	0.055000
58380.000000	0.055000
58440.000000	0.055000
58500.000000	0.055000
58560.000000	0.055000
58620.000000	0.055000
58680.000000	0.055000
58740.000000	0.055000
58800.000000	0.055000
58860.000000	0.055000
58920.000000	0.055000
58980.000000	0.055000
59040.000000	0.055000
59100.000000	0.055000
59160.000000	0.055000
59220.000000	0.055000
59280.000000	0.055000
59340.000000	0.055000
59400.000000	0.055000
59460.000000	0.107000
59520.000000	0.226000
59580.000000	0.266000
59640.000000	0.266000
59700.000000	0.266000
59760.000000	0.266000
59820.000000	0.266000
59880.000000	0.266000
59940.000000	0.266000
60000.000000	0.266000
60060.000000	0.401000
60120.000000	0.355000
60180.000000	0.355000
60240.000000	0.355000
60300.000000	0.355000
60360.000000	0.405000
60420.000000	0.405000
60480.000000	0.465000
60540.000000	0.465000
60600.000000	0.465000
60660.000000	0.465000
60720.000000	0.465000
60780.000000	0.465000
60840.000000	0.465000
60900.000000	0.565000
60960.000000	0.565000
61020.000000	0.465000
61080.000000	0.465000
61140.000000	0.376000
61200.000000	0.376000
61260.000000	0.436000
61320.000000	0.436000
61380.000000	0.436000
61440.000000	0.376000
61500.000000	0.376000
61560.000000	0.376000
61620.000000	0.376000
61680.000000	0.376000
61740.000000	0.376000
61800.000000	0.486000
61860.000000	0.426000
61920.000000	0.326000
61980.000000	0.326000
62040.000000	0.326000
62100.000000	0.386000
62160.000000	0.386000
62220.000000	0.426000
62280.000000	0.526000
62340.000000	0.526000
62400.000000	0.426000
62460.000000	0.414000
62520.000000	0.514000
62580.000000	0.574000
62640.000000	0.574000
62700.000000	0.514000
62760.000000	0.655000
62820.000000	0.595000
62880.000000	0.595000
62940.000000	0.595000
63000.000000	0.595000
63060.000000	0.595000
63120.000000	0.595000
63180.000000	0.595000
63240.000000	0.595000
63300.000000	0.595000
63360.000000	0.685000
63420.000000	0.685000
63480.000000	0.685000
63540.000000	0.685000
63600.000000	0.685000
63660.000000	0.685000
63720.000000	0.685000
63780.000000	0.625000
63840.000000	0.725000
63900.000000	0.725000
63960.000000	0.584000
64020.000000	0.584000
64080.000000	0.619000
64140.000000	0.619000
64200.000000	0.679000
64260.000000	0.739000
64320.000000	0.739000
64380.000000	0.739000
64440.000000	0.619000
64500.000000	0.619000
64560.000000	0.619000
64620.000000	2.596000
64680.000000	2.654000
64740.000000	2.654000
64800.000000	0.677000
64860.000000	0.768000
64920.000000	0.768000
64980.000000	2.745000
65040.000000	2.745000
65100.000000	2.745000
65160.000000	0.768000
65220.000000	0.828000
65280.000000	0.828000
65340.000000	0.828000
65400.000000	0.828000
65460.000000	0.868000
65520.000000	0.868000
65580.000000	0.808000
65640.000000	0.808000
65700.000000	0.797000
65760.000000	0.797000
65820.000000	0.797000
65880.000000	0.797000
65940.000000	0.797000
66000.000000	0.797000
66060.000000	0.757000
66120.000000	0.857000
66180.000000	0.857000
66240.000000	0.857000
66300.000000	0.862000
66360.000000	0.822000
66420.000000	0.672000
66480.000000	0.622000
66540.000000	0.782000
66600.000000	0.742000
66660.000000	0.742000
66720.000000	0.742000
66780.000000	0.713000
66840.000000	0.713000
66900.000000	0.773000
66960.000000	0.773000
67020.000000	0.594000
67080.000000	0.594000
67140.000000	0.594000
67200.000000	0.735000
67260.000000	0.735000
67320.000000	0.735000
67380.000000	0.735000
67440.000000	0.775000
67500.000000	0.775000
67560.000000	0.775000
67620.000000	0.825000
67680.000000	0.825000
67740.000000	0.946000
67800.000000	0.756000
67860.000000	0.756000
67920.000000	0.756000
67980.000000	0.756000
68040.000000	0.796000
68100.000000	0.796000
68160.000000	0.796000
68220.000000	0.796000
68280.000000	0.796000
68340.000000	0.796000
68400.000000	0.655000
68460.000000	0.655000
68520.000000	0.655000
68580.000000	0.655000
68640.000000	0.655000
68700.000000	0.655000
68760.000000	0.655000
68820.000000	0.655000
68880.000000	0.655000
68940.000000	0.655000
69000.000000	0.544000
69060.000000	0.484000
69120.000000	0.484000
69180.000000	0.484000
69240.000000	0.424000
69300.000000	0.424000
69360.000000	0.384000
69420.000000	0.384000
69480.000000	0.384000
69540.000000	0.384000
69600.000000	0.384000
69660.000000	0.284000
69720.000000	0.284000
69780.000000	0.344000
69840.000000	0.344000
69900.000000	0.344000
69960.000000	0.344000
70020.000000	0.344000
70080.000000	0.344000
70140.000000	0.404000
70200.000000	0.404000
70260.000000	0.454000
70320.000000	0.454000
70380.000000	0.454000
70440.000000	0.454000
70500.000000	0.454000
70560.000000	0.394000
70620.000000	0.494000
70680.000000	0.613000
70740.000000	0.613000
70800.000000	0.613000
70860.000000	0.713000
70920.000000	0.713000
70980.000000	0.494000
71040.000000	0.494000
71100.000000	0.494000
71160.000000	0.494000
71220.000000	0.529000
71280.000000	0.494000
71340.000000	0.554000
71400.000000	0.494000
71460.000000	0.513000
71520.000000	0.513000
71580.000000	0.403000
71640.000000	0.403000
71700.000000	0.403000
71760.000000	0.403000
71820.000000	0.415000
71880.000000	0.415000
71940.000000	0.415000
72000.000000	0.415000
72060.000000	0.415000
72120.000000	0.415000
72180.000000	0.415000
72240.000000	0.415000
72300.000000	0.415000
72360.000000	0.403000
72420.000000	0.403000
72480.000000	0.413000
72540.000000	0.514000
72600.000000	0.544000
72660.000000	0.633000
72720.000000	0.633000
72780.000000	0.633000
72840.000000	0.633000
72900.000000	0.633000
72960.000000	0.673000
73020.000000	0.673000
73080.000000	0.673000
73140.000000	0.673000
73200.000000	0.784000
73260.000000	0.884000
73320.000000	0.884000
73380.000000	0.944000
73440.000000	0.944000
73500.000000	0.896000
73560.000000	0.896000
73620.000000	0.896000
73680.000000	0.896000
73740.000000	0.666000
73800.000000	0.666000
73860.000000	0.666000
73920.000000	0.666000
73980.000000	0.666000
74040.000000	0.666000
74100.000000	0.626000
74160.000000	0.626000
74220.000000	0.626000
74280.000000	0.626000
74340.000000	0.626000
74400.000000	0.626000
74460.000000	0.626000
74520.000000	0.626000
74580.000000	0.614000
74640.000000	0.614000
74700.000000	0.503000
74760.000000	0.503000
74820.000000	0.503000
74880.000000	0.503000
74940.000000	0.503000
75000.000000	0.503000
75060.000000	2.530000
75120.000000	2.530000
75180.000000	2.530000
75240.000000	0.553000
75300.000000	0.553000
75360.000000	0.553000
75420.000000	0.553000
75480.000000	2.530000
75540.000000	2.530000
75600.000000	2.530000
75660.000000	0.613000
75720.000000	0.613000
75780.000000	0.613000
75840.000000	0.613000
75900.000000	0.703000
75960.000000	0.663000
76020.000000	0.663000
76080.000000	0.653000
76140.000000	0.613000
76200.000000	0.613000
76260.000000	0.653000
76320.000000	0.653000
76380.000000	0.653000
76440.000000	0.742000
76500.000000	0.782000
76560.000000	0.782000
76620.000000	0.782000
76680.000000	0.782000
76740.000000	0.782000
76800.000000	0.782000
76860.000000	0.772000
76920.000000	0.772000
76980.000000	0.642000
77040.000000	0.642000
77100.000000	0.642000
77160.000000	0.596000
77220.000000	0.707000
77280.000000	0.657000
77340.000000	0.657000
77400.000000	0.798000
77460.000000	0.798000
77520.000000	0.709000
77580.000000	0.709000
77640.000000	0.709000
77700.000000	0.709000
77760.000000	0.709000
77820.000000	0.709000
77880.000000	0.757000
77940.000000	0.757000
78000.000000	0.757000
78060.000000	0.757000
78120.000000	0.857000
78180.000000	0.857000
78240.000000	0.857000
78300.000000	0.857000
78360.000000	0.867000
78420.000000	0.897000
78480.000000	0.778000
78540.000000	0.813000
78600.000000	0.386000
78660.000000	0.055000
78720.000000	0.055000
78780.000000	0.055000
78840.000000	0.055000
78900.000000	0.055000
78960.000000	0.055000
79020.000000	0.055000
79080.000000	0.055000
79140.000000	0.055000
79200.000000	0.055000
79260.000000	0.055000
79320.000000	0.055000
79380.000000	0.055000
79440.000000	0.055000
79500.000000	0.055000
79560.000000	0.055000
79620.000000	0.055000
79680.000000	0.055000
79740.000000	0.055000
79800.000000	0.055000
79860.000000	0.226000
79920.000000	0.226000
79980.000000	0.226000
80040.000000	0.226000
80100.000000	0.266000
80160.000000	0.266000
80220.000000	0.266000
80280.000000	0.266000
80340.000000	0.266000
80400.000000	0.266000
80460.000000	0.266000
80520.000000	0.266000
80580.000000	0.306000
80640.000000	0.266000
80700.000000	0.266000
80760.000000	0.326000
80820.000000	0.326000
80880.000000	0.476000
80940.000000	0.476000
81000.000000	0.617000
81060.000000	0.717000
81120.000000	0.717000
81180.000000	0.717000
81240.000000	0.717000
81300.000000	0.717000
81360.000000	0.717000
81420.000000	0.617000
81480.000000	0.667000
81540.000000	0.727000
81600.000000	0.727000
81660.000000	0.727000
81720.000000	0.787000
81780.000000	0.727000
81840.000000	0.777000
81900.000000	0.888000
81960.000000	0.888000
82020.000000	0.888000
82080.000000	0.988000
82140.000000	0.988000
82200.000000	0.847000
82260.000000	0.847000
82320.000000	0.847000
82380.000000	0.847000
82440.000000	0.847000
82500.000000	0.882000
82560.000000	0.882000
82620.000000	0.971000
82680.000000	0.936000
82740.000000	0.896000
82800.000000	0.896000
82860.000000	0.785000
82920.000000	0.785000
82980.000000	0.845000
83040.000000	0.845000
83100.000000	0.905000
83160.000000	0.805000
83220.000000	0.745000
83280.000000	0.745000
83340.000000	0.864000
83400.000000	0.864000
83460.000000	0.864000
83520.000000	0.864000
83580.000000	0.864000
83640.000000	0.864000
83700.000000	0.815000
83760.000000	0.927000
83820.000000	0.915000
83880.000000	0.915000
83940.000000	0.845000
84000.000000	0.815000
84060.000000	0.055000
84120.000000	0.055000
84180.000000	0.055000
84240.000000	0.055000
84300.000000	0.055000
84360.000000	0.055000
84420.000000	0.055000
84480.000000	0.055000
84540.000000	0.055000
84600.000000	0.055000
84660.000000	0.055000
84720.000000	0.055000
84780.000000	0.055000
84840.000000	0.055000
84900.000000	0.055000
84960.000000	0.055000
85020.000000	0.055000
85080.000000	0.055000
85140.000000	0.055000
85200.000000	0.055000
85260.000000	0.055000
85320.000000	0.055000
85380.000000	0.055000
85440.000000	0.055000
85500.000000	0.055000
85560.000000	0.055000
85620.000000	0.055000
85680.000000	0.055000
85740.000000	0.055000
85800.000000	0.055000
85860.000000	0.055000
85920.000000	0.055000
85980.000000	0.055000
86040.000000	0.055000
86100.000000	0.055000
86160.000000	0.055000
86220.000000	0.055000
86280.000000	0.055000
86340.000000	0.055000
86400.000000	0.055000
