#1
double LoadProfile(1440,2)
60.000000	0.049000
120.000000	0.049000
180.000000	0.049000
240.000000	0.049000
300.000000	0.049000
360.000000	0.049000
420.000000	0.049000
480.000000	0.049000
540.000000	0.049000
600.000000	0.049000
660.000000	0.049000
720.000000	0.049000
780.000000	0.049000
840.000000	0.049000
900.000000	0.049000
960.000000	0.049000
1020.000000	0.049000
1080.000000	0.049000
1140.000000	0.049000
1200.000000	0.049000
1260.000000	0.049000
1320.000000	0.049000
1380.000000	0.049000
1440.000000	0.049000
1500.000000	0.049000
1560.000000	0.049000
1620.000000	0.049000
1680.000000	0.049000
1740.000000	0.049000
1800.000000	0.049000
1860.000000	0.049000
1920.000000	0.049000
1980.000000	0.049000
2040.000000	0.049000
2100.000000	0.049000
2160.000000	0.049000
2220.000000	0.049000
2280.000000	0.049000
2340.000000	0.049000
2400.000000	0.049000
2460.000000	0.049000
2520.000000	0.049000
2580.000000	0.049000
2640.000000	0.049000
2700.000000	0.049000
2760.000000	0.049000
2820.000000	0.049000
2880.000000	0.049000
2940.000000	0.049000
3000.000000	0.049000
3060.000000	0.049000
3120.000000	0.049000
3180.000000	0.049000
3240.000000	0.049000
3300.000000	0.049000
3360.000000	0.049000
3420.000000	0.049000
3480.000000	0.049000
3540.000000	0.049000
3600.000000	0.049000
3660.000000	0.248000
3720.000000	0.248000
3780.000000	0.248000
3840.000000	0.248000
3900.000000	0.248000
3960.000000	0.248000
4020.000000	0.248000
4080.000000	0.248000
4140.000000	0.248000
4200.000000	0.248000
4260.000000	0.248000
4320.000000	0.248000
4380.000000	0.248000
4440.000000	0.248000
4500.000000	0.248000
4560.000000	0.248000
4620.000000	0.248000
4680.000000	0.248000
4740.000000	0.248000
4800.000000	0.248000
4860.000000	0.248000
4920.000000	0.248000
4980.000000	0.049000
5040.000000	0.049000
5100.000000	0.049000
5160.000000	0.049000
5220.000000	0.049000
5280.000000	0.049000
5340.000000	0.049000
5400.000000	0.049000
5460.000000	0.049000
5520.000000	0.049000
5580.000000	0.049000
5640.000000	0.049000
5700.000000	0.049000
5760.000000	0.049000
5820.000000	0.049000
5880.000000	0.049000
5940.000000	0.049000
6000.000000	0.049000
6060.000000	0.049000
6120.000000	0.049000
6180.000000	0.049000
6240.000000	0.049000
6300.000000	0.049000
6360.000000	0.049000
6420.000000	0.049000
6480.000000	0.049000
6540.000000	0.049000
6600.000000	0.049000
6660.000000	0.049000
6720.000000	0.049000
6780.000000	0.049000
6840.000000	0.049000
6900.000000	0.049000
6960.000000	0.049000
7020.000000	0.049000
7080.000000	0.049000
7140.000000	0.049000
7200.000000	0.049000
7260.000000	0.049000
7320.000000	0.049000
7380.000000	0.049000
7440.000000	0.049000
7500.000000	0.049000
7560.000000	0.049000
7620.000000	0.049000
7680.000000	0.049000
7740.000000	0.049000
7800.000000	0.049000
7860.000000	0.049000
7920.000000	0.049000
7980.000000	0.049000
8040.000000	0.049000
8100.000000	0.049000
8160.000000	0.049000
8220.000000	0.049000
8280.000000	0.049000
8340.000000	0.049000
8400.000000	0.049000
8460.000000	0.049000
8520.000000	0.049000
8580.000000	0.049000
8640.000000	0.049000
8700.000000	0.049000
8760.000000	0.049000
8820.000000	0.049000
8880.000000	0.049000
8940.000000	0.049000
9000.000000	0.049000
9060.000000	0.049000
9120.000000	0.049000
9180.000000	0.248000
9240.000000	0.248000
9300.000000	0.248000
9360.000000	0.248000
9420.000000	0.248000
9480.000000	0.248000
9540.000000	0.248000
9600.000000	0.248000
9660.000000	0.248000
9720.000000	0.248000
9780.000000	0.248000
9840.000000	0.248000
9900.000000	0.248000
9960.000000	0.248000
10020.000000	0.248000
10080.000000	0.248000
10140.000000	0.248000
10200.000000	0.248000
10260.000000	0.248000
10320.000000	0.248000
10380.000000	0.248000
10440.000000	0.248000
10500.000000	0.049000
10560.000000	0.049000
10620.000000	0.049000
10680.000000	0.049000
10740.000000	0.049000
10800.000000	0.049000
10860.000000	0.049000
10920.000000	0.049000
10980.000000	0.049000
11040.000000	0.049000
11100.000000	0.049000
11160.000000	0.049000
11220.000000	0.049000
11280.000000	0.049000
11340.000000	0.049000
11400.000000	0.049000
11460.000000	0.049000
11520.000000	0.049000
11580.000000	0.049000
11640.000000	0.049000
11700.000000	0.049000
11760.000000	0.049000
11820.000000	0.049000
11880.000000	0.049000
11940.000000	0.049000
12000.000000	0.049000
12060.000000	0.049000
12120.000000	0.049000
12180.000000	0.049000
12240.000000	0.049000
12300.000000	0.049000
12360.000000	0.049000
12420.000000	0.049000
12480.000000	0.049000
12540.000000	0.049000
12600.000000	0.049000
12660.000000	0.049000
12720.000000	0.049000
12780.000000	0.049000
12840.000000	0.049000
12900.000000	0.049000
12960.000000	0.049000
13020.000000	0.049000
13080.000000	0.049000
13140.000000	0.049000
13200.000000	0.049000
13260.000000	0.049000
13320.000000	0.049000
13380.000000	0.049000
13440.000000	0.049000
13500.000000	0.049000
13560.000000	0.248000
13620.000000	0.248000
13680.000000	0.248000
13740.000000	0.248000
13800.000000	0.248000
13860.000000	0.248000
13920.000000	0.248000
13980.000000	0.248000
14040.000000	0.248000
14100.000000	0.248000
14160.000000	0.248000
14220.000000	0.248000
14280.000000	0.248000
14340.000000	0.248000
14400.000000	0.248000
14460.000000	0.248000
14520.000000	0.248000
14580.000000	0.248000
14640.000000	0.248000
14700.000000	0.248000
14760.000000	0.248000
14820.000000	0.248000
14880.000000	0.049000
14940.000000	0.049000
15000.000000	0.049000
15060.000000	0.049000
15120.000000	0.049000
15180.000000	0.049000
15240.000000	0.049000
15300.000000	0.049000
15360.000000	0.049000
15420.000000	0.049000
15480.000000	0.049000
15540.000000	0.049000
15600.000000	0.049000
15660.000000	0.049000
15720.000000	0.049000
15780.000000	0.049000
15840.000000	0.049000
15900.000000	0.049000
15960.000000	0.049000
16020.000000	0.049000
16080.000000	0.049000
16140.000000	0.049000
16200.000000	0.049000
16260.000000	0.049000
16320.000000	0.049000
16380.000000	0.049000
16440.000000	0.049000
16500.000000	0.049000
16560.000000	0.049000
16620.000000	0.049000
16680.000000	0.049000
16740.000000	0.049000
16800.000000	0.049000
16860.000000	0.049000
16920.000000	0.049000
16980.000000	0.049000
17040.000000	0.049000
17100.000000	0.049000
17160.000000	0.049000
17220.000000	0.049000
17280.000000	0.049000
17340.000000	0.049000
17400.000000	0.049000
17460.000000	0.049000
17520.000000	0.049000
17580.000000	0.049000
17640.000000	0.049000
17700.000000	0.049000
17760.000000	0.049000
17820.000000	0.049000
17880.000000	0.049000
17940.000000	0.049000
18000.000000	0.049000
18060.000000	0.049000
18120.000000	0.049000
18180.000000	0.049000
18240.000000	0.248000
18300.000000	0.248000
18360.000000	0.248000
18420.000000	0.248000
18480.000000	0.248000
18540.000000	0.248000
18600.000000	0.248000
18660.000000	0.248000
18720.000000	0.248000
18780.000000	0.248000
18840.000000	0.248000
18900.000000	0.248000
18960.000000	0.248000
19020.000000	0.248000
19080.000000	0.248000
19140.000000	0.248000
19200.000000	0.248000
19260.000000	0.248000
19320.000000	0.248000
19380.000000	0.248000
19440.000000	0.248000
19500.000000	0.248000
19560.000000	0.049000
19620.000000	0.049000
19680.000000	0.049000
19740.000000	0.049000
19800.000000	0.049000
19860.000000	0.049000
19920.000000	0.049000
19980.000000	0.049000
20040.000000	0.049000
20100.000000	0.049000
20160.000000	0.049000
20220.000000	0.049000
20280.000000	0.049000
20340.000000	0.049000
20400.000000	0.049000
20460.000000	0.049000
20520.000000	0.049000
20580.000000	0.049000
20640.000000	0.049000
20700.000000	0.049000
20760.000000	0.049000
20820.000000	0.049000
20880.000000	0.049000
20940.000000	0.049000
21000.000000	0.049000
21060.000000	0.049000
21120.000000	0.049000
21180.000000	0.049000
21240.000000	0.049000
21300.000000	0.049000
21360.000000	0.049000
21420.000000	0.049000
21480.000000	0.049000
21540.000000	0.049000
21600.000000	0.049000
21660.000000	0.049000
21720.000000	0.049000
21780.000000	0.049000
21840.000000	0.049000
21900.000000	0.049000
21960.000000	0.049000
22020.000000	0.049000
22080.000000	0.049000
22140.000000	0.049000
22200.000000	0.049000
22260.000000	0.049000
22320.000000	0.049000
22380.000000	0.049000
22440.000000	0.049000
22500.000000	0.049000
22560.000000	0.049000
22620.000000	0.049000
22680.000000	0.049000
22740.000000	0.049000
22800.000000	0.049000
22860.000000	0.049000
22920.000000	0.049000
22980.000000	0.049000
23040.000000	0.049000
23100.000000	0.049000
23160.000000	0.049000
23220.000000	0.049000
23280.000000	0.049000
23340.000000	0.049000
23400.000000	0.049000
23460.000000	0.049000
23520.000000	0.049000
23580.000000	0.049000
23640.000000	0.049000
23700.000000	0.049000
23760.000000	0.049000
23820.000000	0.049000
23880.000000	0.049000
23940.000000	0.049000
24000.000000	0.049000
24060.000000	0.049000
24120.000000	0.049000
24180.000000	0.049000
24240.000000	0.248000
24300.000000	0.248000
24360.000000	0.248000
24420.000000	0.248000
24480.000000	0.248000
24540.000000	0.248000
24600.000000	0.248000
24660.000000	0.248000
24720.000000	0.248000
24780.000000	0.248000
24840.000000	0.248000
24900.000000	0.248000
24960.000000	0.248000
25020.000000	0.248000
25080.000000	0.248000
25140.000000	0.248000
25200.000000	0.248000
25260.000000	0.248000
25320.000000	0.248000
25380.000000	0.248000
25440.000000	0.248000
25500.000000	0.248000
25560.000000	0.049000
25620.000000	0.049000
25680.000000	0.049000
25740.000000	0.049000
25800.000000	0.049000
25860.000000	0.049000
25920.000000	0.049000
25980.000000	0.049000
26040.000000	0.049000
26100.000000	0.049000
26160.000000	0.049000
26220.000000	0.049000
26280.000000	0.049000
26340.000000	0.049000
26400.000000	0.049000
26460.000000	0.049000
26520.000000	0.049000
26580.000000	0.049000
26640.000000	0.049000
26700.000000	0.049000
26760.000000	0.049000
26820.000000	0.049000
26880.000000	0.049000
26940.000000	0.049000
27000.000000	0.049000
27060.000000	0.049000
27120.000000	0.049000
27180.000000	0.049000
27240.000000	0.049000
27300.000000	0.049000
27360.000000	0.049000
27420.000000	0.049000
27480.000000	0.049000
27540.000000	0.049000
27600.000000	0.049000
27660.000000	0.049000
27720.000000	0.049000
27780.000000	0.049000
27840.000000	0.049000
27900.000000	0.049000
27960.000000	0.049000
28020.000000	0.049000
28080.000000	0.049000
28140.000000	0.049000
28200.000000	0.049000
28260.000000	0.049000
28320.000000	0.248000
28380.000000	0.248000
28440.000000	0.248000
28500.000000	0.248000
28560.000000	0.248000
28620.000000	0.248000
28680.000000	0.248000
28740.000000	0.248000
28800.000000	0.248000
28860.000000	0.248000
28920.000000	0.248000
28980.000000	0.248000
29040.000000	0.248000
29100.000000	0.248000
29160.000000	0.248000
29220.000000	0.248000
29280.000000	0.248000
29340.000000	0.248000
29400.000000	0.248000
29460.000000	0.248000
29520.000000	0.248000
29580.000000	0.248000
29640.000000	0.049000
29700.000000	0.049000
29760.000000	0.049000
29820.000000	0.049000
29880.000000	0.049000
29940.000000	0.049000
30000.000000	0.049000
30060.000000	0.049000
30120.000000	0.049000
30180.000000	0.049000
30240.000000	0.049000
30300.000000	0.049000
30360.000000	0.049000
30420.000000	0.049000
30480.000000	0.049000
30540.000000	0.049000
30600.000000	0.049000
30660.000000	0.049000
30720.000000	0.049000
30780.000000	0.049000
30840.000000	0.049000
30900.000000	0.049000
30960.000000	0.049000
31020.000000	0.049000
31080.000000	0.049000
31140.000000	0.049000
31200.000000	0.049000
31260.000000	0.049000
31320.000000	0.049000
31380.000000	0.049000
31440.000000	0.049000
31500.000000	0.049000
31560.000000	0.049000
31620.000000	0.049000
31680.000000	0.049000
31740.000000	0.049000
31800.000000	0.049000
31860.000000	0.049000
31920.000000	0.049000
31980.000000	0.049000
32040.000000	0.049000
32100.000000	0.049000
32160.000000	0.049000
32220.000000	0.049000
32280.000000	0.248000
32340.000000	0.248000
32400.000000	0.248000
32460.000000	0.248000
32520.000000	0.248000
32580.000000	0.248000
32640.000000	0.248000
32700.000000	0.248000
32760.000000	0.248000
32820.000000	0.248000
32880.000000	0.248000
32940.000000	0.248000
33000.000000	0.248000
33060.000000	0.248000
33120.000000	0.248000
33180.000000	0.248000
33240.000000	0.248000
33300.000000	0.248000
33360.000000	0.248000
33420.000000	0.248000
33480.000000	0.248000
33540.000000	0.248000
33600.000000	0.049000
33660.000000	0.049000
33720.000000	0.049000
33780.000000	0.049000
33840.000000	0.049000
33900.000000	0.049000
33960.000000	0.049000
34020.000000	0.049000
34080.000000	0.049000
34140.000000	0.049000
34200.000000	0.049000
34260.000000	0.049000
34320.000000	0.049000
34380.000000	0.049000
34440.000000	0.049000
34500.000000	0.049000
34560.000000	0.049000
34620.000000	0.049000
34680.000000	0.049000
34740.000000	0.049000
34800.000000	0.049000
34860.000000	0.049000
34920.000000	0.049000
34980.000000	0.049000
35040.000000	0.049000
35100.000000	0.049000
35160.000000	0.049000
35220.000000	0.049000
35280.000000	0.049000
35340.000000	0.049000
35400.000000	0.049000
35460.000000	1.562000
35520.000000	1.562000
35580.000000	1.562000
35640.000000	0.049000
35700.000000	0.049000
35760.000000	0.049000
35820.000000	0.049000
35880.000000	0.049000
35940.000000	0.049000
36000.000000	0.049000
36060.000000	0.049000
36120.000000	0.049000
36180.000000	0.049000
36240.000000	0.049000
36300.000000	0.049000
36360.000000	0.049000
36420.000000	0.049000
36480.000000	0.049000
36540.000000	0.049000
36600.000000	0.049000
36660.000000	0.049000
36720.000000	0.049000
36780.000000	0.049000
36840.000000	0.049000
36900.000000	0.049000
36960.000000	0.049000
37020.000000	0.049000
37080.000000	0.049000
37140.000000	0.049000
37200.000000	0.049000
37260.000000	0.049000
37320.000000	0.049000
37380.000000	0.049000
37440.000000	0.049000
37500.000000	0.049000
37560.000000	0.049000
37620.000000	0.049000
37680.000000	0.049000
37740.000000	0.049000
37800.000000	0.049000
37860.000000	0.049000
37920.000000	0.049000
37980.000000	0.049000
38040.000000	0.049000
38100.000000	0.049000
38160.000000	0.248000
38220.000000	0.248000
38280.000000	0.248000
38340.000000	0.248000
38400.000000	0.248000
38460.000000	0.248000
38520.000000	0.248000
38580.000000	0.248000
38640.000000	0.248000
38700.000000	0.248000
38760.000000	0.248000
38820.000000	0.248000
38880.000000	0.248000
38940.000000	0.248000
39000.000000	0.248000
39060.000000	0.248000
39120.000000	0.248000
39180.000000	0.248000
39240.000000	0.248000
39300.000000	0.248000
39360.000000	0.248000
39420.000000	0.248000
39480.000000	0.049000
39540.000000	0.049000
39600.000000	0.049000
39660.000000	0.049000
39720.000000	0.049000
39780.000000	0.049000
39840.000000	0.049000
39900.000000	0.182000
39960.000000	0.182000
40020.000000	0.182000
40080.000000	0.182000
40140.000000	0.182000
40200.000000	0.182000
40260.000000	0.182000
40320.000000	0.182000
40380.000000	0.182000
40440.000000	0.182000
40500.000000	0.182000
40560.000000	0.182000
40620.000000	0.182000
40680.000000	0.182000
40740.000000	0.182000
40800.000000	0.182000
40860.000000	0.182000
40920.000000	0.182000
40980.000000	0.182000
41040.000000	0.182000
41100.000000	0.182000
41160.000000	0.182000
41220.000000	0.182000
41280.000000	0.182000
41340.000000	0.182000
41400.000000	0.182000
41460.000000	0.182000
41520.000000	0.182000
41580.000000	0.182000
41640.000000	0.182000
41700.000000	0.182000
41760.000000	0.182000
41820.000000	0.182000
41880.000000	0.182000
41940.000000	0.182000
42000.000000	0.182000
42060.000000	0.182000
42120.000000	0.182000
42180.000000	0.182000
42240.000000	0.182000
42300.000000	0.182000
42360.000000	0.182000
42420.000000	0.182000
42480.000000	0.182000
42540.000000	0.182000
42600.000000	0.182000
42660.000000	0.182000
42720.000000	2.253000
42780.000000	2.253000
42840.000000	2.253000
42900.000000	4.313000
42960.000000	4.313000
43020.000000	4.451000
43080.000000	4.451000
43140.000000	4.451000
43200.000000	4.451000
43260.000000	4.451000
43320.000000	4.650000
43380.000000	4.650000
43440.000000	4.665000
43500.000000	4.665000
43560.000000	4.665000
43620.000000	4.665000
43680.000000	4.665000
43740.000000	4.665000
43800.000000	4.665000
43860.000000	4.665000
43920.000000	2.594000
43980.000000	2.594000
44040.000000	2.922000
44100.000000	2.922000
44160.000000	2.922000
44220.000000	2.922000
44280.000000	2.594000
44340.000000	2.594000
44400.000000	2.594000
44460.000000	2.594000
44520.000000	2.594000
44580.000000	2.594000
44640.000000	2.395000
44700.000000	2.395000
44760.000000	2.395000
44820.000000	2.395000
44880.000000	2.395000
44940.000000	2.395000
45000.000000	2.395000
45060.000000	2.395000
45120.000000	2.395000
45180.000000	2.395000
45240.000000	2.395000
45300.000000	2.395000
45360.000000	2.395000
45420.000000	2.395000
45480.000000	2.395000
45540.000000	3.908000
45600.000000	3.908000
45660.000000	3.908000
45720.000000	2.395000
45780.000000	2.395000
45840.000000	2.395000
45900.000000	2.395000
45960.000000	2.395000
46020.000000	2.395000
46080.000000	2.395000
46140.000000	2.395000
46200.000000	2.395000
46260.000000	2.395000
46320.000000	2.395000
46380.000000	2.395000
46440.000000	2.395000
46500.000000	0.335000
46560.000000	0.335000
46620.000000	0.335000
46680.000000	0.335000
46740.000000	0.335000
46800.000000	0.335000
46860.000000	0.335000
46920.000000	0.335000
46980.000000	0.335000
47040.000000	0.320000
47100.000000	0.320000
47160.000000	0.320000
47220.000000	0.320000
47280.000000	0.320000
47340.000000	0.320000
47400.000000	0.320000
47460.000000	1.833000
47520.000000	1.833000
47580.000000	1.833000
47640.000000	1.833000
47700.000000	1.833000
47760.000000	1.833000
47820.000000	0.320000
47880.000000	0.320000
47940.000000	0.182000
48000.000000	0.182000
48060.000000	0.182000
48120.000000	0.182000
48180.000000	0.182000
48240.000000	0.182000
48300.000000	0.182000
48360.000000	0.182000
48420.000000	0.182000
48480.000000	0.381000
48540.000000	0.381000
48600.000000	0.381000
48660.000000	0.381000
48720.000000	2.713000
48780.000000	2.713000
48840.000000	2.713000
48900.000000	2.713000
48960.000000	2.713000
49020.000000	2.713000
49080.000000	2.713000
49140.000000	2.713000
49200.000000	4.226000
49260.000000	4.226000
49320.000000	4.226000
49380.000000	2.713000
49440.000000	2.713000
49500.000000	2.713000
49560.000000	2.713000
49620.000000	2.713000
49680.000000	2.713000
49740.000000	2.713000
49800.000000	2.514000
49860.000000	2.514000
49920.000000	2.514000
49980.000000	2.514000
50040.000000	2.514000
50100.000000	2.514000
50160.000000	2.514000
50220.000000	2.514000
50280.000000	2.514000
50340.000000	0.182000
50400.000000	0.182000
50460.000000	0.182000
50520.000000	0.182000
50580.000000	0.182000
50640.000000	0.182000
50700.000000	0.182000
50760.000000	0.182000
50820.000000	0.182000
50880.000000	0.182000
50940.000000	0.182000
51000.000000	0.182000
51060.000000	0.182000
51120.000000	0.182000
51180.000000	0.182000
51240.000000	0.182000
51300.000000	0.182000
51360.000000	0.182000
51420.000000	0.182000
51480.000000	0.182000
51540.000000	0.182000
51600.000000	0.182000
51660.000000	0.182000
51720.000000	0.182000
51780.000000	0.182000
51840.000000	0.182000
51900.000000	0.182000
51960.000000	0.182000
52020.000000	0.182000
52080.000000	0.320000
52140.000000	0.320000
52200.000000	0.320000
52260.000000	0.320000
52320.000000	2.769000
52380.000000	2.769000
52440.000000	2.769000
52500.000000	2.769000
52560.000000	2.769000
52620.000000	2.769000
52680.000000	2.769000
52740.000000	2.631000
52800.000000	2.631000
52860.000000	2.631000
52920.000000	2.631000
52980.000000	2.631000
53040.000000	2.691000
53100.000000	2.691000
53160.000000	2.691000
53220.000000	2.691000
53280.000000	0.242000
53340.000000	0.242000
53400.000000	0.242000
53460.000000	0.242000
53520.000000	0.242000
53580.000000	0.242000
53640.000000	0.441000
53700.000000	0.441000
53760.000000	0.441000
53820.000000	0.441000
53880.000000	0.441000
53940.000000	0.441000
54000.000000	0.441000
54060.000000	0.441000
54120.000000	0.441000
54180.000000	0.381000
54240.000000	0.381000
54300.000000	0.381000
54360.000000	1.894000
54420.000000	1.894000
54480.000000	1.894000
54540.000000	0.381000
54600.000000	0.381000
54660.000000	0.381000
54720.000000	0.381000
54780.000000	0.381000
54840.000000	0.381000
54900.000000	0.381000
54960.000000	0.182000
55020.000000	0.182000
55080.000000	0.182000
55140.000000	0.182000
55200.000000	0.182000
55260.000000	0.182000
55320.000000	0.197000
55380.000000	0.197000
55440.000000	0.197000
55500.000000	0.197000
55560.000000	0.197000
55620.000000	0.197000
55680.000000	0.197000
55740.000000	0.197000
55800.000000	0.197000
55860.000000	0.197000
55920.000000	0.197000
55980.000000	0.197000
56040.000000	0.197000
56100.000000	0.197000
56160.000000	0.197000
56220.000000	0.197000
56280.000000	0.197000
56340.000000	0.197000
56400.000000	0.197000
56460.000000	0.197000
56520.000000	0.197000
56580.000000	0.197000
56640.000000	0.297000
56700.000000	0.297000
56760.000000	0.297000
56820.000000	0.297000
56880.000000	0.297000
56940.000000	0.357000
57000.000000	0.257000
57060.000000	0.257000
57120.000000	0.257000
57180.000000	0.257000
57240.000000	0.257000
57300.000000	0.197000
57360.000000	0.197000
57420.000000	0.271000
57480.000000	0.409000
57540.000000	0.335000
57600.000000	0.387000
57660.000000	0.387000
57720.000000	0.387000
57780.000000	0.387000
57840.000000	0.387000
57900.000000	0.242000
57960.000000	0.242000
58020.000000	0.441000
58080.000000	0.517000
58140.000000	0.529000
58200.000000	0.589000
58260.000000	0.589000
58320.000000	0.649000
58380.000000	0.649000
58440.000000	0.649000
58500.000000	0.614000
58560.000000	0.476000
58620.000000	0.476000
58680.000000	0.476000
58740.000000	0.476000
58800.000000	0.526000
58860.000000	0.526000
58920.000000	0.511000
58980.000000	0.471000
59040.000000	0.471000
59100.000000	0.471000
59160.000000	0.421000
59220.000000	0.421000
59280.000000	0.409000
59340.000000	0.210000
59400.000000	0.270000
59460.000000	0.270000
59520.000000	0.210000
59580.000000	0.210000
59640.000000	0.222000
59700.000000	0.210000
59760.000000	0.270000
59820.000000	0.150000
59880.000000	0.150000
59940.000000	0.150000
60000.000000	0.150000
60060.000000	0.200000
60120.000000	0.200000
60180.000000	0.200000
60240.000000	0.200000
60300.000000	0.200000
60360.000000	0.200000
60420.000000	0.200000
60480.000000	0.200000
60540.000000	0.200000
60600.000000	0.200000
60660.000000	0.200000
60720.000000	0.235000
60780.000000	0.295000
60840.000000	0.260000
60900.000000	0.260000
60960.000000	0.260000
61020.000000	0.260000
61080.000000	0.260000
61140.000000	0.200000
61200.000000	0.200000
61260.000000	0.200000
61320.000000	0.260000
61380.000000	0.260000
61440.000000	0.200000
61500.000000	0.140000
61560.000000	0.140000
61620.000000	0.140000
61680.000000	0.140000
61740.000000	0.140000
61800.000000	0.200000
61860.000000	0.200000
61920.000000	0.140000
61980.000000	0.140000
62040.000000	0.339000
62100.000000	0.339000
62160.000000	0.339000
62220.000000	0.339000
62280.000000	0.339000
62340.000000	0.399000
62400.000000	0.399000
62460.000000	0.358000
62520.000000	0.358000
62580.000000	0.298000
62640.000000	0.398000
62700.000000	0.398000
62760.000000	0.398000
62820.000000	0.398000
62880.000000	0.398000
62940.000000	0.398000
63000.000000	0.398000
63060.000000	0.398000
63120.000000	0.398000
63180.000000	0.398000
63240.000000	0.298000
63300.000000	0.398000
63360.000000	0.199000
63420.000000	0.199000
63480.000000	0.199000
63540.000000	0.199000
63600.000000	0.199000
63660.000000	0.199000
63720.000000	0.199000
63780.000000	0.199000
63840.000000	0.199000
63900.000000	0.199000
63960.000000	0.099000
64020.000000	0.099000
64080.000000	0.099000
64140.000000	0.099000
64200.000000	0.099000
64260.000000	0.099000
64320.000000	0.149000
64380.000000	0.149000
64440.000000	0.157000
64500.000000	0.157000
64560.000000	0.157000
64620.000000	0.157000
64680.000000	0.157000
64740.000000	0.257000
64800.000000	0.257000
64860.000000	0.257000
64920.000000	0.357000
64980.000000	0.357000
65040.000000	0.257000
65100.000000	0.257000
65160.000000	0.257000
65220.000000	0.257000
65280.000000	0.257000
65340.000000	0.257000
65400.000000	0.257000
65460.000000	0.257000
65520.000000	0.267000
65580.000000	0.267000
65640.000000	0.267000
65700.000000	0.222000
65760.000000	0.222000
65820.000000	0.222000
65880.000000	0.222000
65940.000000	0.222000
66000.000000	0.222000
66060.000000	0.222000
66120.000000	0.222000
66180.000000	0.360000
66240.000000	0.360000
66300.000000	0.360000
66360.000000	0.360000
66420.000000	0.420000
66480.000000	0.420000
66540.000000	0.420000
66600.000000	0.494000
66660.000000	0.494000
66720.000000	0.494000
66780.000000	0.494000
66840.000000	0.494000
66900.000000	0.494000
66960.000000	0.529000
67020.000000	0.494000
67080.000000	0.494000
67140.000000	0.494000
67200.000000	0.494000
67260.000000	0.506000
67320.000000	0.506000
67380.000000	0.406000
67440.000000	0.406000
67500.000000	0.346000
67560.000000	0.358000
67620.000000	0.358000
67680.000000	0.358000
67740.000000	0.358000
67800.000000	0.358000
67860.000000	0.358000
67920.000000	0.358000
67980.000000	0.358000
68040.000000	0.358000
68100.000000	0.358000
68160.000000	0.418000
68220.000000	0.418000
68280.000000	0.418000
68340.000000	0.418000
68400.000000	0.418000
68460.000000	0.418000
68520.000000	0.418000
68580.000000	0.418000
68640.000000	0.418000
68700.000000	0.358000
68760.000000	0.358000
68820.000000	0.350000
68880.000000	0.350000
68940.000000	0.350000
69000.000000	0.410000
69060.000000	0.410000
69120.000000	0.410000
69180.000000	0.451000
69240.000000	0.511000
69300.000000	0.496000
69360.000000	0.444000
69420.000000	0.444000
69480.000000	0.494000
69540.000000	0.693000
69600.000000	0.693000
69660.000000	0.693000
69720.000000	0.693000
69780.000000	0.705000
69840.000000	0.693000
69900.000000	0.705000
69960.000000	0.693000
70020.000000	0.693000
70080.000000	0.693000
70140.000000	0.693000
70200.000000	0.753000
70260.000000	0.703000
70320.000000	0.703000
70380.000000	0.750000
70440.000000	0.750000
70500.000000	0.738000
70560.000000	0.750000
70620.000000	0.676000
70680.000000	0.676000
70740.000000	0.616000
70800.000000	0.676000
70860.000000	0.465000
70920.000000	0.405000
70980.000000	0.405000
71040.000000	0.370000
71100.000000	0.370000
71160.000000	0.370000
71220.000000	0.370000
71280.000000	0.430000
71340.000000	0.430000
71400.000000	0.430000
71460.000000	0.430000
71520.000000	0.490000
71580.000000	0.490000
71640.000000	0.490000
71700.000000	0.490000
71760.000000	0.490000
71820.000000	0.502000
71880.000000	0.442000
71940.000000	0.382000
72000.000000	0.382000
72060.000000	0.382000
72120.000000	0.382000
72180.000000	0.382000
72240.000000	0.358000
72300.000000	0.358000
72360.000000	0.358000
72420.000000	0.370000
72480.000000	0.370000
72540.000000	0.370000
72600.000000	0.232000
72660.000000	0.232000
72720.000000	0.232000
72780.000000	0.232000
72840.000000	0.232000
72900.000000	0.232000
72960.000000	0.232000
73020.000000	0.232000
73080.000000	0.282000
73140.000000	0.282000
73200.000000	0.282000
73260.000000	0.282000
73320.000000	0.282000
73380.000000	0.282000
73440.000000	0.282000
73500.000000	0.282000
73560.000000	0.241000
73620.000000	0.241000
73680.000000	0.379000
73740.000000	0.383000
73800.000000	0.383000
73860.000000	0.383000
73920.000000	0.383000
73980.000000	0.383000
74040.000000	0.333000
74100.000000	0.333000
74160.000000	0.333000
74220.000000	0.333000
74280.000000	0.333000
74340.000000	0.333000
74400.000000	0.333000
74460.000000	0.333000
74520.000000	0.381000
74580.000000	0.422000
74640.000000	0.522000
74700.000000	0.422000
74760.000000	0.410000
74820.000000	0.410000
74880.000000	0.410000
74940.000000	0.410000
75000.000000	0.410000
75060.000000	0.418000
75120.000000	0.418000
75180.000000	0.418000
75240.000000	0.418000
75300.000000	0.418000
75360.000000	0.418000
75420.000000	0.418000
75480.000000	0.280000
75540.000000	0.479000
75600.000000	0.479000
75660.000000	0.248000
75720.000000	0.248000
75780.000000	0.248000
75840.000000	0.248000
75900.000000	0.248000
75960.000000	0.248000
76020.000000	0.248000
76080.000000	0.248000
76140.000000	0.248000
76200.000000	0.248000
76260.000000	0.248000
76320.000000	0.248000
76380.000000	0.248000
76440.000000	0.248000
76500.000000	0.248000
76560.000000	0.248000
76620.000000	0.248000
76680.000000	0.248000
76740.000000	0.248000
76800.000000	0.248000
76860.000000	0.049000
76920.000000	0.049000
76980.000000	0.049000
77040.000000	0.049000
77100.000000	0.049000
77160.000000	0.049000
77220.000000	0.049000
77280.000000	0.049000
77340.000000	0.049000
77400.000000	0.049000
77460.000000	0.049000
77520.000000	0.049000
77580.000000	0.049000
77640.000000	0.049000
77700.000000	0.049000
77760.000000	0.049000
77820.000000	0.049000
77880.000000	0.049000
77940.000000	0.049000
78000.000000	0.049000
78060.000000	0.049000
78120.000000	0.049000
78180.000000	0.049000
78240.000000	0.049000
78300.000000	0.049000
78360.000000	0.049000
78420.000000	0.049000
78480.000000	0.049000
78540.000000	0.049000
78600.000000	0.049000
78660.000000	0.049000
78720.000000	0.049000
78780.000000	0.049000
78840.000000	0.049000
78900.000000	0.049000
78960.000000	0.049000
79020.000000	0.049000
79080.000000	0.049000
79140.000000	0.049000
79200.000000	0.049000
79260.000000	0.049000
79320.000000	0.049000
79380.000000	0.049000
79440.000000	0.049000
79500.000000	0.049000
79560.000000	0.248000
79620.000000	0.248000
79680.000000	0.248000
79740.000000	0.248000
79800.000000	0.248000
79860.000000	0.248000
79920.000000	0.248000
79980.000000	0.248000
80040.000000	0.248000
80100.000000	0.248000
80160.000000	0.248000
80220.000000	0.248000
80280.000000	0.248000
80340.000000	0.248000
80400.000000	0.248000
80460.000000	0.248000
80520.000000	0.248000
80580.000000	0.248000
80640.000000	0.248000
80700.000000	0.248000
80760.000000	0.248000
80820.000000	0.248000
80880.000000	0.049000
80940.000000	0.049000
81000.000000	0.049000
81060.000000	0.049000
81120.000000	0.049000
81180.000000	0.049000
81240.000000	0.049000
81300.000000	0.049000
81360.000000	0.049000
81420.000000	0.049000
81480.000000	0.049000
81540.000000	0.049000
81600.000000	0.049000
81660.000000	0.049000
81720.000000	0.049000
81780.000000	0.049000
81840.000000	0.049000
81900.000000	0.049000
81960.000000	0.049000
82020.000000	0.049000
82080.000000	0.049000
82140.000000	0.049000
82200.000000	0.049000
82260.000000	0.049000
82320.000000	0.049000
82380.000000	0.049000
82440.000000	0.049000
82500.000000	0.049000
82560.000000	0.049000
82620.000000	0.049000
82680.000000	0.049000
82740.000000	0.049000
82800.000000	0.049000
82860.000000	0.049000
82920.000000	0.049000
82980.000000	0.049000
83040.000000	0.049000
83100.000000	0.049000
83160.000000	0.049000
83220.000000	0.049000
83280.000000	0.049000
83340.000000	0.049000
83400.000000	0.049000
83460.000000	0.049000
83520.000000	0.049000
83580.000000	0.049000
83640.000000	0.049000
83700.000000	0.049000
83760.000000	0.049000
83820.000000	0.248000
83880.000000	0.248000
83940.000000	0.248000
84000.000000	0.248000
84060.000000	0.248000
84120.000000	0.248000
84180.000000	0.248000
84240.000000	0.248000
84300.000000	0.248000
84360.000000	0.248000
84420.000000	0.248000
84480.000000	0.248000
84540.000000	0.248000
84600.000000	0.248000
84660.000000	0.248000
84720.000000	0.248000
84780.000000	0.248000
84840.000000	0.248000
84900.000000	0.248000
84960.000000	0.248000
85020.000000	0.248000
85080.000000	0.248000
85140.000000	0.049000
85200.000000	0.049000
85260.000000	0.049000
85320.000000	0.049000
85380.000000	0.049000
85440.000000	0.049000
85500.000000	0.049000
85560.000000	0.049000
85620.000000	0.049000
85680.000000	0.049000
85740.000000	0.049000
85800.000000	0.049000
85860.000000	0.049000
85920.000000	0.049000
85980.000000	0.049000
86040.000000	0.049000
86100.000000	0.049000
86160.000000	0.049000
86220.000000	0.049000
86280.000000	0.049000
86340.000000	0.049000
86400.000000	0.049000
