#1
double LoadProfile(1440,2)
60.000000	0.045000
120.000000	0.045000
180.000000	0.045000
240.000000	0.045000
300.000000	0.045000
360.000000	0.045000
420.000000	0.045000
480.000000	0.045000
540.000000	0.045000
600.000000	0.045000
660.000000	0.045000
720.000000	0.045000
780.000000	0.045000
840.000000	0.045000
900.000000	0.045000
960.000000	0.045000
1020.000000	0.045000
1080.000000	0.045000
1140.000000	0.045000
1200.000000	0.045000
1260.000000	0.045000
1320.000000	0.045000
1380.000000	0.045000
1440.000000	0.045000
1500.000000	0.045000
1560.000000	0.045000
1620.000000	0.045000
1680.000000	0.045000
1740.000000	0.045000
1800.000000	0.045000
1860.000000	0.045000
1920.000000	0.045000
1980.000000	0.045000
2040.000000	0.045000
2100.000000	0.045000
2160.000000	0.045000
2220.000000	0.045000
2280.000000	0.045000
2340.000000	0.045000
2400.000000	0.045000
2460.000000	0.045000
2520.000000	0.045000
2580.000000	0.045000
2640.000000	0.045000
2700.000000	0.045000
2760.000000	0.045000
2820.000000	0.045000
2880.000000	0.045000
2940.000000	0.045000
3000.000000	0.045000
3060.000000	0.045000
3120.000000	0.045000
3180.000000	0.045000
3240.000000	0.045000
3300.000000	0.045000
3360.000000	0.045000
3420.000000	0.045000
3480.000000	0.045000
3540.000000	0.045000
3600.000000	0.045000
3660.000000	0.045000
3720.000000	0.045000
3780.000000	0.045000
3840.000000	0.045000
3900.000000	0.045000
3960.000000	0.045000
4020.000000	0.045000
4080.000000	0.045000
4140.000000	0.045000
4200.000000	0.045000
4260.000000	0.045000
4320.000000	0.045000
4380.000000	0.045000
4440.000000	0.045000
4500.000000	0.045000
4560.000000	0.045000
4620.000000	0.045000
4680.000000	0.045000
4740.000000	0.045000
4800.000000	0.045000
4860.000000	0.045000
4920.000000	0.045000
4980.000000	0.045000
5040.000000	0.045000
5100.000000	0.045000
5160.000000	0.045000
5220.000000	0.045000
5280.000000	0.045000
5340.000000	0.045000
5400.000000	0.045000
5460.000000	0.045000
5520.000000	0.045000
5580.000000	0.045000
5640.000000	0.045000
5700.000000	0.045000
5760.000000	0.045000
5820.000000	0.045000
5880.000000	0.045000
5940.000000	0.045000
6000.000000	0.045000
6060.000000	0.045000
6120.000000	0.045000
6180.000000	0.045000
6240.000000	0.045000
6300.000000	0.045000
6360.000000	0.045000
6420.000000	0.045000
6480.000000	0.045000
6540.000000	0.045000
6600.000000	0.045000
6660.000000	0.045000
6720.000000	0.045000
6780.000000	0.045000
6840.000000	0.045000
6900.000000	0.045000
6960.000000	0.045000
7020.000000	0.045000
7080.000000	0.045000
7140.000000	0.045000
7200.000000	0.045000
7260.000000	0.045000
7320.000000	0.045000
7380.000000	0.045000
7440.000000	0.045000
7500.000000	0.045000
7560.000000	0.045000
7620.000000	0.045000
7680.000000	0.045000
7740.000000	0.045000
7800.000000	0.045000
7860.000000	0.045000
7920.000000	0.045000
7980.000000	0.045000
8040.000000	0.045000
8100.000000	0.045000
8160.000000	0.045000
8220.000000	0.045000
8280.000000	0.045000
8340.000000	0.045000
8400.000000	0.045000
8460.000000	0.045000
8520.000000	0.045000
8580.000000	0.045000
8640.000000	0.045000
8700.000000	0.045000
8760.000000	0.045000
8820.000000	0.045000
8880.000000	0.045000
8940.000000	0.045000
9000.000000	0.045000
9060.000000	0.045000
9120.000000	0.045000
9180.000000	0.045000
9240.000000	0.045000
9300.000000	0.045000
9360.000000	0.045000
9420.000000	0.045000
9480.000000	0.045000
9540.000000	0.045000
9600.000000	0.045000
9660.000000	0.045000
9720.000000	0.045000
9780.000000	0.045000
9840.000000	0.045000
9900.000000	0.045000
9960.000000	0.045000
10020.000000	0.045000
10080.000000	0.045000
10140.000000	0.045000
10200.000000	0.045000
10260.000000	0.045000
10320.000000	0.045000
10380.000000	0.045000
10440.000000	0.045000
10500.000000	0.045000
10560.000000	0.045000
10620.000000	0.045000
10680.000000	0.045000
10740.000000	0.045000
10800.000000	0.045000
10860.000000	0.045000
10920.000000	0.045000
10980.000000	0.045000
11040.000000	0.045000
11100.000000	0.045000
11160.000000	0.045000
11220.000000	0.045000
11280.000000	0.045000
11340.000000	0.045000
11400.000000	0.045000
11460.000000	0.045000
11520.000000	0.045000
11580.000000	0.045000
11640.000000	0.045000
11700.000000	0.045000
11760.000000	0.045000
11820.000000	0.045000
11880.000000	0.045000
11940.000000	0.045000
12000.000000	0.045000
12060.000000	0.045000
12120.000000	0.045000
12180.000000	0.045000
12240.000000	0.045000
12300.000000	0.045000
12360.000000	0.045000
12420.000000	0.045000
12480.000000	0.045000
12540.000000	0.045000
12600.000000	0.045000
12660.000000	0.045000
12720.000000	0.045000
12780.000000	0.045000
12840.000000	0.045000
12900.000000	0.045000
12960.000000	0.045000
13020.000000	0.045000
13080.000000	0.045000
13140.000000	0.045000
13200.000000	0.045000
13260.000000	0.045000
13320.000000	0.045000
13380.000000	0.045000
13440.000000	0.045000
13500.000000	0.045000
13560.000000	0.045000
13620.000000	0.045000
13680.000000	0.045000
13740.000000	0.045000
13800.000000	0.045000
13860.000000	0.045000
13920.000000	0.045000
13980.000000	0.045000
14040.000000	0.045000
14100.000000	0.045000
14160.000000	0.045000
14220.000000	0.045000
14280.000000	0.045000
14340.000000	0.045000
14400.000000	0.045000
14460.000000	0.045000
14520.000000	0.045000
14580.000000	0.045000
14640.000000	0.045000
14700.000000	0.045000
14760.000000	0.045000
14820.000000	0.045000
14880.000000	0.045000
14940.000000	0.045000
15000.000000	0.045000
15060.000000	0.045000
15120.000000	0.045000
15180.000000	0.045000
15240.000000	0.045000
15300.000000	0.045000
15360.000000	0.045000
15420.000000	0.045000
15480.000000	0.045000
15540.000000	0.045000
15600.000000	0.045000
15660.000000	0.045000
15720.000000	0.045000
15780.000000	0.045000
15840.000000	0.045000
15900.000000	0.045000
15960.000000	0.045000
16020.000000	0.045000
16080.000000	0.045000
16140.000000	0.045000
16200.000000	0.045000
16260.000000	0.045000
16320.000000	0.045000
16380.000000	0.045000
16440.000000	0.045000
16500.000000	0.045000
16560.000000	0.045000
16620.000000	0.045000
16680.000000	0.045000
16740.000000	0.045000
16800.000000	0.045000
16860.000000	0.045000
16920.000000	0.045000
16980.000000	0.045000
17040.000000	0.045000
17100.000000	0.045000
17160.000000	0.045000
17220.000000	0.045000
17280.000000	0.045000
17340.000000	0.045000
17400.000000	0.045000
17460.000000	0.045000
17520.000000	0.045000
17580.000000	0.045000
17640.000000	0.045000
17700.000000	0.045000
17760.000000	0.045000
17820.000000	0.045000
17880.000000	0.045000
17940.000000	0.045000
18000.000000	0.045000
18060.000000	0.045000
18120.000000	0.045000
18180.000000	0.045000
18240.000000	0.045000
18300.000000	0.045000
18360.000000	0.045000
18420.000000	0.045000
18480.000000	0.045000
18540.000000	0.045000
18600.000000	0.045000
18660.000000	0.045000
18720.000000	0.045000
18780.000000	0.045000
18840.000000	0.045000
18900.000000	0.045000
18960.000000	0.045000
19020.000000	0.045000
19080.000000	0.045000
19140.000000	0.045000
19200.000000	0.045000
19260.000000	0.045000
19320.000000	0.045000
19380.000000	0.045000
19440.000000	0.045000
19500.000000	0.045000
19560.000000	0.045000
19620.000000	0.045000
19680.000000	0.045000
19740.000000	0.045000
19800.000000	0.045000
19860.000000	0.045000
19920.000000	0.045000
19980.000000	0.045000
20040.000000	0.045000
20100.000000	0.045000
20160.000000	0.045000
20220.000000	0.045000
20280.000000	0.045000
20340.000000	0.045000
20400.000000	0.045000
20460.000000	0.045000
20520.000000	0.045000
20580.000000	0.045000
20640.000000	0.045000
20700.000000	0.045000
20760.000000	0.045000
20820.000000	0.045000
20880.000000	0.045000
20940.000000	0.045000
21000.000000	0.045000
21060.000000	0.045000
21120.000000	0.045000
21180.000000	0.045000
21240.000000	0.045000
21300.000000	0.045000
21360.000000	0.045000
21420.000000	0.045000
21480.000000	0.045000
21540.000000	0.045000
21600.000000	0.045000
21660.000000	0.045000
21720.000000	0.045000
21780.000000	0.045000
21840.000000	0.045000
21900.000000	0.045000
21960.000000	0.045000
22020.000000	0.045000
22080.000000	0.045000
22140.000000	0.045000
22200.000000	0.045000
22260.000000	0.045000
22320.000000	0.045000
22380.000000	0.045000
22440.000000	0.045000
22500.000000	0.045000
22560.000000	0.045000
22620.000000	0.045000
22680.000000	0.045000
22740.000000	0.045000
22800.000000	0.045000
22860.000000	0.045000
22920.000000	0.045000
22980.000000	0.045000
23040.000000	0.045000
23100.000000	0.045000
23160.000000	0.045000
23220.000000	0.045000
23280.000000	0.045000
23340.000000	0.045000
23400.000000	0.045000
23460.000000	0.045000
23520.000000	0.045000
23580.000000	0.045000
23640.000000	0.045000
23700.000000	0.045000
23760.000000	0.045000
23820.000000	0.045000
23880.000000	0.045000
23940.000000	0.045000
24000.000000	0.045000
24060.000000	0.045000
24120.000000	0.045000
24180.000000	0.045000
24240.000000	0.045000
24300.000000	0.045000
24360.000000	0.045000
24420.000000	0.045000
24480.000000	0.045000
24540.000000	0.045000
24600.000000	0.045000
24660.000000	0.045000
24720.000000	0.045000
24780.000000	0.045000
24840.000000	0.045000
24900.000000	0.045000
24960.000000	0.045000
25020.000000	0.045000
25080.000000	0.045000
25140.000000	0.045000
25200.000000	0.045000
25260.000000	0.045000
25320.000000	0.045000
25380.000000	0.045000
25440.000000	0.045000
25500.000000	0.045000
25560.000000	0.045000
25620.000000	0.045000
25680.000000	0.045000
25740.000000	0.045000
25800.000000	0.045000
25860.000000	0.045000
25920.000000	0.045000
25980.000000	0.045000
26040.000000	0.045000
26100.000000	0.045000
26160.000000	0.045000
26220.000000	0.045000
26280.000000	0.045000
26340.000000	0.045000
26400.000000	0.045000
26460.000000	0.045000
26520.000000	0.045000
26580.000000	0.045000
26640.000000	0.045000
26700.000000	0.045000
26760.000000	0.045000
26820.000000	0.045000
26880.000000	0.045000
26940.000000	0.045000
27000.000000	0.045000
27060.000000	0.045000
27120.000000	0.045000
27180.000000	0.045000
27240.000000	0.045000
27300.000000	0.045000
27360.000000	0.045000
27420.000000	0.045000
27480.000000	0.045000
27540.000000	0.045000
27600.000000	0.045000
27660.000000	0.045000
27720.000000	0.045000
27780.000000	0.045000
27840.000000	0.045000
27900.000000	0.045000
27960.000000	0.045000
28020.000000	0.045000
28080.000000	0.045000
28140.000000	0.045000
28200.000000	0.045000
28260.000000	0.045000
28320.000000	0.045000
28380.000000	0.045000
28440.000000	0.045000
28500.000000	0.045000
28560.000000	0.045000
28620.000000	0.045000
28680.000000	0.045000
28740.000000	0.045000
28800.000000	0.045000
28860.000000	0.045000
28920.000000	0.045000
28980.000000	0.045000
29040.000000	0.045000
29100.000000	0.045000
29160.000000	0.045000
29220.000000	0.045000
29280.000000	0.045000
29340.000000	0.045000
29400.000000	0.045000
29460.000000	0.080000
29520.000000	0.080000
29580.000000	0.151000
29640.000000	0.151000
29700.000000	0.151000
29760.000000	0.151000
29820.000000	0.151000
29880.000000	0.151000
29940.000000	0.100000
30000.000000	0.100000
30060.000000	0.100000
30120.000000	0.089000
30180.000000	0.054000
30240.000000	0.054000
30300.000000	0.054000
30360.000000	0.054000
30420.000000	0.054000
30480.000000	0.054000
30540.000000	0.054000
30600.000000	0.054000
30660.000000	0.054000
30720.000000	0.054000
30780.000000	0.054000
30840.000000	0.054000
30900.000000	0.054000
30960.000000	0.054000
31020.000000	0.054000
31080.000000	0.089000
31140.000000	0.089000
31200.000000	0.089000
31260.000000	0.054000
31320.000000	2.455000
31380.000000	2.455000
31440.000000	2.455000
31500.000000	2.455000
31560.000000	2.455000
31620.000000	2.455000
31680.000000	2.455000
31740.000000	2.455000
31800.000000	2.455000
31860.000000	2.455000
31920.000000	2.455000
31980.000000	2.455000
32040.000000	2.455000
32100.000000	2.455000
32160.000000	2.455000
32220.000000	2.455000
32280.000000	2.455000
32340.000000	2.455000
32400.000000	3.461000
32460.000000	3.461000
32520.000000	3.461000
32580.000000	3.461000
32640.000000	3.461000
32700.000000	3.461000
32760.000000	3.461000
32820.000000	3.461000
32880.000000	3.461000
32940.000000	1.051000
33000.000000	1.051000
33060.000000	1.051000
33120.000000	1.051000
33180.000000	1.051000
33240.000000	1.051000
33300.000000	1.051000
33360.000000	1.063000
33420.000000	1.063000
33480.000000	1.063000
33540.000000	1.063000
33600.000000	1.063000
33660.000000	1.063000
33720.000000	1.063000
33780.000000	1.063000
33840.000000	1.063000
33900.000000	1.063000
33960.000000	1.063000
34020.000000	1.063000
34080.000000	1.063000
34140.000000	1.063000
34200.000000	1.063000
34260.000000	3.129000
34320.000000	3.129000
34380.000000	3.129000
34440.000000	1.063000
34500.000000	1.063000
34560.000000	1.063000
34620.000000	1.063000
34680.000000	1.063000
34740.000000	1.063000
34800.000000	1.063000
34860.000000	1.063000
34920.000000	1.063000
34980.000000	1.063000
35040.000000	1.063000
35100.000000	1.063000
35160.000000	1.063000
35220.000000	1.063000
35280.000000	1.063000
35340.000000	1.063000
35400.000000	1.063000
35460.000000	1.063000
35520.000000	1.063000
35580.000000	1.063000
35640.000000	1.063000
35700.000000	1.063000
35760.000000	1.063000
35820.000000	1.135000
35880.000000	1.135000
35940.000000	1.135000
36000.000000	0.129000
36060.000000	0.129000
36120.000000	0.129000
36180.000000	0.129000
36240.000000	0.129000
36300.000000	2.112000
36360.000000	2.112000
36420.000000	2.112000
36480.000000	2.112000
36540.000000	2.112000
36600.000000	2.112000
36660.000000	2.112000
36720.000000	2.112000
36780.000000	2.112000
36840.000000	2.112000
36900.000000	2.112000
36960.000000	2.112000
37020.000000	2.112000
37080.000000	2.112000
37140.000000	2.112000
37200.000000	2.112000
37260.000000	2.112000
37320.000000	2.112000
37380.000000	2.112000
37440.000000	2.112000
37500.000000	2.112000
37560.000000	0.129000
37620.000000	0.129000
37680.000000	0.129000
37740.000000	0.117000
37800.000000	0.117000
37860.000000	0.117000
37920.000000	0.117000
37980.000000	0.117000
38040.000000	0.117000
38100.000000	0.117000
38160.000000	0.117000
38220.000000	0.117000
38280.000000	0.117000
38340.000000	0.117000
38400.000000	0.117000
38460.000000	0.117000
38520.000000	0.117000
38580.000000	0.117000
38640.000000	0.117000
38700.000000	0.117000
38760.000000	0.117000
38820.000000	0.117000
38880.000000	0.117000
38940.000000	0.117000
39000.000000	0.117000
39060.000000	0.117000
39120.000000	0.117000
39180.000000	0.117000
39240.000000	0.117000
39300.000000	0.117000
39360.000000	0.117000
39420.000000	0.117000
39480.000000	0.117000
39540.000000	0.117000
39600.000000	0.117000
39660.000000	0.117000
39720.000000	0.117000
39780.000000	0.117000
39840.000000	0.117000
39900.000000	0.126000
39960.000000	0.126000
40020.000000	0.117000
40080.000000	0.117000
40140.000000	0.117000
40200.000000	0.117000
40260.000000	0.117000
40320.000000	0.117000
40380.000000	0.117000
40440.000000	0.117000
40500.000000	0.117000
40560.000000	0.117000
40620.000000	0.117000
40680.000000	0.117000
40740.000000	0.117000
40800.000000	0.117000
40860.000000	0.117000
40920.000000	0.117000
40980.000000	0.117000
41040.000000	0.117000
41100.000000	0.117000
41160.000000	0.188000
41220.000000	0.188000
41280.000000	0.188000
41340.000000	0.374000
41400.000000	0.374000
41460.000000	0.197000
41520.000000	0.257000
41580.000000	0.257000
41640.000000	0.257000
41700.000000	0.277000
41760.000000	0.277000
41820.000000	0.317000
41880.000000	0.317000
41940.000000	0.317000
42000.000000	0.436000
42060.000000	0.436000
42120.000000	0.613000
42180.000000	0.613000
42240.000000	0.436000
42300.000000	0.436000
42360.000000	0.436000
42420.000000	0.436000
42480.000000	0.448000
42540.000000	0.448000
42600.000000	0.448000
42660.000000	0.448000
42720.000000	0.388000
42780.000000	0.317000
42840.000000	0.297000
42900.000000	0.474000
42960.000000	0.474000
43020.000000	0.297000
43080.000000	0.297000
43140.000000	0.297000
43200.000000	0.297000
43260.000000	0.297000
43320.000000	2.707000
43380.000000	2.707000
43440.000000	2.707000
43500.000000	2.740000
43560.000000	2.740000
43620.000000	4.806000
43680.000000	4.983000
43740.000000	4.983000
43800.000000	3.195000
43860.000000	3.195000
43920.000000	3.195000
43980.000000	3.195000
44040.000000	3.195000
44100.000000	2.509000
44160.000000	2.509000
44220.000000	2.509000
44280.000000	2.509000
44340.000000	2.509000
44400.000000	2.500000
44460.000000	2.500000
44520.000000	2.500000
44580.000000	2.500000
44640.000000	2.500000
44700.000000	2.500000
44760.000000	2.500000
44820.000000	2.500000
44880.000000	2.500000
44940.000000	0.090000
45000.000000	0.090000
45060.000000	0.090000
45120.000000	0.090000
45180.000000	0.090000
45240.000000	0.090000
45300.000000	0.090000
45360.000000	0.090000
45420.000000	0.090000
45480.000000	0.090000
45540.000000	0.090000
45600.000000	0.090000
45660.000000	0.090000
45720.000000	0.090000
45780.000000	0.090000
45840.000000	0.090000
45900.000000	0.090000
45960.000000	0.090000
46020.000000	0.090000
46080.000000	0.209000
46140.000000	0.209000
46200.000000	0.209000
46260.000000	0.209000
46320.000000	0.209000
46380.000000	0.209000
46440.000000	0.209000
46500.000000	0.209000
46560.000000	0.244000
46620.000000	0.244000
46680.000000	0.244000
46740.000000	0.244000
46800.000000	0.244000
46860.000000	2.313000
46920.000000	2.313000
46980.000000	2.313000
47040.000000	0.247000
47100.000000	0.247000
47160.000000	0.247000
47220.000000	0.259000
47280.000000	0.259000
47340.000000	0.259000
47400.000000	0.259000
47460.000000	0.259000
47520.000000	0.259000
47580.000000	0.259000
47640.000000	0.259000
47700.000000	0.259000
47760.000000	0.259000
47820.000000	0.259000
47880.000000	0.226000
47940.000000	0.226000
48000.000000	0.191000
48060.000000	0.191000
48120.000000	0.191000
48180.000000	0.191000
48240.000000	0.072000
48300.000000	0.072000
48360.000000	0.072000
48420.000000	0.072000
48480.000000	0.072000
48540.000000	0.072000
48600.000000	0.072000
48660.000000	0.072000
48720.000000	0.072000
48780.000000	0.072000
48840.000000	0.072000
48900.000000	0.072000
48960.000000	0.072000
49020.000000	0.072000
49080.000000	0.072000
49140.000000	0.072000
49200.000000	0.072000
49260.000000	0.072000
49320.000000	0.072000
49380.000000	0.072000
49440.000000	0.072000
49500.000000	0.072000
49560.000000	0.072000
49620.000000	0.072000
49680.000000	0.072000
49740.000000	0.072000
49800.000000	0.072000
49860.000000	0.072000
49920.000000	0.072000
49980.000000	0.072000
50040.000000	0.072000
50100.000000	0.072000
50160.000000	0.072000
50220.000000	0.072000
50280.000000	0.132000
50340.000000	0.132000
50400.000000	0.132000
50460.000000	0.117000
50520.000000	0.117000
50580.000000	0.117000
50640.000000	0.117000
50700.000000	0.117000
50760.000000	0.117000
50820.000000	0.117000
50880.000000	0.057000
50940.000000	0.057000
51000.000000	0.057000
51060.000000	0.057000
51120.000000	0.057000
51180.000000	0.057000
51240.000000	0.057000
51300.000000	0.057000
51360.000000	0.057000
51420.000000	0.057000
51480.000000	0.057000
51540.000000	0.057000
51600.000000	0.045000
51660.000000	0.045000
51720.000000	0.045000
51780.000000	0.045000
51840.000000	0.045000
51900.000000	0.045000
51960.000000	0.045000
52020.000000	0.045000
52080.000000	0.045000
52140.000000	0.045000
52200.000000	0.045000
52260.000000	0.045000
52320.000000	0.045000
52380.000000	0.045000
52440.000000	0.045000
52500.000000	0.045000
52560.000000	0.045000
52620.000000	0.045000
52680.000000	0.045000
52740.000000	0.045000
52800.000000	2.111000
52860.000000	2.111000
52920.000000	2.111000
52980.000000	0.045000
53040.000000	0.045000
53100.000000	0.045000
53160.000000	0.045000
53220.000000	0.045000
53280.000000	0.045000
53340.000000	0.045000
53400.000000	0.045000
53460.000000	0.045000
53520.000000	0.045000
53580.000000	0.045000
53640.000000	0.045000
53700.000000	0.045000
53760.000000	0.045000
53820.000000	0.045000
53880.000000	0.045000
53940.000000	0.045000
54000.000000	0.045000
54060.000000	0.045000
54120.000000	0.045000
54180.000000	0.045000
54240.000000	0.045000
54300.000000	0.045000
54360.000000	0.045000
54420.000000	0.045000
54480.000000	0.045000
54540.000000	0.045000
54600.000000	0.045000
54660.000000	0.045000
54720.000000	0.045000
54780.000000	0.045000
54840.000000	0.045000
54900.000000	0.045000
54960.000000	0.045000
55020.000000	0.045000
55080.000000	0.045000
55140.000000	0.045000
55200.000000	0.045000
55260.000000	0.045000
55320.000000	0.045000
55380.000000	0.045000
55440.000000	0.045000
55500.000000	0.045000
55560.000000	0.045000
55620.000000	0.045000
55680.000000	0.045000
55740.000000	0.045000
55800.000000	0.045000
55860.000000	0.045000
55920.000000	0.045000
55980.000000	0.045000
56040.000000	0.045000
56100.000000	0.060000
56160.000000	0.060000
56220.000000	0.060000
56280.000000	0.060000
56340.000000	0.060000
56400.000000	0.060000
56460.000000	0.060000
56520.000000	0.060000
56580.000000	0.060000
56640.000000	0.060000
56700.000000	0.060000
56760.000000	0.060000
56820.000000	0.060000
56880.000000	0.060000
56940.000000	0.060000
57000.000000	0.060000
57060.000000	0.060000
57120.000000	0.060000
57180.000000	0.060000
57240.000000	0.060000
57300.000000	0.060000
57360.000000	0.060000
57420.000000	0.060000
57480.000000	0.060000
57540.000000	0.160000
57600.000000	0.160000
57660.000000	0.160000
57720.000000	0.160000
57780.000000	0.160000
57840.000000	0.160000
57900.000000	0.060000
57960.000000	0.060000
58020.000000	0.060000
58080.000000	0.060000
58140.000000	0.060000
58200.000000	0.060000
58260.000000	0.120000
58320.000000	0.120000
58380.000000	0.120000
58440.000000	0.129000
58500.000000	0.169000
58560.000000	0.304000
58620.000000	0.304000
58680.000000	0.255000
58740.000000	0.255000
58800.000000	0.295000
58860.000000	0.295000
58920.000000	0.295000
58980.000000	0.295000
59040.000000	0.295000
59100.000000	0.235000
59160.000000	0.235000
59220.000000	0.235000
59280.000000	0.235000
59340.000000	0.235000
59400.000000	0.235000
59460.000000	0.275000
59520.000000	0.275000
59580.000000	0.275000
59640.000000	0.320000
59700.000000	0.305000
59760.000000	2.371000
59820.000000	2.391000
59880.000000	2.411000
59940.000000	0.345000
60000.000000	0.325000
60060.000000	0.410000
60120.000000	0.410000
60180.000000	0.350000
60240.000000	0.350000
60300.000000	0.250000
60360.000000	0.250000
60420.000000	0.210000
60480.000000	0.210000
60540.000000	0.210000
60600.000000	0.210000
60660.000000	0.270000
60720.000000	0.270000
60780.000000	0.270000
60840.000000	0.270000
60900.000000	0.310000
60960.000000	0.210000
61020.000000	0.175000
61080.000000	0.175000
61140.000000	0.175000
61200.000000	0.175000
61260.000000	0.175000
61320.000000	0.175000
61380.000000	0.175000
61440.000000	0.175000
61500.000000	0.175000
61560.000000	0.175000
61620.000000	0.215000
61680.000000	0.175000
61740.000000	0.175000
61800.000000	0.175000
61860.000000	0.045000
61920.000000	0.045000
61980.000000	0.045000
62040.000000	0.045000
62100.000000	0.045000
62160.000000	0.045000
62220.000000	0.045000
62280.000000	0.045000
62340.000000	0.045000
62400.000000	0.045000
62460.000000	0.045000
62520.000000	0.045000
62580.000000	0.045000
62640.000000	0.045000
62700.000000	0.045000
62760.000000	0.045000
62820.000000	0.045000
62880.000000	0.045000
62940.000000	0.045000
63000.000000	0.045000
63060.000000	0.045000
63120.000000	0.045000
63180.000000	0.045000
63240.000000	0.045000
63300.000000	0.045000
63360.000000	0.045000
63420.000000	0.045000
63480.000000	0.045000
63540.000000	0.045000
63600.000000	0.045000
63660.000000	0.045000
63720.000000	0.045000
63780.000000	0.045000
63840.000000	0.045000
63900.000000	0.045000
63960.000000	0.045000
64020.000000	0.045000
64080.000000	0.045000
64140.000000	0.045000
64200.000000	0.045000
64260.000000	0.045000
64320.000000	0.045000
64380.000000	0.045000
64440.000000	0.045000
64500.000000	0.045000
64560.000000	0.045000
64620.000000	0.045000
64680.000000	0.045000
64740.000000	0.045000
64800.000000	0.045000
64860.000000	0.045000
64920.000000	0.045000
64980.000000	0.045000
65040.000000	0.045000
65100.000000	0.045000
65160.000000	0.045000
65220.000000	0.045000
65280.000000	0.045000
65340.000000	0.045000
65400.000000	0.045000
65460.000000	0.045000
65520.000000	0.045000
65580.000000	0.045000
65640.000000	0.045000
65700.000000	0.045000
65760.000000	0.045000
65820.000000	0.045000
65880.000000	0.045000
65940.000000	0.045000
66000.000000	0.045000
66060.000000	0.045000
66120.000000	0.045000
66180.000000	0.045000
66240.000000	0.045000
66300.000000	0.045000
66360.000000	0.045000
66420.000000	0.045000
66480.000000	0.045000
66540.000000	0.045000
66600.000000	0.045000
66660.000000	0.045000
66720.000000	0.045000
66780.000000	0.045000
66840.000000	0.045000
66900.000000	0.045000
66960.000000	0.045000
67020.000000	0.045000
67080.000000	0.045000
67140.000000	0.045000
67200.000000	0.045000
67260.000000	0.045000
67320.000000	0.045000
67380.000000	0.045000
67440.000000	0.045000
67500.000000	0.045000
67560.000000	0.045000
67620.000000	0.045000
67680.000000	0.045000
67740.000000	0.045000
67800.000000	0.045000
67860.000000	0.090000
67920.000000	0.090000
67980.000000	0.090000
68040.000000	0.090000
68100.000000	0.090000
68160.000000	0.090000
68220.000000	0.090000
68280.000000	0.090000
68340.000000	0.090000
68400.000000	0.090000
68460.000000	0.090000
68520.000000	0.090000
68580.000000	0.090000
68640.000000	0.090000
68700.000000	0.090000
68760.000000	0.090000
68820.000000	0.161000
68880.000000	0.161000
68940.000000	0.161000
69000.000000	0.161000
69060.000000	0.161000
69120.000000	0.161000
69180.000000	0.161000
69240.000000	0.161000
69300.000000	0.161000
69360.000000	0.161000
69420.000000	0.161000
69480.000000	0.161000
69540.000000	0.161000
69600.000000	0.161000
69660.000000	0.161000
69720.000000	0.161000
69780.000000	0.161000
69840.000000	0.161000
69900.000000	0.161000
69960.000000	0.176000
70020.000000	0.131000
70080.000000	1.387000
70140.000000	1.387000
70200.000000	1.387000
70260.000000	1.387000
70320.000000	1.387000
70380.000000	1.427000
70440.000000	1.427000
70500.000000	1.427000
70560.000000	1.427000
70620.000000	1.427000
70680.000000	1.427000
70740.000000	1.427000
70800.000000	1.427000
70860.000000	1.387000
70920.000000	1.427000
70980.000000	1.427000
71040.000000	1.356000
71100.000000	1.316000
71160.000000	1.356000
71220.000000	1.376000
71280.000000	1.336000
71340.000000	1.336000
71400.000000	1.336000
71460.000000	1.336000
71520.000000	1.336000
71580.000000	1.356000
71640.000000	1.475000
71700.000000	1.475000
71760.000000	1.475000
71820.000000	1.475000
71880.000000	0.304000
71940.000000	0.364000
72000.000000	0.364000
72060.000000	0.364000
72120.000000	0.364000
72180.000000	0.364000
72240.000000	0.364000
72300.000000	0.344000
72360.000000	0.344000
72420.000000	0.344000
72480.000000	0.344000
72540.000000	0.344000
72600.000000	0.344000
72660.000000	0.344000
72720.000000	0.344000
72780.000000	0.344000
72840.000000	0.344000
72900.000000	0.344000
72960.000000	0.344000
73020.000000	0.344000
73080.000000	0.344000
73140.000000	0.344000
73200.000000	0.344000
73260.000000	0.344000
73320.000000	0.344000
73380.000000	0.344000
73440.000000	0.344000
73500.000000	0.344000
73560.000000	0.329000
73620.000000	0.284000
73680.000000	0.284000
73740.000000	0.184000
73800.000000	0.184000
73860.000000	0.184000
73920.000000	0.184000
73980.000000	0.184000
74040.000000	0.184000
74100.000000	0.184000
74160.000000	0.184000
74220.000000	0.244000
74280.000000	0.244000
74340.000000	0.244000
74400.000000	0.244000
74460.000000	0.244000
74520.000000	0.244000
74580.000000	0.244000
74640.000000	0.256000
74700.000000	0.256000
74760.000000	0.256000
74820.000000	0.256000
74880.000000	0.256000
74940.000000	0.341000
75000.000000	0.341000
75060.000000	0.256000
75120.000000	2.322000
75180.000000	2.322000
75240.000000	2.322000
75300.000000	0.256000
75360.000000	0.291000
75420.000000	0.291000
75480.000000	0.265000
75540.000000	0.271000
75600.000000	0.271000
75660.000000	0.271000
75720.000000	0.271000
75780.000000	0.271000
75840.000000	0.271000
75900.000000	0.311000
75960.000000	0.311000
76020.000000	0.311000
76080.000000	0.311000
76140.000000	0.382000
76200.000000	0.382000
76260.000000	0.311000
76320.000000	0.311000
76380.000000	0.311000
76440.000000	0.311000
76500.000000	0.311000
76560.000000	0.311000
76620.000000	0.311000
76680.000000	0.311000
76740.000000	0.311000
76800.000000	0.344000
76860.000000	0.344000
76920.000000	0.344000
76980.000000	0.344000
77040.000000	0.344000
77100.000000	0.344000
77160.000000	0.344000
77220.000000	0.225000
77280.000000	0.225000
77340.000000	0.225000
77400.000000	0.225000
77460.000000	0.260000
77520.000000	0.300000
77580.000000	0.265000
77640.000000	0.265000
77700.000000	0.265000
77760.000000	0.325000
77820.000000	0.325000
77880.000000	0.325000
77940.000000	0.334000
78000.000000	0.334000
78060.000000	0.405000
78120.000000	0.405000
78180.000000	0.405000
78240.000000	0.356000
78300.000000	0.356000
78360.000000	0.356000
78420.000000	0.356000
78480.000000	0.356000
78540.000000	0.356000
78600.000000	0.356000
78660.000000	0.045000
78720.000000	0.045000
78780.000000	0.045000
78840.000000	0.045000
78900.000000	0.045000
78960.000000	0.045000
79020.000000	0.045000
79080.000000	0.045000
79140.000000	0.045000
79200.000000	0.045000
79260.000000	0.045000
79320.000000	0.045000
79380.000000	0.045000
79440.000000	0.045000
79500.000000	0.045000
79560.000000	0.045000
79620.000000	0.045000
79680.000000	0.045000
79740.000000	0.045000
79800.000000	0.045000
79860.000000	0.045000
79920.000000	0.045000
79980.000000	0.045000
80040.000000	0.045000
80100.000000	0.045000
80160.000000	0.045000
80220.000000	0.045000
80280.000000	0.045000
80340.000000	0.045000
80400.000000	0.045000
80460.000000	0.045000
80520.000000	0.045000
80580.000000	0.045000
80640.000000	0.045000
80700.000000	0.045000
80760.000000	0.045000
80820.000000	0.045000
80880.000000	0.045000
80940.000000	0.045000
81000.000000	0.045000
81060.000000	0.045000
81120.000000	0.045000
81180.000000	0.045000
81240.000000	0.045000
81300.000000	0.045000
81360.000000	0.045000
81420.000000	0.045000
81480.000000	0.045000
81540.000000	0.045000
81600.000000	0.045000
81660.000000	0.045000
81720.000000	0.045000
81780.000000	0.045000
81840.000000	0.045000
81900.000000	0.045000
81960.000000	0.045000
82020.000000	0.045000
82080.000000	0.045000
82140.000000	0.045000
82200.000000	0.045000
82260.000000	0.045000
82320.000000	0.045000
82380.000000	0.045000
82440.000000	0.045000
82500.000000	0.045000
82560.000000	0.045000
82620.000000	0.045000
82680.000000	0.045000
82740.000000	0.045000
82800.000000	0.045000
82860.000000	0.045000
82920.000000	0.045000
82980.000000	0.045000
83040.000000	0.045000
83100.000000	0.045000
83160.000000	0.045000
83220.000000	0.045000
83280.000000	0.045000
83340.000000	0.045000
83400.000000	0.045000
83460.000000	0.045000
83520.000000	0.045000
83580.000000	0.045000
83640.000000	0.045000
83700.000000	0.045000
83760.000000	0.045000
83820.000000	0.045000
83880.000000	0.045000
83940.000000	0.045000
84000.000000	0.045000
84060.000000	0.045000
84120.000000	0.045000
84180.000000	0.045000
84240.000000	0.045000
84300.000000	0.045000
84360.000000	0.045000
84420.000000	0.045000
84480.000000	0.045000
84540.000000	0.045000
84600.000000	0.045000
84660.000000	0.045000
84720.000000	0.045000
84780.000000	0.045000
84840.000000	0.045000
84900.000000	0.045000
84960.000000	0.045000
85020.000000	0.045000
85080.000000	0.045000
85140.000000	0.045000
85200.000000	0.045000
85260.000000	0.045000
85320.000000	0.045000
85380.000000	0.045000
85440.000000	0.045000
85500.000000	0.045000
85560.000000	0.045000
85620.000000	0.045000
85680.000000	0.045000
85740.000000	0.045000
85800.000000	0.045000
85860.000000	0.045000
85920.000000	0.045000
85980.000000	0.045000
86040.000000	0.045000
86100.000000	0.045000
86160.000000	0.045000
86220.000000	0.045000
86280.000000	0.045000
86340.000000	0.045000
86400.000000	0.045000
