#1
double LoadProfile(1440,2)
60.000000	0.054000
120.000000	0.054000
180.000000	0.054000
240.000000	0.054000
300.000000	0.054000
360.000000	0.054000
420.000000	0.054000
480.000000	0.054000
540.000000	0.054000
600.000000	0.054000
660.000000	0.054000
720.000000	0.054000
780.000000	0.054000
840.000000	0.054000
900.000000	0.054000
960.000000	0.054000
1020.000000	0.054000
1080.000000	0.054000
1140.000000	0.054000
1200.000000	0.054000
1260.000000	0.054000
1320.000000	0.054000
1380.000000	0.054000
1440.000000	0.054000
1500.000000	0.054000
1560.000000	0.054000
1620.000000	0.054000
1680.000000	0.054000
1740.000000	0.054000
1800.000000	0.054000
1860.000000	0.054000
1920.000000	0.054000
1980.000000	0.054000
2040.000000	0.054000
2100.000000	0.054000
2160.000000	0.054000
2220.000000	0.054000
2280.000000	0.054000
2340.000000	0.054000
2400.000000	0.054000
2460.000000	0.054000
2520.000000	0.054000
2580.000000	0.054000
2640.000000	0.054000
2700.000000	0.054000
2760.000000	0.054000
2820.000000	0.054000
2880.000000	0.054000
2940.000000	0.054000
3000.000000	0.054000
3060.000000	0.054000
3120.000000	0.054000
3180.000000	0.054000
3240.000000	0.054000
3300.000000	0.054000
3360.000000	0.054000
3420.000000	0.054000
3480.000000	0.054000
3540.000000	0.054000
3600.000000	0.054000
3660.000000	0.054000
3720.000000	0.054000
3780.000000	0.054000
3840.000000	0.054000
3900.000000	0.054000
3960.000000	0.054000
4020.000000	0.054000
4080.000000	0.054000
4140.000000	0.054000
4200.000000	0.054000
4260.000000	0.054000
4320.000000	0.054000
4380.000000	0.054000
4440.000000	0.054000
4500.000000	0.054000
4560.000000	0.054000
4620.000000	0.054000
4680.000000	0.054000
4740.000000	0.054000
4800.000000	0.054000
4860.000000	0.054000
4920.000000	0.054000
4980.000000	0.054000
5040.000000	0.054000
5100.000000	0.054000
5160.000000	0.054000
5220.000000	0.054000
5280.000000	0.054000
5340.000000	0.054000
5400.000000	0.054000
5460.000000	0.054000
5520.000000	0.054000
5580.000000	0.054000
5640.000000	0.054000
5700.000000	0.054000
5760.000000	0.054000
5820.000000	0.054000
5880.000000	0.054000
5940.000000	0.054000
6000.000000	0.054000
6060.000000	0.054000
6120.000000	0.054000
6180.000000	0.054000
6240.000000	0.054000
6300.000000	0.054000
6360.000000	0.054000
6420.000000	0.054000
6480.000000	0.054000
6540.000000	0.054000
6600.000000	0.054000
6660.000000	0.054000
6720.000000	0.054000
6780.000000	0.054000
6840.000000	0.054000
6900.000000	0.054000
6960.000000	0.054000
7020.000000	0.054000
7080.000000	0.054000
7140.000000	0.054000
7200.000000	0.054000
7260.000000	0.054000
7320.000000	0.054000
7380.000000	0.054000
7440.000000	0.054000
7500.000000	0.054000
7560.000000	0.054000
7620.000000	0.054000
7680.000000	0.054000
7740.000000	0.054000
7800.000000	0.054000
7860.000000	0.054000
7920.000000	0.054000
7980.000000	0.054000
8040.000000	0.054000
8100.000000	0.054000
8160.000000	0.054000
8220.000000	0.054000
8280.000000	0.054000
8340.000000	0.054000
8400.000000	0.054000
8460.000000	0.054000
8520.000000	0.054000
8580.000000	0.054000
8640.000000	0.054000
8700.000000	0.054000
8760.000000	0.054000
8820.000000	0.054000
8880.000000	0.054000
8940.000000	0.054000
9000.000000	0.054000
9060.000000	0.054000
9120.000000	0.054000
9180.000000	0.054000
9240.000000	0.054000
9300.000000	0.054000
9360.000000	0.054000
9420.000000	0.054000
9480.000000	0.054000
9540.000000	0.054000
9600.000000	0.054000
9660.000000	0.054000
9720.000000	0.054000
9780.000000	0.054000
9840.000000	0.054000
9900.000000	0.054000
9960.000000	0.054000
10020.000000	0.054000
10080.000000	0.054000
10140.000000	0.054000
10200.000000	0.054000
10260.000000	0.054000
10320.000000	0.054000
10380.000000	0.054000
10440.000000	0.054000
10500.000000	0.054000
10560.000000	0.054000
10620.000000	0.054000
10680.000000	0.054000
10740.000000	0.054000
10800.000000	0.054000
10860.000000	0.054000
10920.000000	0.054000
10980.000000	0.054000
11040.000000	0.054000
11100.000000	0.054000
11160.000000	0.054000
11220.000000	0.054000
11280.000000	0.054000
11340.000000	0.054000
11400.000000	0.054000
11460.000000	0.054000
11520.000000	0.054000
11580.000000	0.054000
11640.000000	0.054000
11700.000000	0.054000
11760.000000	0.054000
11820.000000	0.054000
11880.000000	0.054000
11940.000000	0.054000
12000.000000	0.054000
12060.000000	0.054000
12120.000000	0.054000
12180.000000	0.054000
12240.000000	0.054000
12300.000000	0.054000
12360.000000	0.054000
12420.000000	0.054000
12480.000000	0.054000
12540.000000	0.054000
12600.000000	0.054000
12660.000000	0.054000
12720.000000	0.054000
12780.000000	0.054000
12840.000000	0.054000
12900.000000	0.054000
12960.000000	0.054000
13020.000000	0.054000
13080.000000	0.054000
13140.000000	0.054000
13200.000000	0.054000
13260.000000	0.054000
13320.000000	0.054000
13380.000000	0.054000
13440.000000	0.054000
13500.000000	0.054000
13560.000000	0.054000
13620.000000	0.054000
13680.000000	0.054000
13740.000000	0.054000
13800.000000	0.054000
13860.000000	0.054000
13920.000000	0.054000
13980.000000	0.054000
14040.000000	0.054000
14100.000000	0.054000
14160.000000	0.054000
14220.000000	0.054000
14280.000000	0.054000
14340.000000	0.054000
14400.000000	0.054000
14460.000000	0.054000
14520.000000	0.054000
14580.000000	0.054000
14640.000000	0.054000
14700.000000	0.054000
14760.000000	0.054000
14820.000000	0.054000
14880.000000	0.054000
14940.000000	0.054000
15000.000000	0.054000
15060.000000	0.054000
15120.000000	0.054000
15180.000000	0.054000
15240.000000	0.054000
15300.000000	0.054000
15360.000000	0.054000
15420.000000	0.054000
15480.000000	0.054000
15540.000000	0.054000
15600.000000	0.054000
15660.000000	0.054000
15720.000000	0.054000
15780.000000	0.054000
15840.000000	0.054000
15900.000000	0.054000
15960.000000	0.054000
16020.000000	0.054000
16080.000000	0.054000
16140.000000	0.054000
16200.000000	0.054000
16260.000000	0.054000
16320.000000	0.054000
16380.000000	0.054000
16440.000000	0.054000
16500.000000	0.054000
16560.000000	0.054000
16620.000000	0.054000
16680.000000	0.054000
16740.000000	0.054000
16800.000000	0.054000
16860.000000	0.054000
16920.000000	0.054000
16980.000000	0.054000
17040.000000	0.054000
17100.000000	0.054000
17160.000000	0.054000
17220.000000	0.054000
17280.000000	0.054000
17340.000000	0.054000
17400.000000	0.054000
17460.000000	0.054000
17520.000000	0.054000
17580.000000	0.054000
17640.000000	0.054000
17700.000000	0.054000
17760.000000	0.054000
17820.000000	0.054000
17880.000000	0.054000
17940.000000	0.054000
18000.000000	0.054000
18060.000000	0.054000
18120.000000	0.054000
18180.000000	0.054000
18240.000000	0.054000
18300.000000	0.054000
18360.000000	0.054000
18420.000000	0.054000
18480.000000	0.054000
18540.000000	0.054000
18600.000000	0.054000
18660.000000	0.054000
18720.000000	0.054000
18780.000000	0.054000
18840.000000	0.054000
18900.000000	0.054000
18960.000000	0.054000
19020.000000	0.054000
19080.000000	0.054000
19140.000000	0.054000
19200.000000	0.054000
19260.000000	0.054000
19320.000000	0.054000
19380.000000	0.054000
19440.000000	0.054000
19500.000000	0.054000
19560.000000	0.054000
19620.000000	0.054000
19680.000000	0.054000
19740.000000	0.054000
19800.000000	0.054000
19860.000000	0.054000
19920.000000	0.054000
19980.000000	0.054000
20040.000000	0.054000
20100.000000	0.054000
20160.000000	0.054000
20220.000000	0.054000
20280.000000	0.054000
20340.000000	0.054000
20400.000000	0.054000
20460.000000	0.054000
20520.000000	0.054000
20580.000000	0.054000
20640.000000	0.054000
20700.000000	0.054000
20760.000000	0.054000
20820.000000	0.054000
20880.000000	0.054000
20940.000000	0.054000
21000.000000	0.054000
21060.000000	0.054000
21120.000000	0.054000
21180.000000	0.054000
21240.000000	0.054000
21300.000000	0.054000
21360.000000	0.054000
21420.000000	0.054000
21480.000000	0.054000
21540.000000	0.054000
21600.000000	0.054000
21660.000000	0.054000
21720.000000	0.054000
21780.000000	0.054000
21840.000000	0.054000
21900.000000	0.054000
21960.000000	0.054000
22020.000000	0.054000
22080.000000	0.054000
22140.000000	0.054000
22200.000000	0.054000
22260.000000	0.054000
22320.000000	0.054000
22380.000000	0.054000
22440.000000	0.054000
22500.000000	0.054000
22560.000000	0.054000
22620.000000	0.054000
22680.000000	0.054000
22740.000000	0.054000
22800.000000	0.054000
22860.000000	0.054000
22920.000000	0.054000
22980.000000	0.054000
23040.000000	0.054000
23100.000000	0.054000
23160.000000	0.054000
23220.000000	0.054000
23280.000000	0.054000
23340.000000	0.054000
23400.000000	0.054000
23460.000000	0.054000
23520.000000	0.054000
23580.000000	0.054000
23640.000000	0.054000
23700.000000	0.054000
23760.000000	0.054000
23820.000000	0.054000
23880.000000	0.054000
23940.000000	0.054000
24000.000000	0.054000
24060.000000	0.054000
24120.000000	0.054000
24180.000000	0.054000
24240.000000	0.054000
24300.000000	0.054000
24360.000000	0.054000
24420.000000	0.054000
24480.000000	0.054000
24540.000000	0.054000
24600.000000	0.054000
24660.000000	0.054000
24720.000000	0.054000
24780.000000	0.054000
24840.000000	0.054000
24900.000000	0.054000
24960.000000	0.054000
25020.000000	0.054000
25080.000000	0.054000
25140.000000	0.054000
25200.000000	0.054000
25260.000000	0.054000
25320.000000	0.054000
25380.000000	0.054000
25440.000000	0.114000
25500.000000	0.114000
25560.000000	0.054000
25620.000000	0.054000
25680.000000	0.054000
25740.000000	0.054000
25800.000000	0.054000
25860.000000	0.054000
25920.000000	0.054000
25980.000000	0.244000
26040.000000	0.184000
26100.000000	0.054000
26160.000000	0.054000
26220.000000	0.054000
26280.000000	0.054000
26340.000000	0.368000
26400.000000	2.526000
26460.000000	2.526000
26520.000000	2.586000
26580.000000	0.214000
26640.000000	0.154000
26700.000000	0.244000
26760.000000	0.244000
26820.000000	0.154000
26880.000000	0.154000
26940.000000	0.154000
27000.000000	0.154000
27060.000000	0.154000
27120.000000	0.154000
27180.000000	0.114000
27240.000000	0.114000
27300.000000	0.114000
27360.000000	0.114000
27420.000000	0.114000
27480.000000	0.114000
27540.000000	0.114000
27600.000000	0.114000
27660.000000	0.114000
27720.000000	0.114000
27780.000000	0.114000
27840.000000	0.114000
27900.000000	0.114000
27960.000000	0.114000
28020.000000	2.172000
28080.000000	2.172000
28140.000000	2.172000
28200.000000	0.114000
28260.000000	0.114000
28320.000000	0.114000
28380.000000	0.114000
28440.000000	0.114000
28500.000000	0.114000
28560.000000	0.114000
28620.000000	0.114000
28680.000000	0.114000
28740.000000	0.114000
28800.000000	0.114000
28860.000000	0.114000
28920.000000	0.114000
28980.000000	0.114000
29040.000000	0.114000
29100.000000	0.114000
29160.000000	8.308000
29220.000000	8.308000
29280.000000	8.308000
29340.000000	0.114000
29400.000000	0.114000
29460.000000	0.114000
29520.000000	0.114000
29580.000000	0.174000
29640.000000	0.174000
29700.000000	0.174000
29760.000000	0.114000
29820.000000	0.174000
29880.000000	0.114000
29940.000000	0.114000
30000.000000	0.114000
30060.000000	0.114000
30120.000000	0.114000
30180.000000	0.114000
30240.000000	0.114000
30300.000000	0.114000
30360.000000	0.114000
30420.000000	0.114000
30480.000000	0.114000
30540.000000	0.114000
30600.000000	0.114000
30660.000000	0.114000
30720.000000	0.114000
30780.000000	0.114000
30840.000000	0.114000
30900.000000	0.114000
30960.000000	0.114000
31020.000000	0.114000
31080.000000	0.114000
31140.000000	0.114000
31200.000000	0.114000
31260.000000	0.114000
31320.000000	0.114000
31380.000000	0.114000
31440.000000	0.114000
31500.000000	0.114000
31560.000000	0.114000
31620.000000	0.114000
31680.000000	0.114000
31740.000000	0.114000
31800.000000	0.114000
31860.000000	0.114000
31920.000000	0.114000
31980.000000	0.114000
32040.000000	0.114000
32100.000000	0.114000
32160.000000	0.114000
32220.000000	0.114000
32280.000000	0.114000
32340.000000	0.114000
32400.000000	0.114000
32460.000000	0.114000
32520.000000	0.114000
32580.000000	0.114000
32640.000000	0.114000
32700.000000	0.114000
32760.000000	0.114000
32820.000000	0.114000
32880.000000	0.114000
32940.000000	0.114000
33000.000000	0.114000
33060.000000	0.114000
33120.000000	0.114000
33180.000000	0.114000
33240.000000	0.114000
33300.000000	0.114000
33360.000000	0.114000
33420.000000	0.114000
33480.000000	0.114000
33540.000000	0.114000
33600.000000	0.114000
33660.000000	0.114000
33720.000000	0.114000
33780.000000	0.114000
33840.000000	0.114000
33900.000000	0.114000
33960.000000	0.114000
34020.000000	0.114000
34080.000000	0.114000
34140.000000	0.114000
34200.000000	0.114000
34260.000000	0.114000
34320.000000	0.114000
34380.000000	0.114000
34440.000000	0.114000
34500.000000	0.114000
34560.000000	0.114000
34620.000000	0.114000
34680.000000	0.114000
34740.000000	0.114000
34800.000000	0.154000
34860.000000	0.154000
34920.000000	0.154000
34980.000000	0.194000
35040.000000	0.194000
35100.000000	0.194000
35160.000000	0.194000
35220.000000	0.194000
35280.000000	0.194000
35340.000000	0.194000
35400.000000	0.194000
35460.000000	0.194000
35520.000000	0.361000
35580.000000	0.361000
35640.000000	0.361000
35700.000000	0.361000
35760.000000	0.361000
35820.000000	0.361000
35880.000000	0.361000
35940.000000	0.361000
36000.000000	0.361000
36060.000000	0.054000
36120.000000	0.054000
36180.000000	0.054000
36240.000000	0.054000
36300.000000	0.054000
36360.000000	0.054000
36420.000000	0.054000
36480.000000	0.054000
36540.000000	0.054000
36600.000000	0.054000
36660.000000	0.054000
36720.000000	0.054000
36780.000000	0.054000
36840.000000	0.054000
36900.000000	0.054000
36960.000000	0.054000
37020.000000	0.054000
37080.000000	0.054000
37140.000000	0.054000
37200.000000	0.054000
37260.000000	0.054000
37320.000000	0.054000
37380.000000	0.054000
37440.000000	0.054000
37500.000000	0.054000
37560.000000	0.054000
37620.000000	0.054000
37680.000000	0.054000
37740.000000	0.054000
37800.000000	0.054000
37860.000000	0.054000
37920.000000	0.054000
37980.000000	0.054000
38040.000000	0.054000
38100.000000	0.054000
38160.000000	0.054000
38220.000000	0.054000
38280.000000	0.054000
38340.000000	0.054000
38400.000000	0.054000
38460.000000	0.054000
38520.000000	0.054000
38580.000000	0.054000
38640.000000	0.054000
38700.000000	0.054000
38760.000000	0.054000
38820.000000	0.054000
38880.000000	0.054000
38940.000000	0.054000
39000.000000	0.054000
39060.000000	0.054000
39120.000000	0.054000
39180.000000	0.054000
39240.000000	0.054000
39300.000000	0.054000
39360.000000	0.054000
39420.000000	0.054000
39480.000000	0.054000
39540.000000	0.054000
39600.000000	0.054000
39660.000000	0.054000
39720.000000	0.054000
39780.000000	0.054000
39840.000000	0.054000
39900.000000	0.054000
39960.000000	0.054000
40020.000000	0.054000
40080.000000	0.054000
40140.000000	0.054000
40200.000000	0.054000
40260.000000	0.054000
40320.000000	0.054000
40380.000000	0.054000
40440.000000	0.054000
40500.000000	0.054000
40560.000000	0.054000
40620.000000	0.054000
40680.000000	0.054000
40740.000000	0.054000
40800.000000	0.054000
40860.000000	0.054000
40920.000000	0.054000
40980.000000	0.054000
41040.000000	0.054000
41100.000000	0.054000
41160.000000	0.054000
41220.000000	0.054000
41280.000000	0.054000
41340.000000	0.054000
41400.000000	0.054000
41460.000000	0.054000
41520.000000	0.054000
41580.000000	0.054000
41640.000000	0.054000
41700.000000	0.054000
41760.000000	0.054000
41820.000000	0.054000
41880.000000	0.054000
41940.000000	0.054000
42000.000000	0.054000
42060.000000	0.054000
42120.000000	0.054000
42180.000000	0.054000
42240.000000	0.054000
42300.000000	0.054000
42360.000000	0.054000
42420.000000	0.054000
42480.000000	0.054000
42540.000000	0.054000
42600.000000	0.054000
42660.000000	0.054000
42720.000000	0.054000
42780.000000	0.054000
42840.000000	0.054000
42900.000000	0.054000
42960.000000	0.054000
43020.000000	0.054000
43080.000000	0.054000
43140.000000	0.054000
43200.000000	0.054000
43260.000000	0.054000
43320.000000	0.054000
43380.000000	0.054000
43440.000000	0.054000
43500.000000	0.054000
43560.000000	0.054000
43620.000000	0.054000
43680.000000	0.054000
43740.000000	0.054000
43800.000000	0.054000
43860.000000	0.054000
43920.000000	0.054000
43980.000000	0.054000
44040.000000	0.054000
44100.000000	0.054000
44160.000000	0.054000
44220.000000	0.054000
44280.000000	0.054000
44340.000000	0.054000
44400.000000	0.054000
44460.000000	0.054000
44520.000000	0.054000
44580.000000	0.054000
44640.000000	0.054000
44700.000000	0.054000
44760.000000	0.054000
44820.000000	0.054000
44880.000000	0.054000
44940.000000	0.054000
45000.000000	0.054000
45060.000000	0.054000
45120.000000	0.054000
45180.000000	0.054000
45240.000000	0.054000
45300.000000	0.054000
45360.000000	0.054000
45420.000000	0.054000
45480.000000	0.054000
45540.000000	0.054000
45600.000000	0.054000
45660.000000	0.054000
45720.000000	0.054000
45780.000000	0.054000
45840.000000	0.054000
45900.000000	0.054000
45960.000000	0.054000
46020.000000	0.054000
46080.000000	0.054000
46140.000000	0.054000
46200.000000	0.054000
46260.000000	0.054000
46320.000000	0.054000
46380.000000	0.054000
46440.000000	0.054000
46500.000000	0.054000
46560.000000	0.054000
46620.000000	0.054000
46680.000000	0.054000
46740.000000	0.054000
46800.000000	0.054000
46860.000000	0.054000
46920.000000	0.054000
46980.000000	0.054000
47040.000000	0.054000
47100.000000	0.054000
47160.000000	0.054000
47220.000000	0.054000
47280.000000	0.054000
47340.000000	0.054000
47400.000000	0.054000
47460.000000	0.054000
47520.000000	0.054000
47580.000000	0.054000
47640.000000	0.054000
47700.000000	0.054000
47760.000000	0.054000
47820.000000	0.054000
47880.000000	0.054000
47940.000000	0.054000
48000.000000	0.054000
48060.000000	0.054000
48120.000000	0.054000
48180.000000	0.054000
48240.000000	0.054000
48300.000000	0.054000
48360.000000	0.054000
48420.000000	0.054000
48480.000000	0.054000
48540.000000	0.054000
48600.000000	0.054000
48660.000000	0.054000
48720.000000	0.054000
48780.000000	0.054000
48840.000000	0.054000
48900.000000	0.054000
48960.000000	0.054000
49020.000000	0.054000
49080.000000	0.054000
49140.000000	0.054000
49200.000000	0.054000
49260.000000	0.054000
49320.000000	0.054000
49380.000000	0.054000
49440.000000	0.054000
49500.000000	0.054000
49560.000000	0.054000
49620.000000	0.054000
49680.000000	0.054000
49740.000000	0.054000
49800.000000	0.054000
49860.000000	0.054000
49920.000000	0.054000
49980.000000	0.054000
50040.000000	0.054000
50100.000000	0.054000
50160.000000	0.054000
50220.000000	0.054000
50280.000000	0.054000
50340.000000	0.054000
50400.000000	0.054000
50460.000000	0.054000
50520.000000	0.054000
50580.000000	0.054000
50640.000000	0.054000
50700.000000	0.054000
50760.000000	0.054000
50820.000000	0.054000
50880.000000	0.054000
50940.000000	0.054000
51000.000000	0.054000
51060.000000	0.054000
51120.000000	0.054000
51180.000000	0.054000
51240.000000	0.054000
51300.000000	0.054000
51360.000000	0.054000
51420.000000	0.054000
51480.000000	0.054000
51540.000000	0.054000
51600.000000	0.054000
51660.000000	0.054000
51720.000000	0.054000
51780.000000	0.054000
51840.000000	0.054000
51900.000000	0.054000
51960.000000	0.054000
52020.000000	0.054000
52080.000000	0.054000
52140.000000	0.054000
52200.000000	0.054000
52260.000000	0.054000
52320.000000	0.054000
52380.000000	0.054000
52440.000000	0.054000
52500.000000	0.054000
52560.000000	0.054000
52620.000000	0.054000
52680.000000	0.054000
52740.000000	0.054000
52800.000000	0.054000
52860.000000	0.054000
52920.000000	0.054000
52980.000000	0.054000
53040.000000	0.054000
53100.000000	0.054000
53160.000000	0.054000
53220.000000	0.054000
53280.000000	0.054000
53340.000000	0.054000
53400.000000	0.054000
53460.000000	0.054000
53520.000000	0.054000
53580.000000	0.054000
53640.000000	0.054000
53700.000000	0.054000
53760.000000	0.054000
53820.000000	0.054000
53880.000000	0.054000
53940.000000	0.054000
54000.000000	0.054000
54060.000000	0.054000
54120.000000	0.054000
54180.000000	0.054000
54240.000000	0.054000
54300.000000	0.054000
54360.000000	0.054000
54420.000000	0.054000
54480.000000	0.054000
54540.000000	0.054000
54600.000000	0.054000
54660.000000	0.054000
54720.000000	0.054000
54780.000000	0.054000
54840.000000	0.054000
54900.000000	0.054000
54960.000000	0.054000
55020.000000	0.054000
55080.000000	0.054000
55140.000000	0.054000
55200.000000	0.054000
55260.000000	0.054000
55320.000000	0.054000
55380.000000	0.054000
55440.000000	0.054000
55500.000000	0.054000
55560.000000	0.054000
55620.000000	0.054000
55680.000000	0.054000
55740.000000	0.054000
55800.000000	0.054000
55860.000000	0.054000
55920.000000	0.054000
55980.000000	0.054000
56040.000000	0.054000
56100.000000	0.054000
56160.000000	0.054000
56220.000000	0.054000
56280.000000	0.054000
56340.000000	0.054000
56400.000000	0.054000
56460.000000	0.054000
56520.000000	0.054000
56580.000000	0.054000
56640.000000	0.054000
56700.000000	0.054000
56760.000000	0.054000
56820.000000	0.054000
56880.000000	0.054000
56940.000000	0.054000
57000.000000	0.054000
57060.000000	0.054000
57120.000000	0.054000
57180.000000	0.054000
57240.000000	0.054000
57300.000000	0.054000
57360.000000	0.054000
57420.000000	0.054000
57480.000000	0.054000
57540.000000	0.054000
57600.000000	0.054000
57660.000000	0.054000
57720.000000	0.054000
57780.000000	0.054000
57840.000000	0.054000
57900.000000	0.054000
57960.000000	0.054000
58020.000000	0.054000
58080.000000	0.054000
58140.000000	0.054000
58200.000000	0.054000
58260.000000	0.054000
58320.000000	0.054000
58380.000000	0.054000
58440.000000	0.054000
58500.000000	0.054000
58560.000000	0.054000
58620.000000	0.054000
58680.000000	0.054000
58740.000000	0.054000
58800.000000	0.054000
58860.000000	0.054000
58920.000000	0.054000
58980.000000	0.054000
59040.000000	0.054000
59100.000000	0.054000
59160.000000	0.054000
59220.000000	0.054000
59280.000000	0.054000
59340.000000	0.054000
59400.000000	0.054000
59460.000000	0.054000
59520.000000	0.054000
59580.000000	0.054000
59640.000000	0.054000
59700.000000	0.054000
59760.000000	0.054000
59820.000000	0.054000
59880.000000	0.054000
59940.000000	0.054000
60000.000000	0.054000
60060.000000	0.054000
60120.000000	0.054000
60180.000000	0.054000
60240.000000	0.054000
60300.000000	0.054000
60360.000000	0.054000
60420.000000	0.054000
60480.000000	0.054000
60540.000000	0.054000
60600.000000	0.054000
60660.000000	0.054000
60720.000000	0.054000
60780.000000	0.054000
60840.000000	0.054000
60900.000000	0.054000
60960.000000	0.054000
61020.000000	0.054000
61080.000000	0.054000
61140.000000	0.054000
61200.000000	0.054000
61260.000000	0.054000
61320.000000	0.054000
61380.000000	0.054000
61440.000000	0.054000
61500.000000	0.054000
61560.000000	0.054000
61620.000000	0.054000
61680.000000	0.054000
61740.000000	0.054000
61800.000000	0.054000
61860.000000	0.054000
61920.000000	0.054000
61980.000000	0.054000
62040.000000	0.054000
62100.000000	0.054000
62160.000000	0.054000
62220.000000	0.054000
62280.000000	0.054000
62340.000000	0.054000
62400.000000	0.054000
62460.000000	0.054000
62520.000000	0.054000
62580.000000	0.054000
62640.000000	0.054000
62700.000000	0.054000
62760.000000	0.054000
62820.000000	0.054000
62880.000000	0.054000
62940.000000	0.054000
63000.000000	0.054000
63060.000000	0.054000
63120.000000	0.054000
63180.000000	0.054000
63240.000000	0.054000
63300.000000	0.054000
63360.000000	0.054000
63420.000000	0.054000
63480.000000	0.054000
63540.000000	0.054000
63600.000000	0.054000
63660.000000	0.054000
63720.000000	0.054000
63780.000000	0.054000
63840.000000	0.054000
63900.000000	0.054000
63960.000000	0.054000
64020.000000	0.054000
64080.000000	0.054000
64140.000000	0.054000
64200.000000	0.054000
64260.000000	0.281000
64320.000000	0.221000
64380.000000	0.221000
64440.000000	0.346000
64500.000000	0.346000
64560.000000	0.346000
64620.000000	0.466000
64680.000000	0.466000
64740.000000	0.466000
64800.000000	0.466000
64860.000000	0.406000
64920.000000	0.426000
64980.000000	0.516000
65040.000000	0.516000
65100.000000	0.516000
65160.000000	0.516000
65220.000000	0.516000
65280.000000	0.516000
65340.000000	0.576000
65400.000000	0.576000
65460.000000	0.576000
65520.000000	0.576000
65580.000000	0.616000
65640.000000	0.616000
65700.000000	0.616000
65760.000000	0.616000
65820.000000	0.616000
65880.000000	0.616000
65940.000000	0.616000
66000.000000	0.616000
66060.000000	0.556000
66120.000000	0.466000
66180.000000	0.566000
66240.000000	0.566000
66300.000000	0.566000
66360.000000	0.566000
66420.000000	0.566000
66480.000000	0.566000
66540.000000	0.566000
66600.000000	0.566000
66660.000000	0.566000
66720.000000	0.566000
66780.000000	0.666000
66840.000000	0.666000
66900.000000	0.606000
66960.000000	0.606000
67020.000000	0.526000
67080.000000	0.526000
67140.000000	0.526000
67200.000000	0.526000
67260.000000	0.526000
67320.000000	0.526000
67380.000000	0.526000
67440.000000	0.526000
67500.000000	0.646000
67560.000000	0.546000
67620.000000	0.546000
67680.000000	0.546000
67740.000000	0.546000
67800.000000	0.546000
67860.000000	0.558000
67920.000000	0.546000
67980.000000	0.696000
68040.000000	0.796000
68100.000000	0.796000
68160.000000	0.796000
68220.000000	0.796000
68280.000000	0.606000
68340.000000	0.606000
68400.000000	0.606000
68460.000000	0.606000
68520.000000	0.606000
68580.000000	0.606000
68640.000000	0.481000
68700.000000	0.606000
68760.000000	0.606000
68820.000000	0.606000
68880.000000	0.606000
68940.000000	0.618000
69000.000000	0.758000
69060.000000	0.758000
69120.000000	0.758000
69180.000000	0.758000
69240.000000	0.823000
69300.000000	0.823000
69360.000000	0.723000
69420.000000	0.723000
69480.000000	0.723000
69540.000000	0.723000
69600.000000	0.658000
69660.000000	0.658000
69720.000000	0.658000
69780.000000	0.658000
69840.000000	0.658000
69900.000000	0.658000
69960.000000	0.658000
70020.000000	0.658000
70080.000000	0.658000
70140.000000	0.658000
70200.000000	0.758000
70260.000000	0.758000
70320.000000	0.758000
70380.000000	0.758000
70440.000000	0.758000
70500.000000	0.758000
70560.000000	0.758000
70620.000000	0.758000
70680.000000	0.818000
70740.000000	0.818000
70800.000000	1.132000
70860.000000	1.132000
70920.000000	1.072000
70980.000000	1.090000
71040.000000	0.776000
71100.000000	0.716000
71160.000000	0.471000
71220.000000	0.451000
71280.000000	0.451000
71340.000000	0.451000
71400.000000	0.451000
71460.000000	0.451000
71520.000000	0.451000
71580.000000	0.411000
71640.000000	0.411000
71700.000000	0.411000
71760.000000	0.411000
71820.000000	0.411000
71880.000000	0.411000
71940.000000	0.411000
72000.000000	0.411000
72060.000000	0.471000
72120.000000	0.471000
72180.000000	0.471000
72240.000000	0.471000
72300.000000	0.471000
72360.000000	0.471000
72420.000000	0.511000
72480.000000	0.511000
72540.000000	0.511000
72600.000000	0.511000
72660.000000	0.511000
72720.000000	0.511000
72780.000000	0.524000
72840.000000	0.484000
72900.000000	0.424000
72960.000000	0.424000
73020.000000	0.424000
73080.000000	0.364000
73140.000000	0.364000
73200.000000	0.364000
73260.000000	0.404000
73320.000000	0.404000
73380.000000	0.404000
73440.000000	0.404000
73500.000000	0.404000
73560.000000	0.364000
73620.000000	0.364000
73680.000000	0.364000
73740.000000	0.364000
73800.000000	0.384000
73860.000000	0.384000
73920.000000	0.384000
73980.000000	0.264000
74040.000000	0.297000
74100.000000	0.297000
74160.000000	0.337000
74220.000000	0.337000
74280.000000	0.397000
74340.000000	0.297000
74400.000000	0.297000
74460.000000	0.297000
74520.000000	2.760000
74580.000000	2.760000
74640.000000	2.740000
74700.000000	2.740000
74760.000000	2.740000
74820.000000	2.740000
74880.000000	2.740000
74940.000000	2.740000
75000.000000	2.740000
75060.000000	2.740000
75120.000000	2.740000
75180.000000	2.740000
75240.000000	2.740000
75300.000000	2.740000
75360.000000	2.722000
75420.000000	2.722000
75480.000000	0.279000
75540.000000	0.279000
75600.000000	0.369000
75660.000000	0.369000
75720.000000	0.387000
75780.000000	0.387000
75840.000000	0.387000
75900.000000	0.387000
75960.000000	0.387000
76020.000000	0.387000
76080.000000	0.387000
76140.000000	0.387000
76200.000000	0.387000
76260.000000	0.387000
76320.000000	0.387000
76380.000000	0.374000
76440.000000	0.284000
76500.000000	0.284000
76560.000000	0.284000
76620.000000	0.284000
76680.000000	0.284000
76740.000000	0.344000
76800.000000	0.284000
76860.000000	0.284000
76920.000000	0.284000
76980.000000	0.284000
77040.000000	0.284000
77100.000000	0.284000
77160.000000	0.284000
77220.000000	0.409000
77280.000000	0.409000
77340.000000	0.469000
77400.000000	0.469000
77460.000000	0.529000
77520.000000	0.529000
77580.000000	2.587000
77640.000000	2.587000
77700.000000	2.587000
77760.000000	0.529000
77820.000000	0.529000
77880.000000	0.594000
77940.000000	0.594000
78000.000000	0.594000
78060.000000	0.594000
78120.000000	0.684000
78180.000000	0.684000
78240.000000	0.684000
78300.000000	0.684000
78360.000000	0.684000
78420.000000	0.651000
78480.000000	0.561000
78540.000000	0.561000
78600.000000	0.561000
78660.000000	0.561000
78720.000000	0.561000
78780.000000	0.561000
78840.000000	0.561000
78900.000000	0.561000
78960.000000	0.561000
79020.000000	0.561000
79080.000000	0.496000
79140.000000	0.496000
79200.000000	0.496000
79260.000000	0.496000
79320.000000	0.586000
79380.000000	0.586000
79440.000000	0.586000
79500.000000	0.496000
79560.000000	0.496000
79620.000000	0.556000
79680.000000	0.556000
79740.000000	0.556000
79800.000000	0.556000
79860.000000	0.596000
79920.000000	0.596000
79980.000000	0.596000
80040.000000	0.596000
80100.000000	0.578000
80160.000000	0.578000
80220.000000	0.611000
80280.000000	3.054000
80340.000000	3.054000
80400.000000	3.094000
80460.000000	3.094000
80520.000000	3.094000
80580.000000	3.094000
80640.000000	3.094000
80700.000000	3.094000
80760.000000	3.054000
80820.000000	3.054000
80880.000000	3.094000
80940.000000	3.094000
81000.000000	3.054000
81060.000000	3.054000
81120.000000	3.054000
81180.000000	2.994000
81240.000000	0.551000
81300.000000	0.551000
81360.000000	0.551000
81420.000000	0.551000
81480.000000	0.551000
81540.000000	0.551000
81600.000000	0.551000
81660.000000	0.591000
81720.000000	0.444000
81780.000000	0.504000
81840.000000	0.504000
81900.000000	0.504000
81960.000000	0.492000
82020.000000	0.492000
82080.000000	0.452000
82140.000000	0.452000
82200.000000	0.512000
82260.000000	0.512000
82320.000000	0.512000
82380.000000	0.412000
82440.000000	0.412000
82500.000000	0.352000
82560.000000	0.352000
82620.000000	0.412000
82680.000000	0.412000
82740.000000	0.412000
82800.000000	0.412000
82860.000000	0.412000
82920.000000	0.412000
82980.000000	0.602000
83040.000000	0.602000
83100.000000	0.602000
83160.000000	0.602000
83220.000000	0.602000
83280.000000	0.602000
83340.000000	0.462000
83400.000000	0.482000
83460.000000	0.482000
83520.000000	0.482000
83580.000000	0.482000
83640.000000	2.520000
83700.000000	2.520000
83760.000000	2.585000
83820.000000	0.527000
83880.000000	0.527000
83940.000000	0.527000
84000.000000	0.527000
84060.000000	0.527000
84120.000000	0.694000
84180.000000	0.694000
84240.000000	0.754000
84300.000000	0.786000
84360.000000	0.706000
84420.000000	0.706000
84480.000000	0.826000
84540.000000	2.824000
84600.000000	2.791000
84660.000000	2.791000
84720.000000	0.733000
84780.000000	0.733000
84840.000000	0.733000
84900.000000	0.733000
84960.000000	0.633000
85020.000000	2.691000
85080.000000	2.691000
85140.000000	2.566000
85200.000000	0.448000
85260.000000	0.488000
85320.000000	0.448000
85380.000000	0.448000
85440.000000	0.573000
85500.000000	0.573000
85560.000000	0.573000
85620.000000	0.613000
85680.000000	0.613000
85740.000000	0.613000
85800.000000	0.613000
85860.000000	0.613000
85920.000000	0.613000
85980.000000	0.613000
86040.000000	0.613000
86100.000000	0.613000
86160.000000	0.548000
86220.000000	0.548000
86280.000000	0.561000
86340.000000	0.471000
86400.000000	0.504000
