Name,Voltage,NumberOfNfeeders,LenghtOfFeeders,TransformerType,CableType,CableLength
L010_F001,lv,1,10,BENCHMARK_TRAFO,BENCHMARK_CABLE_2,0.02
L020_F001,lv,1,20,BENCHMARK_TRAFO,BENCHMARK_CABLE_2,0.02
L030_F001,lv,1,30,BENCHMARK_TRAFO,BENCHMARK_CABLE_2,0.02
L040_F001,lv,1,40,BENCHMARK_TRAFO,BENCHMARK_CABLE_2,0.02
L050_F001,lv,1,50,BENCHMARK_TRAFO,BENCHMARK_CABLE_2,0.02
L060_F001,lv,1,60,BENCHMARK_TRAFO,BENCHMARK_CABLE_2,0.02
L070_F001,lv,1,70,BENCHMARK_TRAFO,BENCHMARK_CABLE_2,0.02
L080_F001,lv,1,80,BENCHMARK_TRAFO,BENCHMARK_CABLE_2,0.02
L090_F001,lv,1,90,BENCHMARK_TRAFO,BENCHMARK_CABLE_2,0.02
L100_F001,lv,1,100,BENCHMARK_TRAFO,BENCHMARK_CABLE_2,0.02
L110_F001,lv,1,110,BENCHMARK_TRAFO,BENCHMARK_CABLE_2,0.02
L120_F001,lv,1,120,BENCHMARK_TRAFO,BENCHMARK_CABLE_2,0.02
L130_F001,lv,1,130,BENCHMARK_TRAFO,BENCHMARK_CABLE_2,0.02
L140_F001,lv,1,140,BENCHMARK_TRAFO,BENCHMARK_CABLE_2,0.02
L150_F001,lv,1,150,BENCHMARK_TRAFO,BENCHMARK_CABLE_2,0.02
L160_F001,lv,1,160,BENCHMARK_TRAFO,BENCHMARK_CABLE_2,0.02
L170_F001,lv,1,170,BENCHMARK_TRAFO,BENCHMARK_CABLE_2,0.02
L180_F001,lv,1,180,BENCHMARK_TRAFO,BENCHMARK_CABLE_2,0.02
L190_F001,lv,1,190,BENCHMARK_TRAFO,BENCHMARK_CABLE_2,0.02
L200_F001,lv,1,200,BENCHMARK_TRAFO,BENCHMARK_CABLE_2,0.02
## 5 Feeder
L010_F005,lv,5,10,BENCHMARK_TRAFO,BENCHMARK_CABLE_2,0.02
L020_F005,lv,5,20,BENCHMARK_TRAFO,BENCHMARK_CABLE_2,0.02
L030_F005,lv,5,30,BENCHMARK_TRAFO,BENCHMARK_CABLE_2,0.02
L040_F005,lv,5,40,BENCHMARK_TRAFO,BENCHMARK_CABLE_2,0.02
L050_F005,lv,5,50,BENCHMARK_TRAFO,BENCHMARK_CABLE_2,0.02
L060_F005,lv,5,60,BENCHMARK_TRAFO,BENCHMARK_CABLE_2,0.02
L070_F005,lv,5,70,BENCHMARK_TRAFO,BENCHMARK_CABLE_2,0.02
L080_F005,lv,5,80,BENCHMARK_TRAFO,BENCHMARK_CABLE_2,0.02
L090_F005,lv,5,90,BENCHMARK_TRAFO,BENCHMARK_CABLE_2,0.02
L100_F005,lv,5,100,BENCHMARK_TRAFO,BENCHMARK_CABLE_2,0.02
L110_F005,lv,5,110,BENCHMARK_TRAFO,BENCHMARK_CABLE_2,0.02
L120_F005,lv,5,120,BENCHMARK_TRAFO,BENCHMARK_CABLE_2,0.02
L130_F005,lv,5,130,BENCHMARK_TRAFO,BENCHMARK_CABLE_2,0.02
L140_F005,lv,5,140,BENCHMARK_TRAFO,BENCHMARK_CABLE_2,0.02
L150_F005,lv,5,150,BENCHMARK_TRAFO,BENCHMARK_CABLE_2,0.02
L160_F005,lv,5,160,BENCHMARK_TRAFO,BENCHMARK_CABLE_2,0.02
L170_F005,lv,5,170,BENCHMARK_TRAFO,BENCHMARK_CABLE_2,0.02
L180_F005,lv,5,180,BENCHMARK_TRAFO,BENCHMARK_CABLE_2,0.02
L190_F005,lv,5,190,BENCHMARK_TRAFO,BENCHMARK_CABLE_2,0.02
L200_F005,lv,5,200,BENCHMARK_TRAFO,BENCHMARK_CABLE_2,0.02
## 10 Feeder
L010_F010,lv,10,10,BENCHMARK_TRAFO,BENCHMARK_CABLE_2,0.02
L020_F010,lv,10,20,BENCHMARK_TRAFO,BENCHMARK_CABLE_2,0.02
L030_F010,lv,10,30,BENCHMARK_TRAFO,BENCHMARK_CABLE_2,0.02
L040_F010,lv,10,40,BENCHMARK_TRAFO,BENCHMARK_CABLE_2,0.02
L050_F010,lv,10,50,BENCHMARK_TRAFO,BENCHMARK_CABLE_2,0.02
L060_F010,lv,10,60,BENCHMARK_TRAFO,BENCHMARK_CABLE_2,0.02
L070_F010,lv,10,70,BENCHMARK_TRAFO,BENCHMARK_CABLE_2,0.02
L080_F010,lv,10,80,BENCHMARK_TRAFO,BENCHMARK_CABLE_2,0.02
L090_F010,lv,10,90,BENCHMARK_TRAFO,BENCHMARK_CABLE_2,0.02
L100_F010,lv,10,100,BENCHMARK_TRAFO,BENCHMARK_CABLE_2,0.02
L110_F010,lv,10,110,BENCHMARK_TRAFO,BENCHMARK_CABLE_2,0.02
L120_F010,lv,10,120,BENCHMARK_TRAFO,BENCHMARK_CABLE_2,0.02
L130_F010,lv,10,130,BENCHMARK_TRAFO,BENCHMARK_CABLE_2,0.02
L140_F010,lv,10,140,BENCHMARK_TRAFO,BENCHMARK_CABLE_2,0.02
L150_F010,lv,10,150,BENCHMARK_TRAFO,BENCHMARK_CABLE_2,0.02
L160_F010,lv,10,160,BENCHMARK_TRAFO,BENCHMARK_CABLE_2,0.02
L170_F010,lv,10,170,BENCHMARK_TRAFO,BENCHMARK_CABLE_2,0.02
L180_F010,lv,10,180,BENCHMARK_TRAFO,BENCHMARK_CABLE_2,0.02
L190_F010,lv,10,190,BENCHMARK_TRAFO,BENCHMARK_CABLE_2,0.02
L200_F010,lv,10,200,BENCHMARK_TRAFO,BENCHMARK_CABLE_2,0.02
## 15 Feeder
L010_F015,lv,15,10,BENCHMARK_TRAFO,BENCHMARK_CABLE_2,0.02
L020_F015,lv,15,20,BENCHMARK_TRAFO,BENCHMARK_CABLE_2,0.02
L030_F015,lv,15,30,BENCHMARK_TRAFO,BENCHMARK_CABLE_2,0.02
L040_F015,lv,15,40,BENCHMARK_TRAFO,BENCHMARK_CABLE_2,0.02
L050_F015,lv,15,50,BENCHMARK_TRAFO,BENCHMARK_CABLE_2,0.02
L060_F015,lv,15,60,BENCHMARK_TRAFO,BENCHMARK_CABLE_2,0.02
L070_F015,lv,15,70,BENCHMARK_TRAFO,BENCHMARK_CABLE_2,0.02
L080_F015,lv,15,80,BENCHMARK_TRAFO,BENCHMARK_CABLE_2,0.02
L090_F015,lv,15,90,BENCHMARK_TRAFO,BENCHMARK_CABLE_2,0.02
L100_F015,lv,15,100,BENCHMARK_TRAFO,BENCHMARK_CABLE_2,0.02
L110_F015,lv,15,110,BENCHMARK_TRAFO,BENCHMARK_CABLE_2,0.02
L120_F015,lv,15,120,BENCHMARK_TRAFO,BENCHMARK_CABLE_2,0.02
L130_F015,lv,15,130,BENCHMARK_TRAFO,BENCHMARK_CABLE_2,0.02
L140_F015,lv,15,140,BENCHMARK_TRAFO,BENCHMARK_CABLE_2,0.02
L150_F015,lv,15,150,BENCHMARK_TRAFO,BENCHMARK_CABLE_2,0.02
L160_F015,lv,15,160,BENCHMARK_TRAFO,BENCHMARK_CABLE_2,0.02
L170_F015,lv,15,170,BENCHMARK_TRAFO,BENCHMARK_CABLE_2,0.02
L180_F015,lv,15,180,BENCHMARK_TRAFO,BENCHMARK_CABLE_2,0.02
L190_F015,lv,15,190,BENCHMARK_TRAFO,BENCHMARK_CABLE_2,0.02
L200_F015,lv,15,200,BENCHMARK_TRAFO,BENCHMARK_CABLE_2,0.02
## 20 Feeder
L010_F020,lv,20,10,BENCHMARK_TRAFO,BENCHMARK_CABLE_2,0.02
L020_F020,lv,20,20,BENCHMARK_TRAFO,BENCHMARK_CABLE_2,0.02
L030_F020,lv,20,30,BENCHMARK_TRAFO,BENCHMARK_CABLE_2,0.02
L040_F020,lv,20,40,BENCHMARK_TRAFO,BENCHMARK_CABLE_2,0.02
L050_F020,lv,20,50,BENCHMARK_TRAFO,BENCHMARK_CABLE_2,0.02
L060_F020,lv,20,60,BENCHMARK_TRAFO,BENCHMARK_CABLE_2,0.02
L070_F020,lv,20,70,BENCHMARK_TRAFO,BENCHMARK_CABLE_2,0.02
L080_F020,lv,20,80,BENCHMARK_TRAFO,BENCHMARK_CABLE_2,0.02
L090_F020,lv,20,90,BENCHMARK_TRAFO,BENCHMARK_CABLE_2,0.02
L100_F020,lv,20,100,BENCHMARK_TRAFO,BENCHMARK_CABLE_2,0.02
L110_F020,lv,20,110,BENCHMARK_TRAFO,BENCHMARK_CABLE_2,0.02
L120_F020,lv,20,120,BENCHMARK_TRAFO,BENCHMARK_CABLE_2,0.02
L130_F020,lv,20,130,BENCHMARK_TRAFO,BENCHMARK_CABLE_2,0.02
L140_F020,lv,20,140,BENCHMARK_TRAFO,BENCHMARK_CABLE_2,0.02
L150_F020,lv,20,150,BENCHMARK_TRAFO,BENCHMARK_CABLE_2,0.02
L160_F020,lv,20,160,BENCHMARK_TRAFO,BENCHMARK_CABLE_2,0.02
L170_F020,lv,20,170,BENCHMARK_TRAFO,BENCHMARK_CABLE_2,0.02
L180_F020,lv,20,180,BENCHMARK_TRAFO,BENCHMARK_CABLE_2,0.02
L190_F020,lv,20,190,BENCHMARK_TRAFO,BENCHMARK_CABLE_2,0.02
L200_F020,lv,20,200,BENCHMARK_TRAFO,BENCHMARK_CABLE_2,0.02
## 24 Feeder
L010_F024,lv,24,10,BENCHMARK_TRAFO,BENCHMARK_CABLE_2,0.02
L020_F024,lv,24,20,BENCHMARK_TRAFO,BENCHMARK_CABLE_2,0.02
L030_F024,lv,24,30,BENCHMARK_TRAFO,BENCHMARK_CABLE_2,0.02
L040_F024,lv,24,40,BENCHMARK_TRAFO,BENCHMARK_CABLE_2,0.02
L050_F024,lv,24,50,BENCHMARK_TRAFO,BENCHMARK_CABLE_2,0.02
L060_F024,lv,24,60,BENCHMARK_TRAFO,BENCHMARK_CABLE_2,0.02
L070_F024,lv,24,70,BENCHMARK_TRAFO,BENCHMARK_CABLE_2,0.02
L080_F024,lv,24,80,BENCHMARK_TRAFO,BENCHMARK_CABLE_2,0.02
L090_F024,lv,24,90,BENCHMARK_TRAFO,BENCHMARK_CABLE_2,0.02
L100_F024,lv,24,100,BENCHMARK_TRAFO,BENCHMARK_CABLE_2,0.02
L110_F024,lv,24,110,BENCHMARK_TRAFO,BENCHMARK_CABLE_2,0.02
L120_F024,lv,24,120,BENCHMARK_TRAFO,BENCHMARK_CABLE_2,0.02
L130_F024,lv,24,130,BENCHMARK_TRAFO,BENCHMARK_CABLE_2,0.02
L140_F024,lv,24,140,BENCHMARK_TRAFO,BENCHMARK_CABLE_2,0.02
L150_F024,lv,24,150,BENCHMARK_TRAFO,BENCHMARK_CABLE_2,0.02
L160_F024,lv,24,160,BENCHMARK_TRAFO,BENCHMARK_CABLE_2,0.02
L170_F024,lv,24,170,BENCHMARK_TRAFO,BENCHMARK_CABLE_2,0.02
L180_F024,lv,24,180,BENCHMARK_TRAFO,BENCHMARK_CABLE_2,0.02
L190_F024,lv,24,190,BENCHMARK_TRAFO,BENCHMARK_CABLE_2,0.02
L200_F024,lv,24,200,BENCHMARK_TRAFO,BENCHMARK_CABLE_2,0.02
## 25 Feeder
L010_F025,lv,25,10,BENCHMARK_TRAFO,BENCHMARK_CABLE_2,0.02
L020_F025,lv,25,20,BENCHMARK_TRAFO,BENCHMARK_CABLE_2,0.02
L030_F025,lv,25,30,BENCHMARK_TRAFO,BENCHMARK_CABLE_2,0.02
L040_F025,lv,25,40,BENCHMARK_TRAFO,BENCHMARK_CABLE_2,0.02
L050_F025,lv,25,50,BENCHMARK_TRAFO,BENCHMARK_CABLE_2,0.02
L060_F025,lv,25,60,BENCHMARK_TRAFO,BENCHMARK_CABLE_2,0.02
L070_F025,lv,25,70,BENCHMARK_TRAFO,BENCHMARK_CABLE_2,0.02
L080_F025,lv,25,80,BENCHMARK_TRAFO,BENCHMARK_CABLE_2,0.02
L090_F025,lv,25,90,BENCHMARK_TRAFO,BENCHMARK_CABLE_2,0.02
L100_F025,lv,25,100,BENCHMARK_TRAFO,BENCHMARK_CABLE_2,0.02
L110_F025,lv,25,110,BENCHMARK_TRAFO,BENCHMARK_CABLE_2,0.02
L120_F025,lv,25,120,BENCHMARK_TRAFO,BENCHMARK_CABLE_2,0.02
L130_F025,lv,25,130,BENCHMARK_TRAFO,BENCHMARK_CABLE_2,0.02
L140_F025,lv,25,140,BENCHMARK_TRAFO,BENCHMARK_CABLE_2,0.02
L150_F025,lv,25,150,BENCHMARK_TRAFO,BENCHMARK_CABLE_2,0.02
L160_F025,lv,25,160,BENCHMARK_TRAFO,BENCHMARK_CABLE_2,0.02
L170_F025,lv,25,170,BENCHMARK_TRAFO,BENCHMARK_CABLE_2,0.02
L180_F025,lv,25,180,BENCHMARK_TRAFO,BENCHMARK_CABLE_2,0.02
L190_F025,lv,25,190,BENCHMARK_TRAFO,BENCHMARK_CABLE_2,0.02
L200_F025,lv,25,200,BENCHMARK_TRAFO,BENCHMARK_CABLE_2,0.02
## 30 Feeder
L010_F030,lv,30,10,BENCHMARK_TRAFO,BENCHMARK_CABLE_2,0.02
L020_F030,lv,30,20,BENCHMARK_TRAFO,BENCHMARK_CABLE_2,0.02
L030_F030,lv,30,30,BENCHMARK_TRAFO,BENCHMARK_CABLE_2,0.02
L040_F030,lv,30,40,BENCHMARK_TRAFO,BENCHMARK_CABLE_2,0.02
L050_F030,lv,30,50,BENCHMARK_TRAFO,BENCHMARK_CABLE_2,0.02
L060_F030,lv,30,60,BENCHMARK_TRAFO,BENCHMARK_CABLE_2,0.02
L070_F030,lv,30,70,BENCHMARK_TRAFO,BENCHMARK_CABLE_2,0.02
L080_F030,lv,30,80,BENCHMARK_TRAFO,BENCHMARK_CABLE_2,0.02
L090_F030,lv,30,90,BENCHMARK_TRAFO,BENCHMARK_CABLE_2,0.02
L100_F030,lv,30,100,BENCHMARK_TRAFO,BENCHMARK_CABLE_2,0.02
L110_F030,lv,30,110,BENCHMARK_TRAFO,BENCHMARK_CABLE_2,0.02
L120_F030,lv,30,120,BENCHMARK_TRAFO,BENCHMARK_CABLE_2,0.02
L130_F030,lv,30,130,BENCHMARK_TRAFO,BENCHMARK_CABLE_2,0.02
L140_F030,lv,30,140,BENCHMARK_TRAFO,BENCHMARK_CABLE_2,0.02
L150_F030,lv,30,150,BENCHMARK_TRAFO,BENCHMARK_CABLE_2,0.02
L160_F030,lv,30,160,BENCHMARK_TRAFO,BENCHMARK_CABLE_2,0.02
L170_F030,lv,30,170,BENCHMARK_TRAFO,BENCHMARK_CABLE_2,0.02
L180_F030,lv,30,180,BENCHMARK_TRAFO,BENCHMARK_CABLE_2,0.02
L190_F030,lv,30,190,BENCHMARK_TRAFO,BENCHMARK_CABLE_2,0.02
L200_F030,lv,30,200,BENCHMARK_TRAFO,BENCHMARK_CABLE_2,0.02
## 35 Feeder
L010_F035,lv,35,10,BENCHMARK_TRAFO,BENCHMARK_CABLE_2,0.02
L020_F035,lv,35,20,BENCHMARK_TRAFO,BENCHMARK_CABLE_2,0.02
L030_F035,lv,35,30,BENCHMARK_TRAFO,BENCHMARK_CABLE_2,0.02
L040_F035,lv,35,40,BENCHMARK_TRAFO,BENCHMARK_CABLE_2,0.02
L050_F035,lv,35,50,BENCHMARK_TRAFO,BENCHMARK_CABLE_2,0.02
L060_F035,lv,35,60,BENCHMARK_TRAFO,BENCHMARK_CABLE_2,0.02
L070_F035,lv,35,70,BENCHMARK_TRAFO,BENCHMARK_CABLE_2,0.02
L080_F035,lv,35,80,BENCHMARK_TRAFO,BENCHMARK_CABLE_2,0.02
L090_F035,lv,35,90,BENCHMARK_TRAFO,BENCHMARK_CABLE_2,0.02
L100_F035,lv,35,100,BENCHMARK_TRAFO,BENCHMARK_CABLE_2,0.02
L110_F035,lv,35,110,BENCHMARK_TRAFO,BENCHMARK_CABLE_2,0.02
L120_F035,lv,35,120,BENCHMARK_TRAFO,BENCHMARK_CABLE_2,0.02
L130_F035,lv,35,130,BENCHMARK_TRAFO,BENCHMARK_CABLE_2,0.02
L140_F035,lv,35,140,BENCHMARK_TRAFO,BENCHMARK_CABLE_2,0.02
L150_F035,lv,35,150,BENCHMARK_TRAFO,BENCHMARK_CABLE_2,0.02
L160_F035,lv,35,160,BENCHMARK_TRAFO,BENCHMARK_CABLE_2,0.02
L170_F035,lv,35,170,BENCHMARK_TRAFO,BENCHMARK_CABLE_2,0.02
L180_F035,lv,35,180,BENCHMARK_TRAFO,BENCHMARK_CABLE_2,0.02
L190_F035,lv,35,190,BENCHMARK_TRAFO,BENCHMARK_CABLE_2,0.02
L200_F035,lv,35,200,BENCHMARK_TRAFO,BENCHMARK_CABLE_2,0.02
## 40 Feeder
L010_F040,lv,40,10,BENCHMARK_TRAFO,BENCHMARK_CABLE_2,0.02
L020_F040,lv,40,20,BENCHMARK_TRAFO,BENCHMARK_CABLE_2,0.02
L030_F040,lv,40,30,BENCHMARK_TRAFO,BENCHMARK_CABLE_2,0.02
L040_F040,lv,40,40,BENCHMARK_TRAFO,BENCHMARK_CABLE_2,0.02
L050_F040,lv,40,50,BENCHMARK_TRAFO,BENCHMARK_CABLE_2,0.02
L060_F040,lv,40,60,BENCHMARK_TRAFO,BENCHMARK_CABLE_2,0.02
L070_F040,lv,40,70,BENCHMARK_TRAFO,BENCHMARK_CABLE_2,0.02
L080_F040,lv,40,80,BENCHMARK_TRAFO,BENCHMARK_CABLE_2,0.02
L090_F040,lv,40,90,BENCHMARK_TRAFO,BENCHMARK_CABLE_2,0.02
L100_F040,lv,40,100,BENCHMARK_TRAFO,BENCHMARK_CABLE_2,0.02
L110_F040,lv,40,110,BENCHMARK_TRAFO,BENCHMARK_CABLE_2,0.02
L120_F040,lv,40,120,BENCHMARK_TRAFO,BENCHMARK_CABLE_2,0.02
L130_F040,lv,40,130,BENCHMARK_TRAFO,BENCHMARK_CABLE_2,0.02
L140_F040,lv,40,140,BENCHMARK_TRAFO,BENCHMARK_CABLE_2,0.02
L150_F040,lv,40,150,BENCHMARK_TRAFO,BENCHMARK_CABLE_2,0.02
L160_F040,lv,40,160,BENCHMARK_TRAFO,BENCHMARK_CABLE_2,0.02
L170_F040,lv,40,170,BENCHMARK_TRAFO,BENCHMARK_CABLE_2,0.02
L180_F040,lv,40,180,BENCHMARK_TRAFO,BENCHMARK_CABLE_2,0.02
L190_F040,lv,40,190,BENCHMARK_TRAFO,BENCHMARK_CABLE_2,0.02
L200_F040,lv,40,200,BENCHMARK_TRAFO,BENCHMARK_CABLE_2,0.02
## 45 Feeder
L010_F045,lv,45,10,BENCHMARK_TRAFO,BENCHMARK_CABLE_2,0.02
L020_F045,lv,45,20,BENCHMARK_TRAFO,BENCHMARK_CABLE_2,0.02
L030_F045,lv,45,30,BENCHMARK_TRAFO,BENCHMARK_CABLE_2,0.02
L040_F045,lv,45,40,BENCHMARK_TRAFO,BENCHMARK_CABLE_2,0.02
L050_F045,lv,45,50,BENCHMARK_TRAFO,BENCHMARK_CABLE_2,0.02
L060_F045,lv,45,60,BENCHMARK_TRAFO,BENCHMARK_CABLE_2,0.02
L070_F045,lv,45,70,BENCHMARK_TRAFO,BENCHMARK_CABLE_2,0.02
L080_F045,lv,45,80,BENCHMARK_TRAFO,BENCHMARK_CABLE_2,0.02
L090_F045,lv,45,90,BENCHMARK_TRAFO,BENCHMARK_CABLE_2,0.02
L100_F045,lv,45,100,BENCHMARK_TRAFO,BENCHMARK_CABLE_2,0.02
L110_F045,lv,45,110,BENCHMARK_TRAFO,BENCHMARK_CABLE_2,0.02
L120_F045,lv,45,120,BENCHMARK_TRAFO,BENCHMARK_CABLE_2,0.02
L130_F045,lv,45,130,BENCHMARK_TRAFO,BENCHMARK_CABLE_2,0.02
L140_F045,lv,45,140,BENCHMARK_TRAFO,BENCHMARK_CABLE_2,0.02
L150_F045,lv,45,150,BENCHMARK_TRAFO,BENCHMARK_CABLE_2,0.02
L160_F045,lv,45,160,BENCHMARK_TRAFO,BENCHMARK_CABLE_2,0.02
L170_F045,lv,45,170,BENCHMARK_TRAFO,BENCHMARK_CABLE_2,0.02
L180_F045,lv,45,180,BENCHMARK_TRAFO,BENCHMARK_CABLE_2,0.02
L190_F045,lv,45,190,BENCHMARK_TRAFO,BENCHMARK_CABLE_2,0.02
L200_F045,lv,45,200,BENCHMARK_TRAFO,BENCHMARK_CABLE_2,0.02
## 48 Feeder
L010_F048,lv,48,10,BENCHMARK_TRAFO,BENCHMARK_CABLE_2,0.02
L020_F048,lv,48,20,BENCHMARK_TRAFO,BENCHMARK_CABLE_2,0.02
L030_F048,lv,48,30,BENCHMARK_TRAFO,BENCHMARK_CABLE_2,0.02
L040_F048,lv,48,40,BENCHMARK_TRAFO,BENCHMARK_CABLE_2,0.02
L050_F048,lv,48,50,BENCHMARK_TRAFO,BENCHMARK_CABLE_2,0.02
L060_F048,lv,48,60,BENCHMARK_TRAFO,BENCHMARK_CABLE_2,0.02
L070_F048,lv,48,70,BENCHMARK_TRAFO,BENCHMARK_CABLE_2,0.02
L080_F048,lv,48,80,BENCHMARK_TRAFO,BENCHMARK_CABLE_2,0.02
L090_F048,lv,48,90,BENCHMARK_TRAFO,BENCHMARK_CABLE_2,0.02
L100_F048,lv,48,100,BENCHMARK_TRAFO,BENCHMARK_CABLE_2,0.02
L110_F048,lv,48,110,BENCHMARK_TRAFO,BENCHMARK_CABLE_2,0.02
L120_F048,lv,48,120,BENCHMARK_TRAFO,BENCHMARK_CABLE_2,0.02
L130_F048,lv,48,130,BENCHMARK_TRAFO,BENCHMARK_CABLE_2,0.02
L140_F048,lv,48,140,BENCHMARK_TRAFO,BENCHMARK_CABLE_2,0.02
L150_F048,lv,48,150,BENCHMARK_TRAFO,BENCHMARK_CABLE_2,0.02
L160_F048,lv,48,160,BENCHMARK_TRAFO,BENCHMARK_CABLE_2,0.02
L170_F048,lv,48,170,BENCHMARK_TRAFO,BENCHMARK_CABLE_2,0.02
L180_F048,lv,48,180,BENCHMARK_TRAFO,BENCHMARK_CABLE_2,0.02
L190_F048,lv,48,190,BENCHMARK_TRAFO,BENCHMARK_CABLE_2,0.02
L200_F048,lv,48,200,BENCHMARK_TRAFO,BENCHMARK_CABLE_2,0.02
## 50 Feeder
L010_F050,lv,50,10,BENCHMARK_TRAFO,BENCHMARK_CABLE_2,0.02
L020_F050,lv,50,20,BENCHMARK_TRAFO,BENCHMARK_CABLE_2,0.02
L030_F050,lv,50,30,BENCHMARK_TRAFO,BENCHMARK_CABLE_2,0.02
L040_F050,lv,50,40,BENCHMARK_TRAFO,BENCHMARK_CABLE_2,0.02
L050_F050,lv,50,50,BENCHMARK_TRAFO,BENCHMARK_CABLE_2,0.02
L060_F050,lv,50,60,BENCHMARK_TRAFO,BENCHMARK_CABLE_2,0.02
L070_F050,lv,50,70,BENCHMARK_TRAFO,BENCHMARK_CABLE_2,0.02
L080_F050,lv,50,80,BENCHMARK_TRAFO,BENCHMARK_CABLE_2,0.02
L090_F050,lv,50,90,BENCHMARK_TRAFO,BENCHMARK_CABLE_2,0.02
L100_F050,lv,50,100,BENCHMARK_TRAFO,BENCHMARK_CABLE_2,0.02
L110_F050,lv,50,110,BENCHMARK_TRAFO,BENCHMARK_CABLE_2,0.02
L120_F050,lv,50,120,BENCHMARK_TRAFO,BENCHMARK_CABLE_2,0.02
L130_F050,lv,50,130,BENCHMARK_TRAFO,BENCHMARK_CABLE_2,0.02
L140_F050,lv,50,140,BENCHMARK_TRAFO,BENCHMARK_CABLE_2,0.02
L150_F050,lv,50,150,BENCHMARK_TRAFO,BENCHMARK_CABLE_2,0.02
L160_F050,lv,50,160,BENCHMARK_TRAFO,BENCHMARK_CABLE_2,0.02
L170_F050,lv,50,170,BENCHMARK_TRAFO,BENCHMARK_CABLE_2,0.02
L180_F050,lv,50,180,BENCHMARK_TRAFO,BENCHMARK_CABLE_2,0.02
L190_F050,lv,50,190,BENCHMARK_TRAFO,BENCHMARK_CABLE_2,0.02
L200_F050,lv,50,200,BENCHMARK_TRAFO,BENCHMARK_CABLE_2,0.02
## 55 Feeder
L010_F055,lv,55,10,BENCHMARK_TRAFO,BENCHMARK_CABLE_2,0.02
L020_F055,lv,55,20,BENCHMARK_TRAFO,BENCHMARK_CABLE_2,0.02
L030_F055,lv,55,30,BENCHMARK_TRAFO,BENCHMARK_CABLE_2,0.02
L040_F055,lv,55,40,BENCHMARK_TRAFO,BENCHMARK_CABLE_2,0.02
L050_F055,lv,55,50,BENCHMARK_TRAFO,BENCHMARK_CABLE_2,0.02
L060_F055,lv,55,60,BENCHMARK_TRAFO,BENCHMARK_CABLE_2,0.02
L070_F055,lv,55,70,BENCHMARK_TRAFO,BENCHMARK_CABLE_2,0.02
L080_F055,lv,55,80,BENCHMARK_TRAFO,BENCHMARK_CABLE_2,0.02
L090_F055,lv,55,90,BENCHMARK_TRAFO,BENCHMARK_CABLE_2,0.02
L100_F055,lv,55,100,BENCHMARK_TRAFO,BENCHMARK_CABLE_2,0.02
L110_F055,lv,55,110,BENCHMARK_TRAFO,BENCHMARK_CABLE_2,0.02
L120_F055,lv,55,120,BENCHMARK_TRAFO,BENCHMARK_CABLE_2,0.02
L130_F055,lv,55,130,BENCHMARK_TRAFO,BENCHMARK_CABLE_2,0.02
L140_F055,lv,55,140,BENCHMARK_TRAFO,BENCHMARK_CABLE_2,0.02
L150_F055,lv,55,150,BENCHMARK_TRAFO,BENCHMARK_CABLE_2,0.02
L160_F055,lv,55,160,BENCHMARK_TRAFO,BENCHMARK_CABLE_2,0.02
L170_F055,lv,55,170,BENCHMARK_TRAFO,BENCHMARK_CABLE_2,0.02
L180_F055,lv,55,180,BENCHMARK_TRAFO,BENCHMARK_CABLE_2,0.02
L190_F055,lv,55,190,BENCHMARK_TRAFO,BENCHMARK_CABLE_2,0.02
L200_F055,lv,55,200,BENCHMARK_TRAFO,BENCHMARK_CABLE_2,0.02
## 60 Feeder
L010_F060,lv,60,10,BENCHMARK_TRAFO,BENCHMARK_CABLE_2,0.02
L020_F060,lv,60,20,BENCHMARK_TRAFO,BENCHMARK_CABLE_2,0.02
L030_F060,lv,60,30,BENCHMARK_TRAFO,BENCHMARK_CABLE_2,0.02
L040_F060,lv,60,40,BENCHMARK_TRAFO,BENCHMARK_CABLE_2,0.02
L050_F060,lv,60,50,BENCHMARK_TRAFO,BENCHMARK_CABLE_2,0.02
L060_F060,lv,60,60,BENCHMARK_TRAFO,BENCHMARK_CABLE_2,0.02
L070_F060,lv,60,70,BENCHMARK_TRAFO,BENCHMARK_CABLE_2,0.02
L080_F060,lv,60,80,BENCHMARK_TRAFO,BENCHMARK_CABLE_2,0.02
L090_F060,lv,60,90,BENCHMARK_TRAFO,BENCHMARK_CABLE_2,0.02
L100_F060,lv,60,100,BENCHMARK_TRAFO,BENCHMARK_CABLE_2,0.02
L110_F060,lv,60,110,BENCHMARK_TRAFO,BENCHMARK_CABLE_2,0.02
L120_F060,lv,60,120,BENCHMARK_TRAFO,BENCHMARK_CABLE_2,0.02
L130_F060,lv,60,130,BENCHMARK_TRAFO,BENCHMARK_CABLE_2,0.02
L140_F060,lv,60,140,BENCHMARK_TRAFO,BENCHMARK_CABLE_2,0.02
L150_F060,lv,60,150,BENCHMARK_TRAFO,BENCHMARK_CABLE_2,0.02
L160_F060,lv,60,160,BENCHMARK_TRAFO,BENCHMARK_CABLE_2,0.02
L170_F060,lv,60,170,BENCHMARK_TRAFO,BENCHMARK_CABLE_2,0.02
L180_F060,lv,60,180,BENCHMARK_TRAFO,BENCHMARK_CABLE_2,0.02
L190_F060,lv,60,190,BENCHMARK_TRAFO,BENCHMARK_CABLE_2,0.02
L200_F060,lv,60,200,BENCHMARK_TRAFO,BENCHMARK_CABLE_2,0.02
## 65 Feeder
L010_F065,lv,65,10,BENCHMARK_TRAFO,BENCHMARK_CABLE_2,0.02
L020_F065,lv,65,20,BENCHMARK_TRAFO,BENCHMARK_CABLE_2,0.02
L030_F065,lv,65,30,BENCHMARK_TRAFO,BENCHMARK_CABLE_2,0.02
L040_F065,lv,65,40,BENCHMARK_TRAFO,BENCHMARK_CABLE_2,0.02
L050_F065,lv,65,50,BENCHMARK_TRAFO,BENCHMARK_CABLE_2,0.02
L060_F065,lv,65,60,BENCHMARK_TRAFO,BENCHMARK_CABLE_2,0.02
L070_F065,lv,65,70,BENCHMARK_TRAFO,BENCHMARK_CABLE_2,0.02
L080_F065,lv,65,80,BENCHMARK_TRAFO,BENCHMARK_CABLE_2,0.02
L090_F065,lv,65,90,BENCHMARK_TRAFO,BENCHMARK_CABLE_2,0.02
L100_F065,lv,65,100,BENCHMARK_TRAFO,BENCHMARK_CABLE_2,0.02
L110_F065,lv,65,110,BENCHMARK_TRAFO,BENCHMARK_CABLE_2,0.02
L120_F065,lv,65,120,BENCHMARK_TRAFO,BENCHMARK_CABLE_2,0.02
L130_F065,lv,65,130,BENCHMARK_TRAFO,BENCHMARK_CABLE_2,0.02
L140_F065,lv,65,140,BENCHMARK_TRAFO,BENCHMARK_CABLE_2,0.02
L150_F065,lv,65,150,BENCHMARK_TRAFO,BENCHMARK_CABLE_2,0.02
L160_F065,lv,65,160,BENCHMARK_TRAFO,BENCHMARK_CABLE_2,0.02
L170_F065,lv,65,170,BENCHMARK_TRAFO,BENCHMARK_CABLE_2,0.02
L180_F065,lv,65,180,BENCHMARK_TRAFO,BENCHMARK_CABLE_2,0.02
L190_F065,lv,65,190,BENCHMARK_TRAFO,BENCHMARK_CABLE_2,0.02
L200_F065,lv,65,200,BENCHMARK_TRAFO,BENCHMARK_CABLE_2,0.02
## 70 Feeder
L010_F070,lv,70,10,BENCHMARK_TRAFO,BENCHMARK_CABLE_2,0.02
L020_F070,lv,70,20,BENCHMARK_TRAFO,BENCHMARK_CABLE_2,0.02
L030_F070,lv,70,30,BENCHMARK_TRAFO,BENCHMARK_CABLE_2,0.02
L040_F070,lv,70,40,BENCHMARK_TRAFO,BENCHMARK_CABLE_2,0.02
L050_F070,lv,70,50,BENCHMARK_TRAFO,BENCHMARK_CABLE_2,0.02
L060_F070,lv,70,60,BENCHMARK_TRAFO,BENCHMARK_CABLE_2,0.02
L070_F070,lv,70,70,BENCHMARK_TRAFO,BENCHMARK_CABLE_2,0.02
L080_F070,lv,70,80,BENCHMARK_TRAFO,BENCHMARK_CABLE_2,0.02
L090_F070,lv,70,90,BENCHMARK_TRAFO,BENCHMARK_CABLE_2,0.02
L100_F070,lv,70,100,BENCHMARK_TRAFO,BENCHMARK_CABLE_2,0.02
L110_F070,lv,70,110,BENCHMARK_TRAFO,BENCHMARK_CABLE_2,0.02
L120_F070,lv,70,120,BENCHMARK_TRAFO,BENCHMARK_CABLE_2,0.02
L130_F070,lv,70,130,BENCHMARK_TRAFO,BENCHMARK_CABLE_2,0.02
L140_F070,lv,70,140,BENCHMARK_TRAFO,BENCHMARK_CABLE_2,0.02
L150_F070,lv,70,150,BENCHMARK_TRAFO,BENCHMARK_CABLE_2,0.02
L160_F070,lv,70,160,BENCHMARK_TRAFO,BENCHMARK_CABLE_2,0.02
L170_F070,lv,70,170,BENCHMARK_TRAFO,BENCHMARK_CABLE_2,0.02
L180_F070,lv,70,180,BENCHMARK_TRAFO,BENCHMARK_CABLE_2,0.02
L190_F070,lv,70,190,BENCHMARK_TRAFO,BENCHMARK_CABLE_2,0.02
L200_F070,lv,70,200,BENCHMARK_TRAFO,BENCHMARK_CABLE_2,0.02
## 72 Feeder
L010_F072,lv,72,10,BENCHMARK_TRAFO,BENCHMARK_CABLE_2,0.02
L020_F072,lv,72,20,BENCHMARK_TRAFO,BENCHMARK_CABLE_2,0.02
L030_F072,lv,72,30,BENCHMARK_TRAFO,BENCHMARK_CABLE_2,0.02
L040_F072,lv,72,40,BENCHMARK_TRAFO,BENCHMARK_CABLE_2,0.02
L050_F072,lv,72,50,BENCHMARK_TRAFO,BENCHMARK_CABLE_2,0.02
L060_F072,lv,72,60,BENCHMARK_TRAFO,BENCHMARK_CABLE_2,0.02
L070_F072,lv,72,70,BENCHMARK_TRAFO,BENCHMARK_CABLE_2,0.02
L080_F072,lv,72,80,BENCHMARK_TRAFO,BENCHMARK_CABLE_2,0.02
L090_F072,lv,72,90,BENCHMARK_TRAFO,BENCHMARK_CABLE_2,0.02
L100_F072,lv,72,100,BENCHMARK_TRAFO,BENCHMARK_CABLE_2,0.02
L110_F072,lv,72,110,BENCHMARK_TRAFO,BENCHMARK_CABLE_2,0.02
L120_F072,lv,72,120,BENCHMARK_TRAFO,BENCHMARK_CABLE_2,0.02
L130_F072,lv,72,130,BENCHMARK_TRAFO,BENCHMARK_CABLE_2,0.02
L140_F072,lv,72,140,BENCHMARK_TRAFO,BENCHMARK_CABLE_2,0.02
L150_F072,lv,72,150,BENCHMARK_TRAFO,BENCHMARK_CABLE_2,0.02
L160_F072,lv,72,160,BENCHMARK_TRAFO,BENCHMARK_CABLE_2,0.02
L170_F072,lv,72,170,BENCHMARK_TRAFO,BENCHMARK_CABLE_2,0.02
L180_F072,lv,72,180,BENCHMARK_TRAFO,BENCHMARK_CABLE_2,0.02
L190_F072,lv,72,190,BENCHMARK_TRAFO,BENCHMARK_CABLE_2,0.02
L200_F072,lv,72,200,BENCHMARK_TRAFO,BENCHMARK_CABLE_2,0.02
## 75 Feeder
L010_F075,lv,75,10,BENCHMARK_TRAFO,BENCHMARK_CABLE_2,0.02
L020_F075,lv,75,20,BENCHMARK_TRAFO,BENCHMARK_CABLE_2,0.02
L030_F075,lv,75,30,BENCHMARK_TRAFO,BENCHMARK_CABLE_2,0.02
L040_F075,lv,75,40,BENCHMARK_TRAFO,BENCHMARK_CABLE_2,0.02
L050_F075,lv,75,50,BENCHMARK_TRAFO,BENCHMARK_CABLE_2,0.02
L060_F075,lv,75,60,BENCHMARK_TRAFO,BENCHMARK_CABLE_2,0.02
L070_F075,lv,75,70,BENCHMARK_TRAFO,BENCHMARK_CABLE_2,0.02
L080_F075,lv,75,80,BENCHMARK_TRAFO,BENCHMARK_CABLE_2,0.02
L090_F075,lv,75,90,BENCHMARK_TRAFO,BENCHMARK_CABLE_2,0.02
L100_F075,lv,75,100,BENCHMARK_TRAFO,BENCHMARK_CABLE_2,0.02
L110_F075,lv,75,110,BENCHMARK_TRAFO,BENCHMARK_CABLE_2,0.02
L120_F075,lv,75,120,BENCHMARK_TRAFO,BENCHMARK_CABLE_2,0.02
L130_F075,lv,75,130,BENCHMARK_TRAFO,BENCHMARK_CABLE_2,0.02
L140_F075,lv,75,140,BENCHMARK_TRAFO,BENCHMARK_CABLE_2,0.02
L150_F075,lv,75,150,BENCHMARK_TRAFO,BENCHMARK_CABLE_2,0.02
L160_F075,lv,75,160,BENCHMARK_TRAFO,BENCHMARK_CABLE_2,0.02
L170_F075,lv,75,170,BENCHMARK_TRAFO,BENCHMARK_CABLE_2,0.02
L180_F075,lv,75,180,BENCHMARK_TRAFO,BENCHMARK_CABLE_2,0.02
L190_F075,lv,75,190,BENCHMARK_TRAFO,BENCHMARK_CABLE_2,0.02
L200_F075,lv,75,200,BENCHMARK_TRAFO,BENCHMARK_CABLE_2,0.02
## 80 Feeder
L010_F080,lv,80,10,BENCHMARK_TRAFO,BENCHMARK_CABLE_2,0.02
L020_F080,lv,80,20,BENCHMARK_TRAFO,BENCHMARK_CABLE_2,0.02
L030_F080,lv,80,30,BENCHMARK_TRAFO,BENCHMARK_CABLE_2,0.02
L040_F080,lv,80,40,BENCHMARK_TRAFO,BENCHMARK_CABLE_2,0.02
L050_F080,lv,80,50,BENCHMARK_TRAFO,BENCHMARK_CABLE_2,0.02
L060_F080,lv,80,60,BENCHMARK_TRAFO,BENCHMARK_CABLE_2,0.02
L070_F080,lv,80,70,BENCHMARK_TRAFO,BENCHMARK_CABLE_2,0.02
L080_F080,lv,80,80,BENCHMARK_TRAFO,BENCHMARK_CABLE_2,0.02
L090_F080,lv,80,90,BENCHMARK_TRAFO,BENCHMARK_CABLE_2,0.02
L100_F080,lv,80,100,BENCHMARK_TRAFO,BENCHMARK_CABLE_2,0.02
L110_F080,lv,80,110,BENCHMARK_TRAFO,BENCHMARK_CABLE_2,0.02
L120_F080,lv,80,120,BENCHMARK_TRAFO,BENCHMARK_CABLE_2,0.02
L130_F080,lv,80,130,BENCHMARK_TRAFO,BENCHMARK_CABLE_2,0.02
L140_F080,lv,80,140,BENCHMARK_TRAFO,BENCHMARK_CABLE_2,0.02
L150_F080,lv,80,150,BENCHMARK_TRAFO,BENCHMARK_CABLE_2,0.02
L160_F080,lv,80,160,BENCHMARK_TRAFO,BENCHMARK_CABLE_2,0.02
L170_F080,lv,80,170,BENCHMARK_TRAFO,BENCHMARK_CABLE_2,0.02
L180_F080,lv,80,180,BENCHMARK_TRAFO,BENCHMARK_CABLE_2,0.02
L190_F080,lv,80,190,BENCHMARK_TRAFO,BENCHMARK_CABLE_2,0.02
L200_F080,lv,80,200,BENCHMARK_TRAFO,BENCHMARK_CABLE_2,0.02
## 85 Feeder
L010_F085,lv,85,10,BENCHMARK_TRAFO,BENCHMARK_CABLE_2,0.02
L020_F085,lv,85,20,BENCHMARK_TRAFO,BENCHMARK_CABLE_2,0.02
L030_F085,lv,85,30,BENCHMARK_TRAFO,BENCHMARK_CABLE_2,0.02
L040_F085,lv,85,40,BENCHMARK_TRAFO,BENCHMARK_CABLE_2,0.02
L050_F085,lv,85,50,BENCHMARK_TRAFO,BENCHMARK_CABLE_2,0.02
L060_F085,lv,85,60,BENCHMARK_TRAFO,BENCHMARK_CABLE_2,0.02
L070_F085,lv,85,70,BENCHMARK_TRAFO,BENCHMARK_CABLE_2,0.02
L080_F085,lv,85,80,BENCHMARK_TRAFO,BENCHMARK_CABLE_2,0.02
L090_F085,lv,85,90,BENCHMARK_TRAFO,BENCHMARK_CABLE_2,0.02
L100_F085,lv,85,100,BENCHMARK_TRAFO,BENCHMARK_CABLE_2,0.02
L110_F085,lv,85,110,BENCHMARK_TRAFO,BENCHMARK_CABLE_2,0.02
L120_F085,lv,85,120,BENCHMARK_TRAFO,BENCHMARK_CABLE_2,0.02
L130_F085,lv,85,130,BENCHMARK_TRAFO,BENCHMARK_CABLE_2,0.02
L140_F085,lv,85,140,BENCHMARK_TRAFO,BENCHMARK_CABLE_2,0.02
L150_F085,lv,85,150,BENCHMARK_TRAFO,BENCHMARK_CABLE_2,0.02
L160_F085,lv,85,160,BENCHMARK_TRAFO,BENCHMARK_CABLE_2,0.02
L170_F085,lv,85,170,BENCHMARK_TRAFO,BENCHMARK_CABLE_2,0.02
L180_F085,lv,85,180,BENCHMARK_TRAFO,BENCHMARK_CABLE_2,0.02
L190_F085,lv,85,190,BENCHMARK_TRAFO,BENCHMARK_CABLE_2,0.02
L200_F085,lv,85,200,BENCHMARK_TRAFO,BENCHMARK_CABLE_2,0.02
## 90 Feeder
L010_F090,lv,90,10,BENCHMARK_TRAFO,BENCHMARK_CABLE_2,0.02
L020_F090,lv,90,20,BENCHMARK_TRAFO,BENCHMARK_CABLE_2,0.02
L030_F090,lv,90,30,BENCHMARK_TRAFO,BENCHMARK_CABLE_2,0.02
L040_F090,lv,90,40,BENCHMARK_TRAFO,BENCHMARK_CABLE_2,0.02
L050_F090,lv,90,50,BENCHMARK_TRAFO,BENCHMARK_CABLE_2,0.02
L060_F090,lv,90,60,BENCHMARK_TRAFO,BENCHMARK_CABLE_2,0.02
L070_F090,lv,90,70,BENCHMARK_TRAFO,BENCHMARK_CABLE_2,0.02
L080_F090,lv,90,80,BENCHMARK_TRAFO,BENCHMARK_CABLE_2,0.02
L090_F090,lv,90,90,BENCHMARK_TRAFO,BENCHMARK_CABLE_2,0.02
L100_F090,lv,90,100,BENCHMARK_TRAFO,BENCHMARK_CABLE_2,0.02
L110_F090,lv,90,110,BENCHMARK_TRAFO,BENCHMARK_CABLE_2,0.02
L120_F090,lv,90,120,BENCHMARK_TRAFO,BENCHMARK_CABLE_2,0.02
L130_F090,lv,90,130,BENCHMARK_TRAFO,BENCHMARK_CABLE_2,0.02
L140_F090,lv,90,140,BENCHMARK_TRAFO,BENCHMARK_CABLE_2,0.02
L150_F090,lv,90,150,BENCHMARK_TRAFO,BENCHMARK_CABLE_2,0.02
L160_F090,lv,90,160,BENCHMARK_TRAFO,BENCHMARK_CABLE_2,0.02
L170_F090,lv,90,170,BENCHMARK_TRAFO,BENCHMARK_CABLE_2,0.02
L180_F090,lv,90,180,BENCHMARK_TRAFO,BENCHMARK_CABLE_2,0.02
L190_F090,lv,90,190,BENCHMARK_TRAFO,BENCHMARK_CABLE_2,0.02
L200_F090,lv,90,200,BENCHMARK_TRAFO,BENCHMARK_CABLE_2,0.02
## 95 Feeder
L010_F095,lv,95,10,BENCHMARK_TRAFO,BENCHMARK_CABLE_2,0.02
L020_F095,lv,95,20,BENCHMARK_TRAFO,BENCHMARK_CABLE_2,0.02
L030_F095,lv,95,30,BENCHMARK_TRAFO,BENCHMARK_CABLE_2,0.02
L040_F095,lv,95,40,BENCHMARK_TRAFO,BENCHMARK_CABLE_2,0.02
L050_F095,lv,95,50,BENCHMARK_TRAFO,BENCHMARK_CABLE_2,0.02
L060_F095,lv,95,60,BENCHMARK_TRAFO,BENCHMARK_CABLE_2,0.02
L070_F095,lv,95,70,BENCHMARK_TRAFO,BENCHMARK_CABLE_2,0.02
L080_F095,lv,95,80,BENCHMARK_TRAFO,BENCHMARK_CABLE_2,0.02
L090_F095,lv,95,90,BENCHMARK_TRAFO,BENCHMARK_CABLE_2,0.02
L100_F095,lv,95,100,BENCHMARK_TRAFO,BENCHMARK_CABLE_2,0.02
L110_F095,lv,95,110,BENCHMARK_TRAFO,BENCHMARK_CABLE_2,0.02
L120_F095,lv,95,120,BENCHMARK_TRAFO,BENCHMARK_CABLE_2,0.02
L130_F095,lv,95,130,BENCHMARK_TRAFO,BENCHMARK_CABLE_2,0.02
L140_F095,lv,95,140,BENCHMARK_TRAFO,BENCHMARK_CABLE_2,0.02
L150_F095,lv,95,150,BENCHMARK_TRAFO,BENCHMARK_CABLE_2,0.02
L160_F095,lv,95,160,BENCHMARK_TRAFO,BENCHMARK_CABLE_2,0.02
L170_F095,lv,95,170,BENCHMARK_TRAFO,BENCHMARK_CABLE_2,0.02
L180_F095,lv,95,180,BENCHMARK_TRAFO,BENCHMARK_CABLE_2,0.02
L190_F095,lv,95,190,BENCHMARK_TRAFO,BENCHMARK_CABLE_2,0.02
L200_F095,lv,95,200,BENCHMARK_TRAFO,BENCHMARK_CABLE_2,0.02
## 96 Feeder
L010_F096,lv,96,10,BENCHMARK_TRAFO,BENCHMARK_CABLE_2,0.02
L020_F096,lv,96,20,BENCHMARK_TRAFO,BENCHMARK_CABLE_2,0.02
L030_F096,lv,96,30,BENCHMARK_TRAFO,BENCHMARK_CABLE_2,0.02
L040_F096,lv,96,40,BENCHMARK_TRAFO,BENCHMARK_CABLE_2,0.02
L050_F096,lv,96,50,BENCHMARK_TRAFO,BENCHMARK_CABLE_2,0.02
L060_F096,lv,96,60,BENCHMARK_TRAFO,BENCHMARK_CABLE_2,0.02
L070_F096,lv,96,70,BENCHMARK_TRAFO,BENCHMARK_CABLE_2,0.02
L080_F096,lv,96,80,BENCHMARK_TRAFO,BENCHMARK_CABLE_2,0.02
L090_F096,lv,96,90,BENCHMARK_TRAFO,BENCHMARK_CABLE_2,0.02
L100_F096,lv,96,100,BENCHMARK_TRAFO,BENCHMARK_CABLE_2,0.02
L110_F096,lv,96,110,BENCHMARK_TRAFO,BENCHMARK_CABLE_2,0.02
L120_F096,lv,96,120,BENCHMARK_TRAFO,BENCHMARK_CABLE_2,0.02
L130_F096,lv,96,130,BENCHMARK_TRAFO,BENCHMARK_CABLE_2,0.02
L140_F096,lv,96,140,BENCHMARK_TRAFO,BENCHMARK_CABLE_2,0.02
L150_F096,lv,96,150,BENCHMARK_TRAFO,BENCHMARK_CABLE_2,0.02
L160_F096,lv,96,160,BENCHMARK_TRAFO,BENCHMARK_CABLE_2,0.02
L170_F096,lv,96,170,BENCHMARK_TRAFO,BENCHMARK_CABLE_2,0.02
L180_F096,lv,96,180,BENCHMARK_TRAFO,BENCHMARK_CABLE_2,0.02
L190_F096,lv,96,190,BENCHMARK_TRAFO,BENCHMARK_CABLE_2,0.02
L200_F096,lv,96,200,BENCHMARK_TRAFO,BENCHMARK_CABLE_2,0.02
## 100 Feeder
L010_F100,lv,100,10,BENCHMARK_TRAFO,BENCHMARK_CABLE_2,0.02
L020_F100,lv,100,20,BENCHMARK_TRAFO,BENCHMARK_CABLE_2,0.02
L030_F100,lv,100,30,BENCHMARK_TRAFO,BENCHMARK_CABLE_2,0.02
L040_F100,lv,100,40,BENCHMARK_TRAFO,BENCHMARK_CABLE_2,0.02
L050_F100,lv,100,50,BENCHMARK_TRAFO,BENCHMARK_CABLE_2,0.02
L060_F100,lv,100,60,BENCHMARK_TRAFO,BENCHMARK_CABLE_2,0.02
L070_F100,lv,100,70,BENCHMARK_TRAFO,BENCHMARK_CABLE_2,0.02
L080_F100,lv,100,80,BENCHMARK_TRAFO,BENCHMARK_CABLE_2,0.02
L090_F100,lv,100,90,BENCHMARK_TRAFO,BENCHMARK_CABLE_2,0.02
L100_F100,lv,100,100,BENCHMARK_TRAFO,BENCHMARK_CABLE_2,0.02
L110_F100,lv,100,110,BENCHMARK_TRAFO,BENCHMARK_CABLE_2,0.02
L120_F100,lv,100,120,BENCHMARK_TRAFO,BENCHMARK_CABLE_2,0.02
L130_F100,lv,100,130,BENCHMARK_TRAFO,BENCHMARK_CABLE_2,0.02
L140_F100,lv,100,140,BENCHMARK_TRAFO,BENCHMARK_CABLE_2,0.02
L150_F100,lv,100,150,BENCHMARK_TRAFO,BENCHMARK_CABLE_2,0.02
L160_F100,lv,100,160,BENCHMARK_TRAFO,BENCHMARK_CABLE_2,0.02
L170_F100,lv,100,170,BENCHMARK_TRAFO,BENCHMARK_CABLE_2,0.02
L180_F100,lv,100,180,BENCHMARK_TRAFO,BENCHMARK_CABLE_2,0.02
L190_F100,lv,100,190,BENCHMARK_TRAFO,BENCHMARK_CABLE_2,0.02
L200_F100,lv,100,200,BENCHMARK_TRAFO,BENCHMARK_CABLE_2,0.02