1,2,NO_LOSSES,0,0,0,0,0,0,0
2,3,NO_LOSSES,0,0,0,0,0,0,0
3,4,LV_CABLE,1.0,0.206,0.08,0,0,189750.0,189750.0
3,7,LV_CABLE,0.454167,0.206,0.08,0,0,189750.0,189750.0
3,9,LV_CABLE,0.2935,0.206,0.08,0,0,189750.0,189750.0
4,5,LV_CABLE,1.0,0.206,0.08,0,0,189750.0,189750.0
5,6,LV_CABLE,1.0,0.206,0.08,0,0,189750.0,189750.0
7,8,LV_CABLE,0.523184,0.206,0.08,0,0,189750.0,189750.0
9,10,LV_CABLE,0.2935,0.206,0.08,0,0,189750.0,189750.0
9,11,LV_CABLE,1.181658,0.206,0.08,0,0,189750.0,189750.0
11,12,LV_CABLE,0.654054,0.206,0.08,0,0,189750.0,189750.0
