1,Slack,110000
2,Transformer,HV_MV_rural,0,0,110000,20000,0.45,12,40000000,2,5
3,Node,2,0,0,20000.0
4,Node,2,0,0,20000.0
5,Node,2,0,0,20000.0
6,Node,2,0,0,20000.0
7,Node,2,0,0,20000.0
8,Node,2,0,0,20000.0
9,Node,2,0,0,20000.0
10,Node,2,0,0,20000.0
11,Node,2,0,0,20000.0
12,Node,2,0,0,20000.0
13,Node,2,0,0,20000.0
14,Node,2,0,0,20000.0
15,Node,2,0,0,20000.0
16,Node,2,0,0,20000.0
17,Node,2,0,0,20000.0
18,Node,2,0,0,20000.0
19,Node,2,0,0,20000.0
20,Node,2,0,0,20000.0
21,Node,2,0,0,20000.0
22,Node,2,0,0,20000.0
23,Node,2,0,0,20000.0
24,Node,2,0,0,20000.0
25,Node,2,0,0,20000.0
26,Node,2,0,0,20000.0
27,Node,2,0,0,20000.0
28,Node,2,0,0,20000.0
29,Node,2,0,0,20000.0
30,Node,2,0,0,20000.0
31,Node,2,0,0,20000.0
32,Node,2,0,0,20000.0
33,Node,2,0,0,20000.0
34,Node,2,0,0,20000.0
35,Node,2,0,0,20000.0
36,Node,2,0,0,20000.0
37,Node,2,0,0,20000.0
38,Node,2,0,0,20000.0
39,Node,2,0,0,20000.0
40,Node,2,0,0,20000.0
41,Node,2,0,0,20000.0
42,Node,2,0,0,20000.0
43,Node,2,0,0,20000.0
44,Node,2,0,0,20000.0
45,Node,2,0,0,20000.0
46,Node,2,0,0,20000.0
47,Node,2,0,0,20000.0
48,Node,2,0,0,20000.0
49,Node,2,0,0,20000.0
50,Node,2,0,0,20000.0
51,Node,2,0,0,20000.0
52,Node,2,0,0,20000.0
53,Node,2,0,0,20000.0
54,Node,2,0,0,20000.0
55,Node,2,0,0,20000.0
56,Node,2,0,0,20000.0
57,Node,2,0,0,20000.0
58,Node,2,0,0,20000.0
59,Node,2,0,0,20000.0
60,Node,2,0,0,20000.0
61,Node,2,0,0,20000.0
62,Node,2,0,0,20000.0
63,Node,2,0,0,20000.0
64,Node,2,0,0,20000.0
65,Node,2,0,0,20000.0
66,Node,2,0,0,20000.0
67,Node,2,0,0,20000.0
68,Node,2,0,0,20000.0
69,Node,2,0,0,20000.0
70,Node,2,0,0,20000.0
71,Node,2,0,0,20000.0
72,Node,2,0,0,20000.0
73,Node,2,0,0,20000.0
74,Node,2,0,0,20000.0
75,Node,2,0,0,20000.0
76,Node,2,0,0,20000.0
77,Node,2,0,0,20000.0
78,Node,2,0,0,20000.0
79,Node,2,0,0,20000.0
80,Node,2,0,0,20000.0
81,Node,2,0,0,20000.0
82,Node,2,0,0,20000.0
83,Node,2,0,0,20000.0
84,Node,2,0,0,20000.0
85,Node,2,0,0,20000.0
86,Node,2,0,0,20000.0
87,Node,2,0,0,20000.0
88,Node,2,0,0,20000.0
89,Node,2,0,0,20000.0
90,Node,2,0,0,20000.0
91,Node,2,0,0,20000.0
92,Node,2,0,0,20000.0
93,Node,2,0,0,20000.0
94,Node,2,0,0,20000.0
95,Node,2,0,0,20000.0
96,Node,2,0,0,20000.0
97,Node,2,0,0,20000.0
98,Node,2,0,0,20000.0
99,Node,2,0,0,20000.0
100,Node,2,0,0,20000.0
101,Node,2,0,0,20000.0
102,Node,2,0,0,20000.0
103,Node,2,0,0,20000.0
104,Node,2,0,0,20000.0
105,Node,2,0,0,20000.0
106,Node,2,0,0,20000.0
107,Node,2,0,0,20000.0
108,Node,2,0,0,20000.0
109,Node,2,0,0,20000.0
110,Node,2,0,0,20000.0
111,Node,2,0,0,20000.0
112,Node,2,0,0,20000.0
113,Node,2,0,0,20000.0
114,Node,2,0,0,20000.0
115,Node,2,0,0,20000.0
116,Node,2,0,0,20000.0
117,Node,2,0,0,20000.0
118,Node,2,0,0,20000.0
119,Node,2,0,0,20000.0
120,Node,2,0,0,20000.0
121,Node,2,0,0,20000.0
122,Node,2,0,0,20000.0
123,Node,2,0,0,20000.0
124,Node,2,0,0,20000.0
125,Node,2,0,0,20000.0
126,Node,2,0,0,20000.0
127,Node,2,0,0,20000.0
128,Node,2,0,0,20000.0
129,Node,2,0,0,20000.0
130,Node,2,0,0,20000.0
131,Node,2,0,0,20000.0
132,Node,2,0,0,20000.0
133,Node,2,0,0,20000.0
134,Node,2,0,0,20000.0
135,Node,2,0,0,20000.0
136,Node,2,0,0,20000.0
137,Node,2,0,0,20000.0
138,Node,2,0,0,20000.0
139,Node,2,0,0,20000.0
140,Node,2,0,0,20000.0
141,Node,2,0,0,20000.0
142,Node,2,0,0,20000.0
143,Node,2,0,0,20000.0
144,Node,2,0,0,20000.0
145,Node,2,0,0,20000.0
146,Node,2,0,0,20000.0
147,Node,2,0,0,20000.0
148,Node,2,0,0,20000.0
149,Node,2,0,0,20000.0
150,Node,2,0,0,20000.0
151,Node,2,0,0,20000.0
152,Node,2,0,0,20000.0
153,Node,2,0,0,20000.0
154,Node,2,0,0,20000.0
155,Node,2,0,0,20000.0
156,Node,2,0,0,20000.0
157,Node,2,0,0,20000.0
158,Node,2,0,0,20000.0
159,Node,2,0,0,20000.0
160,Node,2,0,0,20000.0
161,Node,2,0,0,20000.0
162,Node,2,0,0,20000.0
163,Node,2,0,0,20000.0
164,Node,2,0,0,20000.0
165,Node,2,0,0,20000.0
166,Node,2,0,0,20000.0
167,Node,2,0,0,20000.0
168,Node,2,0,0,20000.0
169,Node,2,0,0,20000.0
170,Node,2,0,0,20000.0
171,Node,2,0,0,20000.0
172,Node,2,0,0,20000.0
173,Node,2,0,0,20000.0
174,Node,2,0,0,20000.0
175,Node,2,0,0,20000.0
176,Node,2,0,0,20000.0
177,Node,2,0,0,20000.0
178,Node,2,0,0,20000.0
179,Node,2,0,0,20000.0
180,Node,2,0,0,20000.0
181,Node,2,0,0,20000.0
182,Node,2,0,0,20000.0
183,Node,2,0,0,20000.0
184,Node,2,0,0,20000.0
185,Node,2,0,0,20000.0
186,Node,2,0,0,20000.0
187,Node,2,0,0,20000.0
188,Node,2,0,0,20000.0
189,Node,2,0,0,20000.0
190,Node,2,0,0,20000.0
191,Node,2,0,0,20000.0
192,Node,2,0,0,20000.0
193,Node,2,0,0,20000.0
194,Node,2,0,0,20000.0
195,Node,2,0,0,20000.0
196,Node,2,0,0,20000.0
197,Node,2,0,0,20000.0
198,Node,2,0,0,20000.0
199,Node,2,0,0,20000.0
200,Node,2,0,0,20000.0
201,Node,2,0,0,20000.0
202,Node,2,0,0,20000.0
203,Node,2,0,0,20000.0
204,Node,2,0,0,20000.0
205,Node,2,0,0,20000.0
206,Node,2,0,0,20000.0
207,Node,2,0,0,20000.0
208,Node,2,0,0,20000.0
209,Node,2,0,0,20000.0
210,Node,2,0,0,20000.0
211,Node,2,0,0,20000.0
212,Node,2,0,0,20000.0
213,Node,2,0,0,20000.0
214,Node,2,0,0,20000.0
215,Node,2,0,0,20000.0
216,Node,2,0,0,20000.0
217,Node,2,0,0,20000.0
218,Node,2,0,0,20000.0
219,Node,2,0,0,20000.0
220,Node,2,0,0,20000.0
221,Node,2,0,0,20000.0
222,Node,2,0,0,20000.0
223,Node,2,0,0,20000.0
224,Node,2,0,0,20000.0
225,Node,2,0,0,20000.0
226,Node,2,0,0,20000.0
227,Node,2,0,0,20000.0
228,Node,2,0,0,20000.0
229,Node,2,0,0,20000.0
230,Node,2,0,0,20000.0
