subtype_name,profile1_id,profile2_id,profile_scale,S_r[VA],pf_min,Pnom[W],f_el,C_th[Wh],initial SOC,f_el secondary heater,Pnom secondary heater
SFH1,1,-1,1,11500,0.8,8428,0.4179104478,11667,0.5,0,0
SFH2,2,-1,1,11500,0.8,6216,0.4179104478,7000,0.5,0,0
SFH3,3,-1,1,11500,0.8,6216,0.4179104478,7000,0.5,0,0
SFH4,4,-1,1,11500,0.8,6216,0.4179104478,7000,0.5,0,0
SFH5,5,-1,1,11500,0.8,6216,0.4179104478,7000,0.5,0,0
SFH6,6,-1,1,11500,0.8,6216,0.4179104478,7000,0.5,0,0
SFH7,7,-1,1,11500,0.8,6216,0.4179104478,7000,0.5,0,0
SFH8,8,-1,1,11500,0.8,6216,0.4179104478,7000,0.5,0,0
SFH9,9,-1,1,11500,0.8,6216,0.4179104478,7000,0.5,0,0
SFH10,10,-1,1,11500,0.8,6216,0.4179104478,7000,0.5,0,0
SFH11,11,-1,1,11500,0.8,6216,0.4179104478,7000,0.5,0,0
MFH1,12,-1,1,11500,0.8,8428,0.4179104478,11667,0.5,0,0
MFH4,15,-1,1,11500,0.8,8428,0.4179104478,11667,0.5,0,0
MFH11,22,-1,1,11500,0.8,8428,0.4179104478,11667,0.5,0,0
MFH2,13,-1,1,24000,0.8,19840,0.5079365079,23333,0.5,0,0
MFH3,14,-1,1,24000,0.8,19840,0.5079365079,23333,0.5,0,0
MFH5,16,-1,1,24000,0.8,19840,0.5079365079,23333,0.5,0,0
MFH6,17,-1,1,24000,0.8,19840,0.5079365079,23333,0.5,0,0
MFH7,18,-1,1,24000,0.8,19840,0.5079365079,23333,0.5,0,0
MFH8,19,-1,1,24000,0.8,19840,0.5079365079,23333,0.5,0,0
MFH9,20,-1,1,24000,0.8,19840,0.5079365079,23333,0.5,0,0
MFH10,21,-1,1,24000,0.8,19840,0.5079365079,23333,0.5,0,0
