1,Slack,110000
2,Transformer,HV_MV_city,0,0,110000,10000,0.45,12,40000000,2,5
3,Node,2,0,0,10000.0
4,Node,2,0,0,10000.0
5,Node,2,0,0,10000.0
6,Node,2,0,0,10000.0
7,Node,2,0,0,10000.0
8,Node,2,0,0,10000.0
9,Node,2,0,0,10000.0
10,Node,2,0,0,10000.0
11,Node,2,0,0,10000.0
12,Node,2,0,0,10000.0
13,Node,2,0,0,10000.0
14,Node,2,0,0,10000.0
15,Node,2,0,0,10000.0
16,Node,2,0,0,10000.0
17,Node,2,0,0,10000.0
18,Node,2,0,0,10000.0
19,Node,2,0,0,10000.0
20,Node,2,0,0,10000.0
21,Node,2,0,0,10000.0
22,Node,2,0,0,10000.0
23,Node,2,0,0,10000.0
24,Node,2,0,0,10000.0
25,Node,2,0,0,10000.0
26,Node,2,0,0,10000.0
27,Node,2,0,0,10000.0
28,Node,2,0,0,10000.0
29,Node,2,0,0,10000.0
30,Node,2,0,0,10000.0
31,Node,2,0,0,10000.0
32,Node,2,0,0,10000.0
33,Node,2,0,0,10000.0
34,Node,2,0,0,10000.0
35,Node,2,0,0,10000.0
36,Node,2,0,0,10000.0
37,Node,2,0,0,10000.0
38,Node,2,0,0,10000.0
39,Node,2,0,0,10000.0
40,Node,2,0,0,10000.0
41,Node,2,0,0,10000.0
42,Node,2,0,0,10000.0
43,Node,2,0,0,10000.0
44,Node,2,0,0,10000.0
45,Node,2,0,0,10000.0
46,Node,2,0,0,10000.0
47,Node,2,0,0,10000.0
48,Node,2,0,0,10000.0
49,Node,2,0,0,10000.0
