4,gentest_lv1_comp
6,gentest_lv1_comp
7,gentest_lv2_comp
8,gentest_lv1_comp
9,gentest_lv2_comp
10,gentest_lv2_comp
11,gentest_lv1_comp
16,gentest_lv1_comp
17,gentest_lv2_comp
18,gentest_lv2_comp
19,gentest_lv1_comp
20,gentest_lv1_comp
21,gentest_lv2_comp
23,gentest_lv1_comp
26,gentest_lv2_comp
27,gentest_lv1_comp
