subtype_name,profile1_id,profile2_id,profile_scale,S_r[VA],P_in_max[W],pf_min,C_nom[Wh],init SOC
19kWh,1,1,6400,3700,3500,0.8,18800,0.5
24kWh,1,1,6400,3700,3500,0.8,24000,0.5
60kWh,1,1,7400,11000,10400,0.8,60000,0.5
