time,th_sfh1,th_sfh2,th_sfh3,th_sfh4,th_sfh5,th_sfh6,th_sfh7,th_sfh8,th_sfh9,th_sfh10,th_sfh11,th_mfh1,th_mfh2,th_mfh3,th_mfh4,th_mfh5,th_mfh6,th_mfh7,th_mfh8,th_mfh9,th_mfh10,th_mfh11
0,1182,484,521,630,613,472,349,298,414,355,225,1523,2326,9419,1465,1787,2188,1970,3279,2569,2597,1321
3600,1281,524,565,683,665,511,379,323,449,384,244,1651,2521,10210,1587,1936,2371,2135,3554,2784,2815,1432
7200,1372,561,605,731,712,547,405,346,481,412,261,1768,2700,10934,1700,2074,2540,2287,3806,2982,3014,1534
10800,1644,673,725,877,853,656,486,415,576,493,313,2119,3236,13108,2038,2486,3045,2742,4563,3575,3614,1838
14400,2470,1011,1090,1318,1282,986,730,624,866,741,470,3184,4863,19695,3062,3736,4575,4119,6855,5371,5430,2762
18000,4478,1833,1975,2388,2324,1788,1324,1131,1570,1344,852,5772,8815,35701,5551,6771,8292,7467,12427,9736,9842,5007
21600,5676,2324,2503,3027,2946,2266,1678,1434,1990,1703,1080,7316,11173,45252,7036,8583,10511,9465,15751,12341,12476,6347
25200,5585,2286,2463,2979,2899,2230,1651,1411,1958,1676,1063,7199,10994,44527,6923,8446,10342,9314,15499,12144,12276,6245
28800,4767,1952,2103,2543,2474,1903,1409,1204,1671,1431,907,6145,9384,38006,5910,7209,8828,7950,13229,10365,10478,5331
32400,4346,1779,1917,2318,2256,1735,1285,1098,1523,1304,827,5602,8554,34647,5387,6572,8047,7247,12060,9449,9552,4860
36000,3933,1610,1735,2097,2041,1570,1163,993,1379,1180,749,5069,7741,31353,4875,5947,7283,6558,10914,8551,8644,4398
39600,3594,1471,1585,1917,1865,1435,1063,908,1260,1079,684,4633,7075,28653,4455,5435,6655,5993,9974,7814,7899,4019
43200,3429,1404,1512,1829,1780,1369,1014,866,1202,1029,653,4420,6749,27335,4250,5185,6349,5718,9515,7455,7536,3834
46800,3322,1360,1465,1771,1724,1326,982,839,1164,997,632,4281,6538,26479,4117,5022,6150,5539,9217,7222,7300,3714
50400,3297,1350,1454,1758,1711,1316,975,833,1156,989,627,4249,6489,26281,4086,4985,6104,5497,9148,7168,7246,3686
54000,3429,1404,1512,1829,1780,1369,1014,866,1202,1029,653,4420,6749,27335,4250,5185,6349,5718,9515,7455,7536,3834
57600,3652,1495,1611,1948,1895,1458,1080,922,1280,1096,695,4707,7188,29114,4527,5522,6762,6090,10134,7940,8027,4083
61200,3958,1620,1745,2111,2054,1580,1170,1000,1387,1188,753,5101,7790,31551,4906,5984,7328,6599,10982,8605,8698,4425
64800,4272,1749,1884,2278,2217,1705,1263,1079,1497,1282,813,5506,8408,34054,5295,6459,7910,7123,11854,9287,9388,4776
68400,4569,1870,2015,2437,2371,1824,1351,1154,1602,1371,870,5889,8994,36425,5664,6909,8461,7619,12679,9934,10042,5109
72000,4420,1810,1950,2357,2294,1764,1307,1116,1550,1327,841,5698,8701,35240,5479,6684,8185,7371,12266,9611,9715,4943
75600,3908,1600,1724,2084,2028,1560,1155,987,1370,1173,744,5037,7693,31156,4844,5909,7237,6517,10845,8497,8589,4370
79200,2578,1055,1137,1375,1338,1029,762,651,904,774,491,3323,5074,20551,3195,3898,4773,4299,7153,5605,5666,2882
82800,1462,599,645,780,759,584,432,369,513,439,278,1885,2879,11659,1813,2211,2708,2439,4058,3180,3214,1635
86400,1182,484,521,630,613,472,349,298,414,355,225,1523,2326,9419,1465,1787,2188,1970,3279,2569,2597,1321