{
  "id": "urn:ngsi-ld:Floor:01",
    "type": "Floor",
    "inBuilding": {
        "type": "Relationship",
        "object": "urn:ngsi-ld:Building:01"
    },
   "hasRoom": {
         "type": "Relationship",
        "object": [
            "urn:ngsi-ld:Room:01",
            "urn:ngsi-ld:Room:02"
        ]
    },
   "hasZone": {
         "type": "Relationship",
        "object": [
            "urn:ngsi-ld:Zone:01",
            "urn:ngsi-ld:Zone:02"
        ]
    }
},
  "@context": [
         "https://raw.githubusercontent.com/N5GEH/SARGON/master/Resources/Context-Information/Core-Context.NGSILd.jsonld",
         "https://raw.githubusercontent.com/N5GEH/SARGON/master/Resources/Context-Information/Building/Building.jsonld"
  ]
}
