M48
; DRILL file {KiCad 8.0.1} date 2024-05-02T14:14:19+0200
; FORMAT={-:-/ absolute / metric / decimal}
; #@! TF.CreationDate,2024-05-02T14:14:19+02:00
; #@! TF.GenerationSoftware,Kicad,Pcbnew,8.0.1
; #@! TF.FileFunction,Plated,1,2,PTH
FMAT,2
METRIC
; #@! TA.AperFunction,Plated,PTH,ViaDrill
T1C0.500
; #@! TA.AperFunction,Plated,PTH,ComponentDrill
T2C0.800
; #@! TA.AperFunction,Plated,PTH,ComponentDrill
T3C1.000
; #@! TA.AperFunction,Plated,PTH,ComponentDrill
T4C1.100
%
G90
G05
T1
X132.5Y-78.75
X132.5Y-81.25
X132.5Y-91.75
X132.5Y-94.25
X132.5Y-104.75
X132.5Y-107.25
X133.75Y-78.75
X133.75Y-81.25
X133.75Y-91.75
X133.75Y-94.25
X133.75Y-104.75
X133.75Y-107.25
X135.0Y-78.75
X135.0Y-81.25
X135.0Y-91.75
X135.0Y-94.25
X135.0Y-104.75
X135.0Y-107.25
X136.25Y-78.75
X136.25Y-81.25
X136.25Y-91.75
X136.25Y-94.25
X136.25Y-104.75
X136.25Y-107.25
X137.5Y-78.75
X137.5Y-81.25
X137.5Y-91.75
X137.5Y-94.25
X137.5Y-104.75
X137.5Y-107.25
X168.5Y-78.75
X168.5Y-81.25
X168.5Y-91.75
X168.5Y-94.25
X168.5Y-104.75
X168.5Y-107.25
X169.75Y-78.75
X169.75Y-81.25
X169.75Y-91.75
X169.75Y-94.25
X169.75Y-104.75
X169.75Y-107.25
X171.0Y-78.75
X171.0Y-81.25
X171.0Y-91.75
X171.0Y-94.25
X171.0Y-104.75
X171.0Y-107.25
X172.25Y-78.75
X172.25Y-81.25
X172.25Y-91.75
X172.25Y-94.25
X172.25Y-104.75
X172.25Y-107.25
X173.5Y-78.75
X173.5Y-81.25
X173.5Y-91.75
X173.5Y-94.25
X173.5Y-104.75
X173.5Y-107.25
T2
X161.25Y-71.0
X161.25Y-84.0
X161.25Y-97.0
X161.25Y-110.0
X166.25Y-71.0
X166.25Y-84.0
X166.25Y-97.0
X166.25Y-110.0
T3
X136.025Y-72.25
X136.025Y-74.79
X136.025Y-85.25
X136.025Y-87.79
X136.025Y-98.25
X136.025Y-100.79
X136.025Y-111.25
X136.025Y-113.79
X139.75Y-72.225
X139.75Y-74.765
X139.75Y-85.225
X139.75Y-87.765
X139.75Y-98.225
X139.75Y-100.765
X139.75Y-111.225
X139.75Y-113.765
X147.0Y-74.725
X147.0Y-77.265
X147.0Y-87.725
X147.0Y-90.265
X147.0Y-100.725
X147.0Y-103.265
X147.0Y-113.725
X147.0Y-116.265
X162.47Y-88.0
X162.47Y-101.0
X162.475Y-75.0
X162.475Y-114.0
X165.01Y-88.0
X165.01Y-101.0
X165.015Y-75.0
X165.015Y-114.0
X171.275Y-72.25
X171.275Y-74.79
X171.275Y-85.25
X171.275Y-87.79
X171.275Y-98.25
X171.275Y-100.79
X171.275Y-111.25
X171.275Y-113.79
T4
X151.0Y-77.0
X151.0Y-90.0
X151.0Y-103.0
X151.0Y-116.0
X153.5Y-72.0
X153.5Y-85.0
X153.5Y-98.0
X153.5Y-111.0
X156.0Y-77.0
X156.0Y-90.0
X156.0Y-103.0
X156.0Y-116.0
M30
