(footprint "SOP65P780X200-28N"
	(version 20240108)
	(generator "pcbnew")
	(generator_version "8.0")
	(layer "F.Cu")
	(descr "SSOP-28")
	(tags "Integrated Circuit")
	(property "Reference" "IC**"
		(at 0 0 0)
		(layer "F.SilkS")
		(uuid "4dc26028-5061-4e88-8d81-07ac00366a67")
		(effects
			(font
				(size 1.27 1.27)
				(thickness 0.254)
			)
		)
	)
	(property "Value" "SOP65P780X200-28N"
		(at 0 0 0)
		(layer "F.SilkS")
		(hide yes)
		(uuid "d85a8b29-f7ab-445a-be9d-702060c589d4")
		(effects
			(font
				(size 1.27 1.27)
				(thickness 0.254)
			)
		)
	)
	(property "Footprint" ""
		(at 0 0 0)
		(unlocked yes)
		(layer "F.Fab")
		(hide yes)
		(uuid "f423f550-30bb-431d-b7d0-5ed1e9bab41d")
		(effects
			(font
				(size 1.27 1.27)
			)
		)
	)
	(property "Datasheet" ""
		(at 0 0 0)
		(unlocked yes)
		(layer "F.Fab")
		(hide yes)
		(uuid "5052f39e-efbd-4570-ac34-415d25460c3f")
		(effects
			(font
				(size 1.27 1.27)
			)
		)
	)
	(property "Description" ""
		(at 0 0 0)
		(unlocked yes)
		(layer "F.Fab")
		(hide yes)
		(uuid "610bc77b-9785-4b3d-bcd2-3cca34a55b85")
		(effects
			(font
				(size 1.27 1.27)
			)
		)
	)
	(attr smd)
	(fp_line
		(start -4.375 -4.8)
		(end -2.65 -4.8)
		(stroke
			(width 0.2)
			(type solid)
		)
		(layer "F.SilkS")
		(uuid "f4711ad8-64d8-4f86-bc38-9cfe0f82a816")
	)
	(fp_line
		(start -2.3 -5.1)
		(end 2.3 -5.1)
		(stroke
			(width 0.2)
			(type solid)
		)
		(layer "F.SilkS")
		(uuid "02882c07-2555-4fa4-91c6-812951a820bc")
	)
	(fp_line
		(start -2.3 5.1)
		(end -2.3 -5.1)
		(stroke
			(width 0.2)
			(type solid)
		)
		(layer "F.SilkS")
		(uuid "802b17d8-0af9-4603-9caf-b2954703a1ee")
	)
	(fp_line
		(start 2.3 -5.1)
		(end 2.3 5.1)
		(stroke
			(width 0.2)
			(type solid)
		)
		(layer "F.SilkS")
		(uuid "517a84eb-5c88-4822-a827-a0be4b099d5c")
	)
	(fp_line
		(start 2.3 5.1)
		(end -2.3 5.1)
		(stroke
			(width 0.2)
			(type solid)
		)
		(layer "F.SilkS")
		(uuid "c8cce76d-1d30-461f-b52b-51c18ced704d")
	)
	(fp_line
		(start -4.625 -5.45)
		(end 4.625 -5.45)
		(stroke
			(width 0.05)
			(type solid)
		)
		(layer "F.CrtYd")
		(uuid "1566347b-36c8-45cd-8789-e2c71963f280")
	)
	(fp_line
		(start -4.625 5.45)
		(end -4.625 -5.45)
		(stroke
			(width 0.05)
			(type solid)
		)
		(layer "F.CrtYd")
		(uuid "e8488509-80b7-407d-a595-cbba952aa7f5")
	)
	(fp_line
		(start 4.625 -5.45)
		(end 4.625 5.45)
		(stroke
			(width 0.05)
			(type solid)
		)
		(layer "F.CrtYd")
		(uuid "699bc74e-7f85-4aa5-b608-0c012f43a46a")
	)
	(fp_line
		(start 4.625 5.45)
		(end -4.625 5.45)
		(stroke
			(width 0.05)
			(type solid)
		)
		(layer "F.CrtYd")
		(uuid "ecc71681-47e5-4d46-98a8-77a75702230a")
	)
	(fp_line
		(start -2.65 -5.1)
		(end 2.65 -5.1)
		(stroke
			(width 0.1)
			(type solid)
		)
		(layer "F.Fab")
		(uuid "f208b619-60cd-488a-b011-88fef169b052")
	)
	(fp_line
		(start -2.65 -4.45)
		(end -2 -5.1)
		(stroke
			(width 0.1)
			(type solid)
		)
		(layer "F.Fab")
		(uuid "0bf930ff-86da-4741-a063-1e27949a1c72")
	)
	(fp_line
		(start -2.65 5.1)
		(end -2.65 -5.1)
		(stroke
			(width 0.1)
			(type solid)
		)
		(layer "F.Fab")
		(uuid "35b3b022-929d-480f-b7e3-3d7b78f48452")
	)
	(fp_line
		(start 2.65 -5.1)
		(end 2.65 5.1)
		(stroke
			(width 0.1)
			(type solid)
		)
		(layer "F.Fab")
		(uuid "b2fd1e78-2ac1-49d5-90c0-5f966450771e")
	)
	(fp_line
		(start 2.65 5.1)
		(end -2.65 5.1)
		(stroke
			(width 0.1)
			(type solid)
		)
		(layer "F.Fab")
		(uuid "1b7a2b93-34a7-4300-9d0a-b31bc5783148")
	)
	(fp_text user "${REFERENCE}"
		(at 0 0 0)
		(layer "F.Fab")
		(uuid "01c82e2b-cab8-410e-8172-fa931fb35ec2")
		(effects
			(font
				(size 1.27 1.27)
				(thickness 0.254)
			)
		)
	)
	(pad "1" smd rect
		(at -3.512 -4.225 90)
		(size 0.45 1.725)
		(layers "F.Cu" "F.Paste" "F.Mask")
		(uuid "93cd9ee0-5d62-42f1-8f5b-ae967059a308")
	)
	(pad "2" smd rect
		(at -3.512 -3.575 90)
		(size 0.45 1.725)
		(layers "F.Cu" "F.Paste" "F.Mask")
		(uuid "e6755c70-1f81-4e39-849d-bcbc472fc5fd")
	)
	(pad "3" smd rect
		(at -3.512 -2.925 90)
		(size 0.45 1.725)
		(layers "F.Cu" "F.Paste" "F.Mask")
		(uuid "8b4926b8-ae17-48ce-9cbd-14f98b4a0b3e")
	)
	(pad "4" smd rect
		(at -3.512 -2.275 90)
		(size 0.45 1.725)
		(layers "F.Cu" "F.Paste" "F.Mask")
		(uuid "c8bc49eb-eaa5-4db1-aad9-fcc46a9fd75f")
	)
	(pad "5" smd rect
		(at -3.512 -1.625 90)
		(size 0.45 1.725)
		(layers "F.Cu" "F.Paste" "F.Mask")
		(uuid "ecde0f19-9acb-4fad-a5a3-cd090f886145")
	)
	(pad "6" smd rect
		(at -3.512 -0.975 90)
		(size 0.45 1.725)
		(layers "F.Cu" "F.Paste" "F.Mask")
		(uuid "75fc3258-5e0e-4786-969c-5126120f22dc")
	)
	(pad "7" smd rect
		(at -3.512 -0.325 90)
		(size 0.45 1.725)
		(layers "F.Cu" "F.Paste" "F.Mask")
		(uuid "d08d510e-4bed-4e51-ade7-7556ce8c2202")
	)
	(pad "8" smd rect
		(at -3.512 0.325 90)
		(size 0.45 1.725)
		(layers "F.Cu" "F.Paste" "F.Mask")
		(uuid "845b23ae-17bf-4cb3-b6e2-99451c96a572")
	)
	(pad "9" smd rect
		(at -3.512 0.975 90)
		(size 0.45 1.725)
		(layers "F.Cu" "F.Paste" "F.Mask")
		(uuid "1ea0fa92-a60e-4157-87e2-f912566f06e8")
	)
	(pad "10" smd rect
		(at -3.512 1.625 90)
		(size 0.45 1.725)
		(layers "F.Cu" "F.Paste" "F.Mask")
		(uuid "d5ca6f1a-3ed8-4c41-a84d-2e56d973026c")
	)
	(pad "11" smd rect
		(at -3.512 2.275 90)
		(size 0.45 1.725)
		(layers "F.Cu" "F.Paste" "F.Mask")
		(uuid "e3028f87-276b-4ede-b9f0-97a93bd8a092")
	)
	(pad "12" smd rect
		(at -3.512 2.925 90)
		(size 0.45 1.725)
		(layers "F.Cu" "F.Paste" "F.Mask")
		(uuid "764d7bb4-4495-4485-b770-6d195003fa4c")
	)
	(pad "13" smd rect
		(at -3.512 3.575 90)
		(size 0.45 1.725)
		(layers "F.Cu" "F.Paste" "F.Mask")
		(uuid "5aa48ab7-2256-4ddc-b6c7-546b57f104db")
	)
	(pad "14" smd rect
		(at -3.512 4.225 90)
		(size 0.45 1.725)
		(layers "F.Cu" "F.Paste" "F.Mask")
		(uuid "a9bd2b67-8213-45f1-943e-aea34788a992")
	)
	(pad "15" smd rect
		(at 3.512 4.225 90)
		(size 0.45 1.725)
		(layers "F.Cu" "F.Paste" "F.Mask")
		(uuid "72bbe1b2-98be-4a6b-b54f-893d7ead83b4")
	)
	(pad "16" smd rect
		(at 3.512 3.575 90)
		(size 0.45 1.725)
		(layers "F.Cu" "F.Paste" "F.Mask")
		(uuid "e01900d1-635a-4d42-b622-4e428ab96df8")
	)
	(pad "17" smd rect
		(at 3.512 2.925 90)
		(size 0.45 1.725)
		(layers "F.Cu" "F.Paste" "F.Mask")
		(uuid "5c75bffc-d80e-417a-ac75-230a7c1414b8")
	)
	(pad "18" smd rect
		(at 3.512 2.275 90)
		(size 0.45 1.725)
		(layers "F.Cu" "F.Paste" "F.Mask")
		(uuid "716b9b7c-bc00-450b-90c1-4470009b8497")
	)
	(pad "19" smd rect
		(at 3.512 1.625 90)
		(size 0.45 1.725)
		(layers "F.Cu" "F.Paste" "F.Mask")
		(uuid "04b381f7-6b05-4004-a2f0-b69ff7e837d8")
	)
	(pad "20" smd rect
		(at 3.512 0.975 90)
		(size 0.45 1.725)
		(layers "F.Cu" "F.Paste" "F.Mask")
		(uuid "dc8b11bf-3409-4c41-91e7-e4747f19c256")
	)
	(pad "21" smd rect
		(at 3.512 0.325 90)
		(size 0.45 1.725)
		(layers "F.Cu" "F.Paste" "F.Mask")
		(uuid "bb041813-91f8-4d52-8a15-5e19be084e92")
	)
	(pad "22" smd rect
		(at 3.512 -0.325 90)
		(size 0.45 1.725)
		(layers "F.Cu" "F.Paste" "F.Mask")
		(uuid "2ba3dc1d-26c5-475e-9345-ead57517a7f3")
	)
	(pad "23" smd rect
		(at 3.512 -0.975 90)
		(size 0.45 1.725)
		(layers "F.Cu" "F.Paste" "F.Mask")
		(uuid "9e9cf633-85af-4351-84a4-15af431a0bb7")
	)
	(pad "24" smd rect
		(at 3.512 -1.625 90)
		(size 0.45 1.725)
		(layers "F.Cu" "F.Paste" "F.Mask")
		(uuid "4d2d789c-7f87-4bc5-923c-0c9486565697")
	)
	(pad "25" smd rect
		(at 3.512 -2.275 90)
		(size 0.45 1.725)
		(layers "F.Cu" "F.Paste" "F.Mask")
		(uuid "256191b6-f281-4110-9253-0a6a8a0b1df7")
	)
	(pad "26" smd rect
		(at 3.512 -2.925 90)
		(size 0.45 1.725)
		(layers "F.Cu" "F.Paste" "F.Mask")
		(uuid "0e99061b-7593-4f1a-846a-e54f91555aa6")
	)
	(pad "27" smd rect
		(at 3.512 -3.575 90)
		(size 0.45 1.725)
		(layers "F.Cu" "F.Paste" "F.Mask")
		(uuid "e9284a43-21ef-45ad-8c64-53361c9bfee7")
	)
	(pad "28" smd rect
		(at 3.512 -4.225 90)
		(size 0.45 1.725)
		(layers "F.Cu" "F.Paste" "F.Mask")
		(uuid "300b78dd-aff1-45c1-a8b5-def0a165fce5")
	)
	(model "C:\\Users\\simon\\OneDrive\\Dokumente\\ACS\\Serial_USB_Adapter\\COM485\\SamacSys_Parts.3dshapes\\FT232RNL-REEL.stp"
		(offset
			(xyz 0 0 0)
		)
		(scale
			(xyz 1 1 1)
		)
		(rotate
			(xyz 0 0 0)
		)
	)
)