{
    "application": "Platone",
    "UC_name": "optimiser",
    "UC_start": "2021-04-01T00:00:00.000Z",
    "UC_end": "2021-04-01T23:45:00.000Z",
    "id": "03098e97-9b15-466e-9d57-e87645f84207",
    "Bulk": {
        "with_bulk": false,
        "Bulk_start": "2021-04-01T13:00:00.000Z",
        "Bulk_end": "2021-04-01T17:00:00.000Z",
        "Bulk_energy_kWh": 100
    },
    "measurements": [
        {
            "Time": "2021-04-01T00:00:00.000Z",
            "Preq_kW": 0,
            "Cal_iONS_kW": 20.7
        },
        {
            "Time": "2021-04-01T00:15:00.000Z",
            "Preq_kW": 0,
            "Cal_iONS_kW": 18.675
        },
        {
            "Time": "2021-04-01T00:30:00.000Z",
            "Preq_kW": 0,
            "Cal_iONS_kW": 16.65
        },
        {
            "Time": "2021-04-01T00:45:00.000Z",
            "Preq_kW": 0,
            "Cal_iONS_kW": 14.85
        },
        {
            "Time": "2021-04-01T01:00:00.000Z",
            "Preq_kW": 0,
            "Cal_iONS_kW": 13.5
        },
        {
            "Time": "2021-04-01T01:15:00.000Z",
            "Preq_kW": 0,
            "Cal_iONS_kW": 12.6
        },
        {
            "Time": "2021-04-01T01:30:00.000Z",
            "Preq_kW": 0,
            "Cal_iONS_kW": 11.925
        },
        {
            "Time": "2021-04-01T01:45:00.000Z",
            "Preq_kW": 0,
            "Cal_iONS_kW": 11.475
        },
        {
            "Time": "2021-04-01T02:00:00.000Z",
            "Preq_kW": 0,
            "Cal_iONS_kW": 11.25
        },
        {
            "Time": "2021-04-01T02:15:00.000Z",
            "Preq_kW": 0,
            "Cal_iONS_kW": 10.8
        },
        {
            "Time": "2021-04-01T02:30:00.000Z",
            "Preq_kW": 0,
            "Cal_iONS_kW": 10.575
        },
        {
            "Time": "2021-04-01T02:45:00.000Z",
            "Preq_kW": 0,
            "Cal_iONS_kW": 10.575
        },
        {
            "Time": "2021-04-01T03:00:00.000Z",
            "Preq_kW": 0,
            "Cal_iONS_kW": 10.35
        },
        {
            "Time": "2021-04-01T03:15:00.000Z",
            "Preq_kW": 0,
            "Cal_iONS_kW": 10.35
        },
        {
            "Time": "2021-04-01T03:30:00.000Z",
            "Preq_kW": 0,
            "Cal_iONS_kW": 10.35
        },
        {
            "Time": "2021-04-01T03:45:00.000Z",
            "Preq_kW": 0,
            "Cal_iONS_kW": 10.35
        },
        {
            "Time": "2021-04-01T04:00:00.000Z",
            "Preq_kW": 0,
            "Cal_iONS_kW": 10.35
        },
        {
            "Time": "2021-04-01T04:15:00.000Z",
            "Preq_kW": 0,
            "Cal_iONS_kW": 10.35
        },
        {
            "Time": "2021-04-01T04:30:00.000Z",
            "Preq_kW": 0,
            "Cal_iONS_kW": 10.35
        },
        {
            "Time": "2021-04-01T04:45:00.000Z",
            "Preq_kW": 0,
            "Cal_iONS_kW": 10.575
        },
        {
            "Time": "2021-04-01T05:00:00.000Z",
            "Preq_kW": 0,
            "Cal_iONS_kW": 10.8
        },
        {
            "Time": "2021-04-01T05:15:00.000Z",
            "Preq_kW": 0,
            "Cal_iONS_kW": 11.025
        },
        {
            "Time": "2021-04-01T05:30:00.000Z",
            "Preq_kW": 0,
            "Cal_iONS_kW": 11.7
        },
        {
            "Time": "2021-04-01T05:45:00.000Z",
            "Preq_kW": 0,
            "Cal_iONS_kW": 12.825
        },
        {
            "Time": "2021-04-01T06:00:00.000Z",
            "Preq_kW": 0,
            "Cal_iONS_kW": 14.85
        },
        {
            "Time": "2021-04-01T06:15:00.000Z",
            "Preq_kW": 0,
            "Cal_iONS_kW": 17.55
        },
        {
            "Time": "2021-04-01T06:30:00.000Z",
            "Preq_kW": 0,
            "Cal_iONS_kW": 20.7
        },
        {
            "Time": "2021-04-01T06:45:00.000Z",
            "Preq_kW": 0,
            "Cal_iONS_kW": 24.075
        },
        {
            "Time": "2021-04-01T07:00:00.000Z",
            "Preq_kW": 0,
            "Cal_iONS_kW": 27.0
        },
        {
            "Time": "2021-04-01T07:15:00.000Z",
            "Preq_kW": 0,
            "Cal_iONS_kW": 25.0975
        },
        {
            "Time": "2021-04-01T07:30:00.000Z",
            "Preq_kW": 0,
            "Cal_iONS_kW": 22.52
        },
        {
            "Time": "2021-04-01T07:45:00.000Z",
            "Preq_kW": 0,
            "Cal_iONS_kW": 19.2675
        },
        {
            "Time": "2021-04-01T08:00:00.000Z",
            "Preq_kW": 0,
            "Cal_iONS_kW": 15.79
        },
        {
            "Time": "2021-04-01T08:15:00.000Z",
            "Preq_kW": 0,
            "Cal_iONS_kW": 4.09
        },
        {
            "Time": "2021-04-01T08:30:00.000Z",
            "Preq_kW": 0,
            "Cal_iONS_kW": -7.835
        },
        {
            "Time": "2021-04-01T08:45:00.000Z",
            "Preq_kW": 0,
            "Cal_iONS_kW": -19.985
        },
        {
            "Time": "2021-04-01T09:00:00.000Z",
            "Preq_kW": 0,
            "Cal_iONS_kW": -32.36
        },
        {
            "Time": "2021-04-01T09:15:00.000Z",
            "Preq_kW": 0,
            "Cal_iONS_kW": -43.9875
        },
        {
            "Time": "2021-04-01T09:30:00.000Z",
            "Preq_kW": 0,
            "Cal_iONS_kW": -55.84
        },
        {
            "Time": "2021-04-01T09:45:00.000Z",
            "Preq_kW": 0,
            "Cal_iONS_kW": -67.6925
        },
        {
            "Time": "2021-04-01T10:00:00.000Z",
            "Preq_kW": 0,
            "Cal_iONS_kW": -79.545
        },
        {
            "Time": "2021-04-01T10:15:00.000Z",
            "Preq_kW": 0,
            "Cal_iONS_kW": -89.3
        },
        {
            "Time": "2021-04-01T10:30:00.000Z",
            "Preq_kW": 0,
            "Cal_iONS_kW": -99.055
        },
        {
            "Time": "2021-04-01T10:45:00.000Z",
            "Preq_kW": 0,
            "Cal_iONS_kW": -108.81
        },
        {
            "Time": "2021-04-01T11:00:00.000Z",
            "Preq_kW": 0,
            "Cal_iONS_kW": -118.565
        },
        {
            "Time": "2021-04-01T11:15:00.000Z",
            "Preq_kW": 0,
            "Cal_iONS_kW": -125.3025
        },
        {
            "Time": "2021-04-01T11:30:00.000Z",
            "Preq_kW": 0,
            "Cal_iONS_kW": -131.815
        },
        {
            "Time": "2021-04-01T11:45:00.000Z",
            "Preq_kW": 0,
            "Cal_iONS_kW": -138.1025
        },
        {
            "Time": "2021-04-01T12:00:00.000Z",
            "Preq_kW": 0,
            "Cal_iONS_kW": -143.94
        },
        {
            "Time": "2021-04-01T12:15:00.000Z",
            "Preq_kW": 0,
            "Cal_iONS_kW": -145.4375
        },
        {
            "Time": "2021-04-01T12:30:00.000Z",
            "Preq_kW": 0,
            "Cal_iONS_kW": -146.935
        },
        {
            "Time": "2021-04-01T12:45:00.000Z",
            "Preq_kW": 0,
            "Cal_iONS_kW": -148.6575
        },
        {
            "Time": "2021-04-01T13:00:00.000Z",
            "Preq_kW": 0,
            "Cal_iONS_kW": -151.055
        },
        {
            "Time": "2021-04-01T13:15:00.000Z",
            "Preq_kW": 0,
            "Cal_iONS_kW": -150.43
        },
        {
            "Time": "2021-04-01T13:30:00.000Z",
            "Preq_kW": 0,
            "Cal_iONS_kW": -150.48
        },
        {
            "Time": "2021-04-01T13:45:00.000Z",
            "Preq_kW": 0,
            "Cal_iONS_kW": -150.755
        },
        {
            "Time": "2021-04-01T14:00:00.000Z",
            "Preq_kW": 0,
            "Cal_iONS_kW": -151.03
        },
        {
            "Time": "2021-04-01T14:15:00.000Z",
            "Preq_kW": 0,
            "Cal_iONS_kW": -147.325
        },
        {
            "Time": "2021-04-01T14:30:00.000Z",
            "Preq_kW": 0,
            "Cal_iONS_kW": -143.395
        },
        {
            "Time": "2021-04-01T14:45:00.000Z",
            "Preq_kW": 0,
            "Cal_iONS_kW": -139.465
        },
        {
            "Time": "2021-04-01T15:00:00.000Z",
            "Preq_kW": 0,
            "Cal_iONS_kW": -135.535
        },
        {
            "Time": "2021-04-01T15:15:00.000Z",
            "Preq_kW": 0,
            "Cal_iONS_kW": -127.7025
        },
        {
            "Time": "2021-04-01T15:30:00.000Z",
            "Preq_kW": 0,
            "Cal_iONS_kW": -120.095
        },
        {
            "Time": "2021-04-01T15:45:00.000Z",
            "Preq_kW": 0,
            "Cal_iONS_kW": -112.2625
        },
        {
            "Time": "2021-04-01T16:00:00.000Z",
            "Preq_kW": 0,
            "Cal_iONS_kW": -104.43
        },
        {
            "Time": "2021-04-01T16:15:00.000Z",
            "Preq_kW": 0,
            "Cal_iONS_kW": -93.1725
        },
        {
            "Time": "2021-04-01T16:30:00.000Z",
            "Preq_kW": 0,
            "Cal_iONS_kW": -81.915
        },
        {
            "Time": "2021-04-01T16:45:00.000Z",
            "Preq_kW": 0,
            "Cal_iONS_kW": -70.2075
        },
        {
            "Time": "2021-04-01T17:00:00.000Z",
            "Preq_kW": 0,
            "Cal_iONS_kW": -58.275
        },
        {
            "Time": "2021-04-01T17:15:00.000Z",
            "Preq_kW": 0,
            "Cal_iONS_kW": -45.25
        },
        {
            "Time": "2021-04-01T17:30:00.000Z",
            "Preq_kW": 0,
            "Cal_iONS_kW": -32.0
        },
        {
            "Time": "2021-04-01T17:45:00.000Z",
            "Preq_kW": 0,
            "Cal_iONS_kW": -18.3
        },
        {
            "Time": "2021-04-01T18:00:00.000Z",
            "Preq_kW": 0,
            "Cal_iONS_kW": -4.375
        },
        {
            "Time": "2021-04-01T18:15:00.000Z",
            "Preq_kW": 0,
            "Cal_iONS_kW": 2.6025
        },
        {
            "Time": "2021-04-01T18:30:00.000Z",
            "Preq_kW": 0,
            "Cal_iONS_kW": 9.805
        },
        {
            "Time": "2021-04-01T18:45:00.000Z",
            "Preq_kW": 0,
            "Cal_iONS_kW": 17.0075
        },
        {
            "Time": "2021-04-01T19:00:00.000Z",
            "Preq_kW": 0,
            "Cal_iONS_kW": 23.985
        },
        {
            "Time": "2021-04-01T19:15:00.000Z",
            "Preq_kW": 0,
            "Cal_iONS_kW": 28.0275
        },
        {
            "Time": "2021-04-01T19:30:00.000Z",
            "Preq_kW": 0,
            "Cal_iONS_kW": 31.845
        },
        {
            "Time": "2021-04-01T19:45:00.000Z",
            "Preq_kW": 0,
            "Cal_iONS_kW": 34.9875
        },
        {
            "Time": "2021-04-01T20:00:00.000Z",
            "Preq_kW": 0,
            "Cal_iONS_kW": 37.68
        },
        {
            "Time": "2021-04-01T20:15:00.000Z",
            "Preq_kW": 0,
            "Cal_iONS_kW": 38.385
        },
        {
            "Time": "2021-04-01T20:30:00.000Z",
            "Preq_kW": 0,
            "Cal_iONS_kW": 38.415
        },
        {
            "Time": "2021-04-01T20:45:00.000Z",
            "Preq_kW": 0,
            "Cal_iONS_kW": 38.445
        },
        {
            "Time": "2021-04-01T21:00:00.000Z",
            "Preq_kW": 0,
            "Cal_iONS_kW": 38.7
        },
        {
            "Time": "2021-04-01T21:15:00.000Z",
            "Preq_kW": 0,
            "Cal_iONS_kW": 38.025
        },
        {
            "Time": "2021-04-01T21:30:00.000Z",
            "Preq_kW": 0,
            "Cal_iONS_kW": 37.575
        },
        {
            "Time": "2021-04-01T21:45:00.000Z",
            "Preq_kW": 0,
            "Cal_iONS_kW": 37.125
        },
        {
            "Time": "2021-04-01T22:00:00.000Z",
            "Preq_kW": 0,
            "Cal_iONS_kW": 36.45
        },
        {
            "Time": "2021-04-01T22:15:00.000Z",
            "Preq_kW": 0,
            "Cal_iONS_kW": 35.325
        },
        {
            "Time": "2021-04-01T22:30:00.000Z",
            "Preq_kW": 0,
            "Cal_iONS_kW": 33.525
        },
        {
            "Time": "2021-04-01T22:45:00.000Z",
            "Preq_kW": 0,
            "Cal_iONS_kW": 31.725
        },
        {
            "Time": "2021-04-01T23:00:00.000Z",
            "Preq_kW": 0,
            "Cal_iONS_kW": 29.475
        },
        {
            "Time": "2021-04-01T23:15:00.000Z",
            "Preq_kW": 0,
            "Cal_iONS_kW": 27.225
        },
        {
            "Time": "2021-04-01T23:30:00.000Z",
            "Preq_kW": 0,
            "Cal_iONS_kW": 25.2
        },
        {
            "Time": "2021-04-01T23:45:00.000Z",
            "Preq_kW": 0,
            "Cal_iONS_kW": 22.95
        },
        {
            "Time": "2021-04-02T00:00:00.000Z",
            "Preq_kW": 0,
            "Cal_iONS_kW": 19.35
        },
        {
            "Time": "2021-04-02T00:15:00.000Z",
            "Preq_kW": 0,
            "Cal_iONS_kW": 22.275
        },
        {
            "Time": "2021-04-02T00:30:00.000Z",
            "Preq_kW": 0,
            "Cal_iONS_kW": 20.7
        },
        {
            "Time": "2021-04-02T00:45:00.000Z",
            "Preq_kW": 0,
            "Cal_iONS_kW": 19.35
        },
        {
            "Time": "2021-04-02T01:00:00.000Z",
            "Preq_kW": 0,
            "Cal_iONS_kW": 18.0
        },
        {
            "Time": "2021-04-02T01:15:00.000Z",
            "Preq_kW": 0,
            "Cal_iONS_kW": 16.65
        },
        {
            "Time": "2021-04-02T01:30:00.000Z",
            "Preq_kW": 0,
            "Cal_iONS_kW": 15.3
        },
        {
            "Time": "2021-04-02T01:45:00.000Z",
            "Preq_kW": 0,
            "Cal_iONS_kW": 14.175
        },
        {
            "Time": "2021-04-02T02:00:00.000Z",
            "Preq_kW": 0,
            "Cal_iONS_kW": 13.05
        },
        {
            "Time": "2021-04-02T02:15:00.000Z",
            "Preq_kW": 0,
            "Cal_iONS_kW": 12.375
        },
        {
            "Time": "2021-04-02T02:30:00.000Z",
            "Preq_kW": 0,
            "Cal_iONS_kW": 11.7
        },
        {
            "Time": "2021-04-02T02:45:00.000Z",
            "Preq_kW": 0,
            "Cal_iONS_kW": 11.475
        },
        {
            "Time": "2021-04-02T03:00:00.000Z",
            "Preq_kW": 0,
            "Cal_iONS_kW": 11.025
        },
        {
            "Time": "2021-04-02T03:15:00.000Z",
            "Preq_kW": 0,
            "Cal_iONS_kW": 10.8
        },
        {
            "Time": "2021-04-02T03:30:00.000Z",
            "Preq_kW": 0,
            "Cal_iONS_kW": 10.575
        },
        {
            "Time": "2021-04-02T03:45:00.000Z",
            "Preq_kW": 0,
            "Cal_iONS_kW": 10.35
        },
        {
            "Time": "2021-04-02T04:00:00.000Z",
            "Preq_kW": 0,
            "Cal_iONS_kW": 10.35
        },
        {
            "Time": "2021-04-02T04:15:00.000Z",
            "Preq_kW": 0,
            "Cal_iONS_kW": 10.35
        },
        {
            "Time": "2021-04-02T04:30:00.000Z",
            "Preq_kW": 0,
            "Cal_iONS_kW": 10.35
        },
        {
            "Time": "2021-04-02T04:45:00.000Z",
            "Preq_kW": 0,
            "Cal_iONS_kW": 10.35
        },
        {
            "Time": "2021-04-02T05:00:00.000Z",
            "Preq_kW": 0,
            "Cal_iONS_kW": 10.35
        },
        {
            "Time": "2021-04-02T05:15:00.000Z",
            "Preq_kW": 0,
            "Cal_iONS_kW": 10.35
        },
        {
            "Time": "2021-04-02T05:30:00.000Z",
            "Preq_kW": 0,
            "Cal_iONS_kW": 10.35
        },
        {
            "Time": "2021-04-02T05:45:00.000Z",
            "Preq_kW": 0,
            "Cal_iONS_kW": 10.35
        },
        {
            "Time": "2021-04-02T06:00:00.000Z",
            "Preq_kW": 0,
            "Cal_iONS_kW": 10.35
        },
        {
            "Time": "2021-04-02T06:15:00.000Z",
            "Preq_kW": 0,
            "Cal_iONS_kW": 10.35
        },
        {
            "Time": "2021-04-02T06:30:00.000Z",
            "Preq_kW": 0,
            "Cal_iONS_kW": 10.575
        },
        {
            "Time": "2021-04-02T06:45:00.000Z",
            "Preq_kW": 0,
            "Cal_iONS_kW": 11.025
        },
        {
            "Time": "2021-04-02T07:00:00.000Z",
            "Preq_kW": 0,
            "Cal_iONS_kW": 11.7
        },
        {
            "Time": "2021-04-02T07:15:00.000Z",
            "Preq_kW": 0,
            "Cal_iONS_kW": 9.165
        },
        {
            "Time": "2021-04-02T07:30:00.000Z",
            "Preq_kW": 0,
            "Cal_iONS_kW": 7.08
        },
        {
            "Time": "2021-04-02T07:45:00.000Z",
            "Preq_kW": 0,
            "Cal_iONS_kW": 5.445
        },
        {
            "Time": "2021-04-02T08:00:00.000Z",
            "Preq_kW": 0,
            "Cal_iONS_kW": 4.26
        },
        {
            "Time": "2021-04-02T08:15:00.000Z",
            "Preq_kW": 0,
            "Cal_iONS_kW": -2.39
        },
        {
            "Time": "2021-04-02T08:30:00.000Z",
            "Preq_kW": 0,
            "Cal_iONS_kW": -8.815
        },
        {
            "Time": "2021-04-02T08:45:00.000Z",
            "Preq_kW": 0,
            "Cal_iONS_kW": -15.24
        },
        {
            "Time": "2021-04-02T09:00:00.000Z",
            "Preq_kW": 0,
            "Cal_iONS_kW": -21.665
        },
        {
            "Time": "2021-04-02T09:15:00.000Z",
            "Preq_kW": 0,
            "Cal_iONS_kW": -27.24
        },
        {
            "Time": "2021-04-02T09:30:00.000Z",
            "Preq_kW": 0,
            "Cal_iONS_kW": -33.265
        },
        {
            "Time": "2021-04-02T09:45:00.000Z",
            "Preq_kW": 0,
            "Cal_iONS_kW": -39.74
        },
        {
            "Time": "2021-04-02T10:00:00.000Z",
            "Preq_kW": 0,
            "Cal_iONS_kW": -46.44
        },
        {
            "Time": "2021-04-02T10:15:00.000Z",
            "Preq_kW": 0,
            "Cal_iONS_kW": -51.845
        },
        {
            "Time": "2021-04-02T10:30:00.000Z",
            "Preq_kW": 0,
            "Cal_iONS_kW": -57.7
        },
        {
            "Time": "2021-04-02T10:45:00.000Z",
            "Preq_kW": 0,
            "Cal_iONS_kW": -63.555
        },
        {
            "Time": "2021-04-02T11:00:00.000Z",
            "Preq_kW": 0,
            "Cal_iONS_kW": -69.185
        },
        {
            "Time": "2021-04-02T11:15:00.000Z",
            "Preq_kW": 0,
            "Cal_iONS_kW": -77.26
        },
        {
            "Time": "2021-04-02T11:30:00.000Z",
            "Preq_kW": 0,
            "Cal_iONS_kW": -85.335
        },
        {
            "Time": "2021-04-02T11:45:00.000Z",
            "Preq_kW": 0,
            "Cal_iONS_kW": -93.41
        },
        {
            "Time": "2021-04-02T12:00:00.000Z",
            "Preq_kW": 0,
            "Cal_iONS_kW": -101.935
        },
        {
            "Time": "2021-04-02T12:15:00.000Z",
            "Preq_kW": 0,
            "Cal_iONS_kW": -104.95
        },
        {
            "Time": "2021-04-02T12:30:00.000Z",
            "Preq_kW": 0,
            "Cal_iONS_kW": -108.415
        },
        {
            "Time": "2021-04-02T12:45:00.000Z",
            "Preq_kW": 0,
            "Cal_iONS_kW": -113.005
        },
        {
            "Time": "2021-04-02T13:00:00.000Z",
            "Preq_kW": 0,
            "Cal_iONS_kW": -118.045
        },
        {
            "Time": "2021-04-02T13:15:00.000Z",
            "Preq_kW": 0,
            "Cal_iONS_kW": -121.1825
        },
        {
            "Time": "2021-04-02T13:30:00.000Z",
            "Preq_kW": 0,
            "Cal_iONS_kW": -124.77
        },
        {
            "Time": "2021-04-02T13:45:00.000Z",
            "Preq_kW": 0,
            "Cal_iONS_kW": -128.3575
        },
        {
            "Time": "2021-04-02T14:00:00.000Z",
            "Preq_kW": 0,
            "Cal_iONS_kW": -131.27
        },
        {
            "Time": "2021-04-02T14:15:00.000Z",
            "Preq_kW": 0,
            "Cal_iONS_kW": -127.7925
        },
        {
            "Time": "2021-04-02T14:30:00.000Z",
            "Preq_kW": 0,
            "Cal_iONS_kW": -123.415
        },
        {
            "Time": "2021-04-02T14:45:00.000Z",
            "Preq_kW": 0,
            "Cal_iONS_kW": -118.8125
        },
        {
            "Time": "2021-04-02T15:00:00.000Z",
            "Preq_kW": 0,
            "Cal_iONS_kW": -113.985
        },
        {
            "Time": "2021-04-02T15:15:00.000Z",
            "Preq_kW": 0,
            "Cal_iONS_kW": -106.1375
        },
        {
            "Time": "2021-04-02T15:30:00.000Z",
            "Preq_kW": 0,
            "Cal_iONS_kW": -98.29
        },
        {
            "Time": "2021-04-02T15:45:00.000Z",
            "Preq_kW": 0,
            "Cal_iONS_kW": -90.6675
        },
        {
            "Time": "2021-04-02T16:00:00.000Z",
            "Preq_kW": 0,
            "Cal_iONS_kW": -82.82
        },
        {
            "Time": "2021-04-02T16:15:00.000Z",
            "Preq_kW": 0,
            "Cal_iONS_kW": -72.7975
        },
        {
            "Time": "2021-04-02T16:30:00.000Z",
            "Preq_kW": 0,
            "Cal_iONS_kW": -62.775
        },
        {
            "Time": "2021-04-02T16:45:00.000Z",
            "Preq_kW": 0,
            "Cal_iONS_kW": -52.3025
        },
        {
            "Time": "2021-04-02T17:00:00.000Z",
            "Preq_kW": 0,
            "Cal_iONS_kW": -41.605
        },
        {
            "Time": "2021-04-02T17:15:00.000Z",
            "Preq_kW": 0,
            "Cal_iONS_kW": -29.715
        },
        {
            "Time": "2021-04-02T17:30:00.000Z",
            "Preq_kW": 0,
            "Cal_iONS_kW": -17.375
        },
        {
            "Time": "2021-04-02T17:45:00.000Z",
            "Preq_kW": 0,
            "Cal_iONS_kW": -4.585
        },
        {
            "Time": "2021-04-02T18:00:00.000Z",
            "Preq_kW": 0,
            "Cal_iONS_kW": 8.43
        },
        {
            "Time": "2021-04-02T18:15:00.000Z",
            "Preq_kW": 0,
            "Cal_iONS_kW": 14.27
        },
        {
            "Time": "2021-04-02T18:30:00.000Z",
            "Preq_kW": 0,
            "Cal_iONS_kW": 20.11
        },
        {
            "Time": "2021-04-02T18:45:00.000Z",
            "Preq_kW": 0,
            "Cal_iONS_kW": 25.95
        },
        {
            "Time": "2021-04-02T19:00:00.000Z",
            "Preq_kW": 0,
            "Cal_iONS_kW": 31.79
        },
        {
            "Time": "2021-04-02T19:15:00.000Z",
            "Preq_kW": 0,
            "Cal_iONS_kW": 33.9425
        },
        {
            "Time": "2021-04-02T19:30:00.000Z",
            "Preq_kW": 0,
            "Cal_iONS_kW": 35.645
        },
        {
            "Time": "2021-04-02T19:45:00.000Z",
            "Preq_kW": 0,
            "Cal_iONS_kW": 36.8975
        },
        {
            "Time": "2021-04-02T20:00:00.000Z",
            "Preq_kW": 0,
            "Cal_iONS_kW": 37.7
        },
        {
            "Time": "2021-04-02T20:15:00.000Z",
            "Preq_kW": 0,
            "Cal_iONS_kW": 37.3875
        },
        {
            "Time": "2021-04-02T20:30:00.000Z",
            "Preq_kW": 0,
            "Cal_iONS_kW": 36.85
        },
        {
            "Time": "2021-04-02T20:45:00.000Z",
            "Preq_kW": 0,
            "Cal_iONS_kW": 35.8625
        },
        {
            "Time": "2021-04-02T21:00:00.000Z",
            "Preq_kW": 0,
            "Cal_iONS_kW": 35.325
        },
        {
            "Time": "2021-04-02T21:15:00.000Z",
            "Preq_kW": 0,
            "Cal_iONS_kW": 34.875
        },
        {
            "Time": "2021-04-02T21:30:00.000Z",
            "Preq_kW": 0,
            "Cal_iONS_kW": 34.425
        },
        {
            "Time": "2021-04-02T21:45:00.000Z",
            "Preq_kW": 0,
            "Cal_iONS_kW": 34.2
        },
        {
            "Time": "2021-04-02T22:00:00.000Z",
            "Preq_kW": 0,
            "Cal_iONS_kW": 33.75
        },
        {
            "Time": "2021-04-02T22:15:00.000Z",
            "Preq_kW": 0,
            "Cal_iONS_kW": 32.85
        },
        {
            "Time": "2021-04-02T22:30:00.000Z",
            "Preq_kW": 0,
            "Cal_iONS_kW": 31.5
        },
        {
            "Time": "2021-04-02T22:45:00.000Z",
            "Preq_kW": 0,
            "Cal_iONS_kW": 29.7
        },
        {
            "Time": "2021-04-02T23:00:00.000Z",
            "Preq_kW": 0,
            "Cal_iONS_kW": 27.9
        },
        {
            "Time": "2021-04-02T23:15:00.000Z",
            "Preq_kW": 0,
            "Cal_iONS_kW": 25.65
        },
        {
            "Time": "2021-04-02T23:30:00.000Z",
            "Preq_kW": 0,
            "Cal_iONS_kW": 23.4
        },
        {
            "Time": "2021-04-02T23:45:00.000Z",
            "Preq_kW": 0,
            "Cal_iONS_kW": 21.375
        }
    ],
    "flex_specs": [
        {
            "id": "bat_1",
            "with_fsof": false,
            "initial_SOF": 60,
            "final_SOF": 40,
            "Pf_dis_kW": 300,
            "Pf_ch_kW": 300,
            "min_SOF": 8.75,
            "max_SOF": 87.5,
            "Agg_cap_flex": 800,
            "Charge Efficiency": 0.99,
            "Discharge Efficiency": 0.99
        },
        {
            "id": "bat_2",
            "with_fsof": true,
            "initial_SOF": 60,
            "final_SOF": 61.4,
            "Pf_dis_kW": 30,
            "Pf_ch_kW": 30,
            "min_SOF": 8.75,
            "max_SOF": 87.5,
            "Agg_cap_flex": 80,
            "Charge Efficiency": 0.99,
            "Discharge Efficiency": 0.99
        }
        
    ]
}