{
    "$id": "Energy-prognosis-assembly-model",
    "$schema": "http://json-schema.org/draft-07/schema#",
    "title": "Energy-prognosis-assembly-model  profile generated 2021-02-09 14:45:13.726029",
    "description": " Description du profile ",
    "namespace": "urn:iec62325.351:tc57wg16:451-n:energyprognosisdocument:1:1",
    "type": "object",
    "additionalProperties": false,
    "properties": {
        "EnergyPrognosis_MarketDocument": {
            "$ref": "#/definitions/EnergyPrognosis_MarketDocument"
        }
    },
    "definitions": {
        "Energy-prognosis-assembly-model": {
            "$ref": "#"
        },
        "EnergyPrognosis_MarketDocument": {
            "id": "#EnergyPrognosis_MarketDocument",
            "title": "EnergyPrognosis_MarketDocument",
            "description": "An electronic document containing the information necessary to satisfy the requirements of a given business process.",
            "modelReference": "http://iec.ch/TC57/2013/CIM-schema-cim16#MarketDocument",
            "type": "object",
            "additionalProperties": false,
            "properties": {
                "mRID": {
                    "description": "The unique identification of the document being exchanged within a business process flow.",
                    "modelReference": "http://iec.ch/TC57/2013/CIM-schema-cim16#MarketDocument.mRID",
                    "$ref": "#/definitions/ID_String"
                },
                "createdDateTime": {
                    "description": "The date and time of the creation of the document.",
                    "modelReference": "http://iec.ch/TC57/2013/CIM-schema-cim16#MarketDocument.createdDateTime",
                    "$ref": "#/definitions/ESMP_DateTime"
                },
                "receiver_MarketParticipant.mRID": {
                    "description": "The identification of a party in the energy market.\r\n\r\n--- The MarketParticipant associated with an electronic document header.",
                    "modelReference": "http://iec.ch/TC57/2013/CIM-schema-cim16#MarketParticipant.mRID",
                    "$ref": "#/definitions/PartyID_String"
                },
                "receiver_MarketParticipant.marketRole.type": {
                    "description": "The identification of the role played by a market player.\r\n\r\n\r\n--- The MarketParticipant associated with an electronic document header.\r\n\r\n--- The role associated with a MarketParticipant.",
                    "modelReference": "http://iec.ch/TC57/2013/CIM-schema-cim16#marketRole.type",
                    "$ref": "#/definitions/MarketRoleKind_String"
                },
                "revisionNumber": {
                    "description": "The identification of the version that distinguishes one evolution of a document from another.",
                    "modelReference": "http://iec.ch/TC57/2013/CIM-schema-cim16#MarketDocument.revisionNumber",
                    "$ref": "#/definitions/ESMPVersion_String"
                },
                "sender_MarketParticipant.mRID": {
                    "description": "The identification of a party in the energy market.\r\n\r\n--- The MarketParticipant associated with an electronic document header.",
                    "modelReference": "http://iec.ch/TC57/2013/CIM-schema-cim16#MarketParticipant.mRID",
                    "$ref": "#/definitions/PartyID_String"
                },
                "sender_MarketParticipant.marketRole.type": {
                    "description": "The identification of the role played by a market player.\r\n\r\n\r\n--- The MarketParticipant associated with an electronic document header.\r\n\r\n--- The role associated with a MarketParticipant.",
                    "modelReference": "http://iec.ch/TC57/2013/CIM-schema-cim16#marketRole.type",
                    "$ref": "#/definitions/MarketRoleKind_String"
                },
                "time_Period.timeInterval": {
                    "description": "The start and end date and time for a given interval.\r\n\r\n\r\n--- The time interval that is associated with an electronic document and which is valid for the whole document.",
                    "modelReference": "http://iec.ch/TC57/2013/CIM-schema-cim16#Period.timeInterval",
                    "$ref": "#/definitions/ESMP_DateTimeInterval"
                },
                "type": {
                    "description": "The coded type of a document. The document type describes the principal characteristic of the document.",
                    "modelReference": "http://iec.ch/TC57/2013/CIM-schema-cim16#MarketDocument.type",
                    "$ref": "#/definitions/MessageKind_String"
                },
                "Area_TimeSeries": {
                    "description": "The time series that provides a set of energy prognosis.",
                    "modelReference": "http://iec.ch/TC57/2013/CIM-schema-cim16#MarketDocument.Area_TimeSeries",
                    "type": "array",
                    "items": {
                        "$ref": "#/definitions/TimeSeries"
                    },
                    "minItems": 1
                }
            },
            "required": [
                "mRID",
                "revisionNumber",
                "type",
                "sender_MarketParticipant.mRID",
                "sender_MarketParticipant.marketRole.type",
                "receiver_MarketParticipant.mRID",
                "receiver_MarketParticipant.marketRole.type",
                "createdDateTime",
                "time_Period.timeInterval",
                "Area_TimeSeries"
            ]
        },
        "Point": {
            "id": "#Point",
            "title": "Point",
            "description": "The identification of the values being addressed within a specific interval of time.",
            "modelReference": "http://iec.ch/TC57/2013/CIM-schema-cim16#Point",
            "type": "object",
            "additionalProperties": false,
            "properties": {
                "position": {
                    "description": "A sequential value representing the relative position within a given time interval.",
                    "modelReference": "http://iec.ch/TC57/2013/CIM-schema-cim16#Point.position",
                    "$ref": "#/definitions/Position_Integer"
                },
                "quality": {
                    "description": "The quality of the information being provided. This quality may be estimated, not available, as provided, etc. ",
                    "modelReference": "http://iec.ch/TC57/2013/CIM-schema-cim16#Point.quality",
                    "$ref": "#/definitions/Quality_String"
                },
                "quantity": {
                    "description": "The principal quantity identified for a point.",
                    "modelReference": "http://iec.ch/TC57/2013/CIM-schema-cim16#Point.quantity",
                    "type": "number"
                },
                "UncertaintyPercentage_Quantity": {
                    "description": "The percentage of uncertainty of the quantity value provided.",
                    "modelReference": "http://iec.ch/TC57/2013/CIM-schema-cim16#Quantity",
                    "type": "array",
                    "items": {
                        "$ref": "#/definitions/UncertaintyPercentage_Quantity"
                    },
                    "minItems": 0
                }
            },
            "required": [
                "position",
                "quantity",
                "quality"
            ]
        },
        "Series_Period": {
            "id": "#Series_Period",
            "title": "Series_Period",
            "description": "The identification of the period of time corresponding to a given time interval and resolution.",
            "modelReference": "http://iec.ch/TC57/2013/CIM-schema-cim16#Period",
            "type": "object",
            "additionalProperties": false,
            "properties": {
                "resolution": {
                    "description": "The definition of the number of units of time that compose an individual step within a period. ",
                    "modelReference": "http://iec.ch/TC57/2013/CIM-schema-cim16#Period.resolution",
                    "type": "string",
                    "pattern": "^(-?)P(?=\\d|T\\d)(?:(\\d+)Y)?(?:(\\d+)M)?(?:(\\d+)([DW]))?(?:T(?:(\\d+)H)?(?:(\\d+)M)?(?:(\\d+(?:\\.\\d+)?)S)?)?$"
                },
                "timeInterval": {
                    "description": "The start and end time of the period.",
                    "modelReference": "http://iec.ch/TC57/2013/CIM-schema-cim16#Period.timeInterval",
                    "$ref": "#/definitions/ESMP_DateTimeInterval"
                },
                "Point": {
                    "description": "The Point information associated with a given Series_Period.within a TimeSeries.",
                    "modelReference": "http://iec.ch/TC57/2013/CIM-schema-cim16#Period.Point",
                    "type": "array",
                    "items": {
                        "$ref": "#/definitions/Point"
                    },
                    "minItems": 1
                }
            },
            "required": [
                "resolution",
                "timeInterval",
                "Point"
            ]
        },
        "TimeSeries": {
            "id": "#TimeSeries",
            "title": "TimeSeries",
            "description": "A set of time-ordered quantities being exchanged.",
            "modelReference": "http://iec.ch/TC57/2013/CIM-schema-cim16#TimeSeries",
            "type": "object",
            "additionalProperties": false,
            "properties": {
                "mRID": {
                    "description": "A unique identification of the time series.",
                    "modelReference": "http://iec.ch/TC57/2013/CIM-schema-cim16#TimeSeries.mRID",
                    "$ref": "#/definitions/ID_String"
                },
                "businessType": {
                    "description": "The identification of the nature of the time series.",
                    "modelReference": "http://iec.ch/TC57/2013/CIM-schema-cim16#TimeSeries.businessType",
                    "$ref": "#/definitions/BusinessKind_String"
                },
                "curveType": {
                    "description": "The identification of the coded representation of the type of curve being described.",
                    "modelReference": "http://iec.ch/TC57/2013/CIM-schema-cim16#TimeSeries.curveType",
                    "$ref": "#/definitions/CurveType_String"
                },
                "domain.mRID": {
                    "description": "The unique identification of the domain.\r\n\r\n--- The domain associated with a TimeSeries that provides the identification of the area concerned by the prognosis.",
                    "modelReference": "http://iec.ch/TC57/2013/CIM-schema-cim16#domain.mRID",
                    "$ref": "#/definitions/AreaID_String"
                },
                "measurement_Unit.name": {
                    "description": "The identification of the formal code for a measurement unit (UN/ECE Recommendation 20).\r\n\r\n--- The unit of measure associated with the quantities in a TimeSeries.",
                    "modelReference": "http://iec.ch/TC57/2013/CIM-schema-cim16#Unit.name",
                    "$ref": "#/definitions/MeasurementUnitKind_String"
                },
                "mktPSRType.psrType": {
                    "description": "The coded type of a power system resource.\r\n\r\n\r\n--- The identification of the type of resource associated with a TimeSeries. ",
                    "modelReference": "http://iec.ch/TC57/2013/CIM-schema-cim16#mktPSRType.psrType",
                    "$ref": "#/definitions/PsrType_String"
                },
                "registeredResource.mRID": {
                    "description": "The unique identification of a resource.\r\n\r\nIn the ESMP context, the \"model authority\" is defined as an authorized issuing office that provides an agreed identification coding scheme for market participant, domain, measurement point, resources (generator, lines, substations, etc.) identification.\r\n\r\nMaster resource identifier issued by a model authority. The mRID is globally unique within an exchange context.\r\nGlobal uniqueness is easily achieved by using a UUID for the mRID. It is strongly recommended to do this.\r\nFor CIMXML data files in RDF syntax, the mRID is mapped to rdf:ID or rdf:about attributes that identify CIM object elements.",
                    "modelReference": "http://iec.ch/TC57/2013/CIM-schema-cim16#registeredResource.mRID",
                    "$ref": "#/definitions/ResourceID_String"
                },
                "Series_Period": {
                    "description": "The time interval and resolution  for a period associated with a TimeSeries.",
                    "modelReference": "http://iec.ch/TC57/2013/CIM-schema-cim16#Period",
                    "type": "array",
                    "items": {
                        "$ref": "#/definitions/Series_Period"
                    },
                    "minItems": 1
                }
            },
            "required": [
                "mRID",
                "businessType",
                "domain.mRID",
                "mktPSRType.psrType",
                "measurement_Unit.name",
                "curveType",
                "Series_Period"
            ]
        },
        "UncertaintyPercentage_Quantity": {
            "id": "#UncertaintyPercentage_Quantity",
            "title": "UncertaintyPercentage_Quantity",
            "description": "The quantity attribute provides the information relative to the percentage quality of the prognosis quantity.",
            "modelReference": "http://iec.ch/TC57/2013/CIM-schema-cim16#Quantity",
            "type": "object",
            "additionalProperties": false,
            "properties": {
                "maximumPercentage_Quantity.quantity": {
                    "description": "The quantity value. \r\n\r\n--- The maximum uncertainity percentage.",
                    "modelReference": "http://iec.ch/TC57/2013/CIM-schema-cim16#Quantity.quantity",
                    "type": "number"
                },
                "minimumPercentage_Quantity.quantity": {
                    "description": "The quantity value. \r\n\r\n--- The minimum uncertainity percentage.",
                    "modelReference": "http://iec.ch/TC57/2013/CIM-schema-cim16#Quantity.quantity",
                    "type": "number"
                },
                "quantity": {
                    "description": "The quantity value. The percentage of uncertainty of the provided quantity.",
                    "modelReference": "http://iec.ch/TC57/2013/CIM-schema-cim16#Quantity.quantity",
                    "type": "number"
                }
            },
            "required": [
                "quantity"
            ]
        },
        "ID_String": {
            "id": "#ID_String",
            "title": "ID_String",
            "description": "A code to uniquely distinguish one occurrence of an entity from another.\r\n\r\nIn the ESMP context, the code is defined either by:\r\n- an emitting company that provides an agreed identification unique within a business context such as capacity auction identification, market agreement identification, etc.\r\n- a party (originator of the exchange) that provides a unique identification in the framework of a business exchange such as document identification, time series identification, bid identification, ...",
            "modelReference": "http://iec.ch/TC57/2013/CIM-schema-cim16#String",
            "type": "object",
            "additionalProperties": false,
            "properties": {
                "value": {
                    "description": "Main Core value Space.",
                    "type": "string",
                    "maxLength": 60
                }
            },
            "required": [
                "value"
            ]
        },
        "ESMPVersion_String": {
            "id": "#ESMPVersion_String",
            "title": "ESMPVersion_String",
            "description": "In ESMP, the coded value is restricted to digits.\r\n\r\nA code that distinguishes one evolution of an identified object from another. Information about a specific object may be sent several times, each transmission being identified by a different version number.",
            "modelReference": "http://iec.ch/TC57/2013/CIM-schema-cim16#String",
            "type": "object",
            "additionalProperties": false,
            "properties": {
                "value": {
                    "description": "Main Core value Space.",
                    "type": "string",
                    "pattern": "^[1-9]([0-9]){0,2}$"
                }
            },
            "required": [
                "value"
            ]
        },
        "MessageKind_String": {
            "id": "#MessageKind_String",
            "title": "MessageKind_String",
            "description": "The coded type of a document.",
            "modelReference": "http://iec.ch/TC57/2013/CIM-schema-cim16#String",
            "type": "object",
            "additionalProperties": false,
            "properties": {
                "value": {
                    "description": "Main Core value Space.",
                    "$ref": "urn-entsoe-eu-wgedi-codelists.schema.json#/definitions/MessageTypeList"
                }
            },
            "required": [
                "value"
            ]
        },
        "PartyID_String": {
            "id": "#PartyID_String",
            "title": "PartyID_String",
            "description": "The identification of an actor in the energy market.\r\n\r\nIn the ESMP context, it is an authorized issuing office that provides an agreed identification coding scheme for market participant identification.",
            "modelReference": "http://iec.ch/TC57/2013/CIM-schema-cim16#String",
            "type": "object",
            "additionalProperties": false,
            "properties": {
                "codingScheme": {
                    "description": "DomainQualification.",
                    "$ref": "urn-entsoe-eu-wgedi-codelists.schema.json#/definitions/CodingSchemeTypeList",
                    "modelReference": "http://iec.ch/TC57/2013/CIM-schema-cim16#String.codingScheme"
                },
                "value": {
                    "description": "Main Core value Space.",
                    "type": "string",
                    "maxLength": 16,
                    "modelReference": "http://iec.ch/TC57/2013/CIM-schema-cim16#String.value"
                }
            },
            "required": [
                "codingScheme",
                "value"
            ]
        },
        "MarketRoleKind_String": {
            "id": "#MarketRoleKind_String",
            "title": "MarketRoleKind_String",
            "description": "The identification of the role played by a party.",
            "modelReference": "http://iec.ch/TC57/2013/CIM-schema-cim16#String",
            "type": "object",
            "additionalProperties": false,
            "properties": {
                "value": {
                    "description": "Main Core value Space.",
                    "$ref": "urn-entsoe-eu-wgedi-codelists.schema.json#/definitions/RoleTypeList"
                }
            },
            "required": [
                "value"
            ]
        },
        "ESMP_DateTime": {
            "id": "#ESMP_DateTime",
            "title": "ESMP_DateTime",
            "description": "In ESMP, the dateTime shall be expressed in UTC as YYYY-MM-DDThh:mm:ssZ.",
            "modelReference": "http://iec.ch/TC57/2013/CIM-schema-cim16#DateTime",
            "type": "object",
            "additionalProperties": false,
            "properties": {
                "value": {
                    "description": "Main Core value Space.",
                    "type": "string",
                    "pattern": "^((([0-9]{4})[\\-](0[13578]|1[02])[\\-](0[1-9]|[12][0-9]|3[01])|([0-9]{4})[\\-]((0[469])|(11))[\\-](0[1-9]|[12][0-9]|30))T(([01][0-9]|2[0-3]):[0-5][0-9]:[0-5][0-9])Z)|(([13579][26][02468][048]|[13579][01345789](0)[48]|[13579][01345789][2468][048]|[02468][048][02468][048]|[02468][1235679](0)[48]|[02468][1235679][2468][048]|[0-9][0-9][13579][26])[\\-](02)[\\-](0[1-9]|1[0-9]|2[0-9])T(([01][0-9]|2[0-3]):[0-5][0-9]:[0-5][0-9])Z)|(([13579][26][02468][1235679]|[13579][01345789](0)[01235679]|[13579][01345789][2468][1235679]|[02468][048][02468][1235679]|[02468][1235679](0)[01235679]|[02468][1235679][2468][1235679]|[0-9][0-9][13579][01345789])[\\-](02)[\\-](0[1-9]|1[0-9]|2[0-8])T(([01][0-9]|2[0-3]):[0-5][0-9]:[0-5][0-9])Z)$"
                }
            },
            "required": [
                "value"
            ]
        },
        "YMDHM_DateTime": {
            "id": "#YMDHM_DateTime",
            "title": "YMDHM_DateTime",
            "description": "In ESMP, the date and time is expressed as \"YYYY-MM-DDThh:mmZ\", which conforms with ISO 8601 UTC time zone. This date and time is without the seconds.",
            "modelReference": "http://iec.ch/TC57/2013/CIM-schema-cim16#DateTime",
            "type": "object",
            "additionalProperties": false,
            "properties": {
                "value": {
                    "description": "The date and time as \"YYYY-MM-DDThh:mmZ\", which conforms with the ISO 8601 UTC time zone.",
                    "type": "string",
                    "pattern": "^((([0-9]{4})[\\-](0[13578]|1[02])[\\-](0[1-9]|[12][0-9]|3[01])|([0-9]{4})[\\-]((0[469])|(11))[\\-](0[1-9]|[12][0-9]|30))T(([01][0-9]|2[0-3]):[0-5][0-9])Z)|(([13579][26][02468][048]|[13579][01345789](0)[48]|[13579][01345789][2468][048]|[02468][048][02468][048]|[02468][1235679](0)[48]|[02468][1235679][2468][048]|[0-9][0-9][13579][26])[\\-](02)[\\-](0[1-9]|1[0-9]|2[0-9])T(([01][0-9]|2[0-3]):[0-5][0-9])Z)|(([13579][26][02468][1235679]|[13579][01345789](0)[01235679]|[13579][01345789][2468][1235679]|[02468][048][02468][1235679]|[02468][1235679](0)[01235679]|[02468][1235679][2468][1235679]|[0-9][0-9][13579][01345789])[\\-](02)[\\-](0[1-9]|1[0-9]|2[0-8])T(([01][0-9]|2[0-3]):[0-5][0-9])Z)$"
                }
            },
            "required": [
                "value"
            ]
        },
        "ESMP_DateTimeInterval": {
            "id": "#ESMP_DateTimeInterval",
            "title": "ESMP_DateTimeInterval",
            "description": "This datatype enables to express the start date and time, and the end date and time of a time interval with a specific pattern. This pattern is the YYYY-MM-DDThh:mmZ.",
            "modelReference": "http://iec.ch/TC57/2013/CIM-schema-cim16#DateTimeInterval",
            "type": "object",
            "additionalProperties": false,
            "properties": {
                "start": {
                    "description": "The start date and time of the interval with a minute resolution.",
                    "modelReference": "http://iec.ch/TC57/2013/CIM-schema-cim16#DateTimeInterval.start",
                    "$ref": "#/definitions/YMDHM_DateTime"
                },
                "end": {
                    "description": "The end date and time of the interval with a minute resolution.",
                    "modelReference": "http://iec.ch/TC57/2013/CIM-schema-cim16#DateTimeInterval.end",
                    "$ref": "#/definitions/YMDHM_DateTime"
                }
            },
            "required": [
                "start",
                "end"
            ]
        },
        "Position_Integer": {
            "id": "#Position_Integer",
            "title": "Position_Integer",
            "description": "An integer value, this value is used as a sequential value representing the relative position of an entity within a space such as a time interval.",
            "modelReference": "http://iec.ch/TC57/2013/CIM-schema-cim16#Integer",
            "type": "object",
            "additionalProperties": false,
            "properties": {
                "value": {
                    "description": "Main Core value Space.",
                    "type": "integer",
                    "maximum": 999999,
                    "minimum": 1
                }
            },
            "required": [
                "value"
            ]
        },
        "Quality_String": {
            "id": "#Quality_String",
            "title": "Quality_String",
            "description": "The coded identification of the quality of the information.",
            "modelReference": "http://iec.ch/TC57/2013/CIM-schema-cim16#String",
            "type": "object",
            "additionalProperties": false,
            "properties": {
                "value": {
                    "description": "Main Core value Space.",
                    "$ref": "urn-entsoe-eu-wgedi-codelists.schema.json#/definitions/QualityTypeList"
                }
            },
            "required": [
                "value"
            ]
        },
        "BusinessKind_String": {
            "id": "#BusinessKind_String",
            "title": "BusinessKind_String",
            "description": "The coded identification of the business type.",
            "modelReference": "http://iec.ch/TC57/2013/CIM-schema-cim16#String",
            "type": "object",
            "additionalProperties": false,
            "properties": {
                "value": {
                    "description": "Main Core value Space.",
                    "$ref": "urn-entsoe-eu-wgedi-codelists.schema.json#/definitions/BusinessTypeList"
                }
            },
            "required": [
                "value"
            ]
        },
        "AreaID_String": {
            "id": "#AreaID_String",
            "title": "AreaID_String",
            "description": "The coded identification of a domain, i.e. balance area, grid area, etc.\r\n\r\nIn the ESMP context, it is an authorized issuing office that provides an agreed identification coding scheme for domain identification.",
            "modelReference": "http://iec.ch/TC57/2013/CIM-schema-cim16#String",
            "type": "object",
            "additionalProperties": false,
            "properties": {
                "codingScheme": {
                    "description": "DomainQualification.",
                    "$ref": "urn-entsoe-eu-wgedi-codelists.schema.json#/definitions/CodingSchemeTypeList",
                    "modelReference": "http://iec.ch/TC57/2013/CIM-schema-cim16#String.codingScheme"
                },
                "value": {
                    "description": "Main Core value Space.",
                    "type": "string",
                    "maxLength": 18,
                    "modelReference": "http://iec.ch/TC57/2013/CIM-schema-cim16#String.value"
                }
            },
            "required": [
                "codingScheme",
                "value"
            ]
        },
        "ResourceID_String": {
            "id": "#ResourceID_String",
            "title": "ResourceID_String",
            "description": "The identification of a resource object in the energy market.\r\n\r\nIn the ESMP context, it is an authorized issuing office that provides an agreed identification coding scheme for resources (generator, lines, substations, etc.) identification.",
            "modelReference": "http://iec.ch/TC57/2013/CIM-schema-cim16#String",
            "type": "object",
            "additionalProperties": false,
            "properties": {
                "codingScheme": {
                    "description": "DomainQualification.",
                    "$ref": "urn-entsoe-eu-wgedi-codelists.schema.json#/definitions/CodingSchemeTypeList",
                    "modelReference": "http://iec.ch/TC57/2013/CIM-schema-cim16#String.codingScheme"
                },
                "value": {
                    "description": "Main Core value Space.",
                    "type": "string",
                    "maxLength": 60,
                    "modelReference": "http://iec.ch/TC57/2013/CIM-schema-cim16#String.value"
                }
            },
            "required": [
                "codingScheme",
                "value"
            ]
        },
        "PsrType_String": {
            "id": "#PsrType_String",
            "title": "PsrType_String",
            "description": "The coded type of a power system resource.",
            "modelReference": "http://iec.ch/TC57/2013/CIM-schema-cim16#String",
            "type": "object",
            "additionalProperties": false,
            "properties": {
                "value": {
                    "description": "Main Core value Space.",
                    "$ref": "urn-entsoe-eu-wgedi-codelists.schema.json#/definitions/AssetTypeList"
                }
            },
            "required": [
                "value"
            ]
        },
        "MeasurementUnitKind_String": {
            "id": "#MeasurementUnitKind_String",
            "title": "MeasurementUnitKind_String",
            "description": "The coded identification of a unit of measure that is applied to a quantity. The measurement units shall be in compliance with UN/ECE Recommendation 20.",
            "modelReference": "http://iec.ch/TC57/2013/CIM-schema-cim16#String",
            "type": "object",
            "additionalProperties": false,
            "properties": {
                "value": {
                    "description": "Main Core value Space.",
                    "$ref": "urn-entsoe-eu-wgedi-codelists.schema.json#/definitions/UnitOfMeasureTypeList"
                }
            },
            "required": [
                "value"
            ]
        },
        "CurveType_String": {
            "id": "#CurveType_String",
            "title": "CurveType_String",
            "description": "The coded identification of the type of curve.",
            "modelReference": "http://iec.ch/TC57/2013/CIM-schema-cim16#String",
            "type": "object",
            "additionalProperties": false,
            "properties": {
                "value": {
                    "description": "Main Core value Space.",
                    "$ref": "urn-entsoe-eu-wgedi-codelists.schema.json#/definitions/CurveTypeList"
                }
            },
            "required": [
                "value"
            ]
        }
    }
}