{
    "de-DE": {
        "error_1": {
            "message": "Der Text der gesendeten Nachricht stimmt nicht mit dem Schema überein.", 
            "code": 1,
            "http_code": 412,
            "error_title": "Abgleich mit Schema fehlgeschlagen.",
            "error_msg": "Der json/xml-Inhalt ist bei der Validierung gegen das Schema an der folgenden Stelle fehlgeschlagen:"
        },

        "error_2": {
            "message": "Der gesendete JSON-Body ist ungültig.", 
            "code": 2,
            "http_code": 412,
            "error_title": "JSON-Inhalt konnte nicht geparst werden.",
            "error_msg": "Der json-Inhalt konnte vom Validator nicht geparst werden."
        },

        "error_3": {
            "message": "Der gesendete XML-Body ist ungültig.", 
            "code": 3,
            "http_code": 412,
            "error_title": "XML-Inhalt konnte nicht geparst werden.",
            "error_msg": "Der xml-Inhalt konnte vom Validator nicht geparst werden."
        }
    },
    "en-US": {
        "error_1": {
            "message": "The body of the message sent does not match the schema.", 
            "code": 1,
            "http_code": 412,
            "error_title": "Failed to match to schema.",
            "error_msg": "The json/xml content has failed in validation against the schema in the following place:"
        },

        "error_2": {
            "message": "The JSON body sent is invalid.", 
            "code": 2,
            "http_code": 412,
            "error_title": "Failed to parse JSON content.",
            "error_msg": "The json content has failed to be parsed by the validator."
        },

        "error_3": {
            "message": "The XML body sent is invalid.", 
            "code": 3,
            "http_code": 412,
            "error_title": "Failed to parse XML content.",
            "error_msg": "The xml content has failed to be parsed by the validator."
        }
    }
  }