{
    "$id": "Outage-assembly-model",
    "$schema": "http://json-schema.org/draft-07/schema#",
    "title": "Outage-assembly-model  profile generated 2021-02-04 16:39:19.212452",
    "description": " Description du profile ",
    "namespace": "urn:iec62325.351:tc57wg16:451-6:outagedocument:4:0",
    "type": "object",
    "additionalProperties": false,
    "properties": {
        "Unavailability_MarketDocument": {
            "$ref": "#/definitions/Unavailability_MarketDocument"
        }
    },
    "definitions": {
        "Outage-assembly-model": {
            "$ref": "#"
        },
        "Asset_RegisteredResource": {
            "id": "#Asset_RegisteredResource",
            "title": "Asset_RegisteredResource",
            "description": "An asset that is registered through the market participant registration system. ",
            "modelReference": "http://iec.ch/TC57/2013/CIM-schema-cim16#RegisteredResource",
            "type": "object",
            "additionalProperties": false,
            "properties": {
                "mRID": {
                    "description": "The unique identification of an asset.",
                    "modelReference": "http://iec.ch/TC57/2013/CIM-schema-cim16#RegisteredResource.mRID",
                    "$ref": "#/definitions/ResourceID_String"
                },
                "asset_PSRType.psrType": {
                    "description": "The coded type of an asset.\r\n\r\n--- The classification for the asset..",
                    "modelReference": "http://iec.ch/TC57/2013/CIM-schema-cim16#PSRType.psrType",
                    "$ref": "#/definitions/PsrType_String"
                },
                "location.name": {
                    "description": "The name is any free human readable and possibly non unique text naming the object.\r\n\r\n--- The name of the location of the asset.",
                    "modelReference": "http://iec.ch/TC57/2013/CIM-schema-cim16#location.name",
                    "type": "string"
                },
                "name": {
                    "description": "The name of an asset.",
                    "modelReference": "http://iec.ch/TC57/2013/CIM-schema-cim16#RegisteredResource.name",
                    "type": "string"
                }
            },
            "required": [
                "mRID"
            ]
        },
        "Point": {
            "id": "#Point",
            "title": "Point",
            "description": "The identification of the values being addressed within a specific interval of time.",
            "modelReference": "http://iec.ch/TC57/2013/CIM-schema-cim16#Point",
            "type": "object",
            "additionalProperties": false,
            "properties": {
                "position": {
                    "description": "A sequential value representing the relative position within a given time interval.",
                    "modelReference": "http://iec.ch/TC57/2013/CIM-schema-cim16#Point.position",
                    "$ref": "#/definitions/Position_Integer"
                },
                "quantity": {
                    "description": "Principal quantity identified for a point.\r\nThis information defines the available, installed, wind power feed in or specific point quantities of an unavailability that is taken from or put into the area for the position within the interval period.",
                    "modelReference": "http://iec.ch/TC57/2013/CIM-schema-cim16#Point.quantity",
                    "type": "number"
                }
            },
            "required": [
                "position",
                "quantity"
            ]
        },
        "Reason": {
            "id": "#Reason",
            "title": "Reason",
            "description": "The motivation of an act.",
            "modelReference": "http://iec.ch/TC57/2013/CIM-schema-cim16#Reason",
            "type": "object",
            "additionalProperties": false,
            "properties": {
                "code": {
                    "description": "The motivation of an act in coded form.",
                    "modelReference": "http://iec.ch/TC57/2013/CIM-schema-cim16#Reason.code",
                    "$ref": "#/definitions/ReasonCode_String"
                },
                "text": {
                    "description": "The textual explanation corresponding to the reason code.",
                    "modelReference": "http://iec.ch/TC57/2013/CIM-schema-cim16#Reason.text",
                    "$ref": "#/definitions/ReasonText_String"
                }
            },
            "required": [
                "code"
            ]
        },
        "Series_Period": {
            "id": "#Series_Period",
            "title": "Series_Period",
            "description": "The identification of the period of time corresponding to a given time interval and resolution.\r\nThe Series_Period class provides for a given unavailability the market time unit information for:\r\n<ul>\r\n\t<li>available capacity in the Available_Period class, the available consumption capacity, generation capacity or production unit capacity, or the impact on cross border capacity.</li>\r\n\t<li>or wind power feeding capacity in the WindPowerFeedin_Period class, the off shore wind power feed in capacity to the transmission infrastructure</li>\r\n</ul>",
            "modelReference": "http://iec.ch/TC57/2013/CIM-schema-cim16#Period",
            "type": "object",
            "additionalProperties": false,
            "properties": {
                "resolution": {
                    "description": "The definition of the number of units of time that compose an individual step within a period. ",
                    "modelReference": "http://iec.ch/TC57/2013/CIM-schema-cim16#Period.resolution",
                    "type": "string",
                    "pattern": "^(-?)P(?=\\d|T\\d)(?:(\\d+)Y)?(?:(\\d+)M)?(?:(\\d+)([DW]))?(?:T(?:(\\d+)H)?(?:(\\d+)M)?(?:(\\d+(?:\\.\\d+)?)S)?)?$"
                },
                "timeInterval": {
                    "description": "The start and end time of the period.",
                    "modelReference": "http://iec.ch/TC57/2013/CIM-schema-cim16#Period.timeInterval",
                    "$ref": "#/definitions/ESMP_DateTimeInterval"
                },
                "Point": {
                    "description": "The Point information associated with a given Series_Period.within a TimeSeries.",
                    "modelReference": "http://iec.ch/TC57/2013/CIM-schema-cim16#Period.Point",
                    "type": "array",
                    "items": {
                        "$ref": "#/definitions/Point"
                    },
                    "minItems": 1
                }
            },
            "required": [
                "timeInterval",
                "resolution",
                "Point"
            ]
        },
        "TimeSeries": {
            "id": "#TimeSeries",
            "title": "TimeSeries",
            "description": "A set of time-ordered quantities being exchanged in relation to a product.\r\nA time series should exist to describe a specific piece of an unavailability situation. It conveys the data related to the unavailability. For consumption or production / generating unit unavailability it identifies the unavailable capacity during the event. For transmission asset unavailability it identifies the impact on cross zonal capacity per direction.",
            "modelReference": "http://iec.ch/TC57/2013/CIM-schema-cim16#TimeSeries",
            "type": "object",
            "additionalProperties": false,
            "properties": {
                "mRID": {
                    "description": "A unique identification of the time series.",
                    "modelReference": "http://iec.ch/TC57/2013/CIM-schema-cim16#TimeSeries.mRID",
                    "$ref": "#/definitions/ID_String"
                },
                "biddingZone_Domain.mRID": {
                    "description": "The unique identification of the domain.\r\n\r\n--- The bidding domain associated with a TimeSeries.\r\nThe identification of the bidding zone for which the unavailability information is being provided.",
                    "modelReference": "http://iec.ch/TC57/2013/CIM-schema-cim16#Domain.mRID",
                    "$ref": "#/definitions/AreaID_String"
                },
                "businessType": {
                    "description": "The identification of the nature of the time series.",
                    "modelReference": "http://iec.ch/TC57/2013/CIM-schema-cim16#TimeSeries.businessType",
                    "$ref": "#/definitions/BusinessKind_String"
                },
                "curveType": {
                    "description": "The identification of the coded representation of the type of curve being described.",
                    "modelReference": "http://iec.ch/TC57/2013/CIM-schema-cim16#TimeSeries.curveType",
                    "$ref": "#/definitions/CurveType_String"
                },
                "end_DateAndOrTime.date": {
                    "description": "Date as \"yyyy-mm-dd\", which conforms with ISO 8601.\r\n\r\n\r\n--- An end date and/or time associated with a TimeSeries.\r\nThis identifies the date and/or time of the end of the unavailability being described in the time series.",
                    "modelReference": "http://iec.ch/TC57/2013/CIM-schema-cim16#DateAndOrTime.date",
                    "type": "string",
                    "pattern": "^(-?([1-9][0-9]{3,}|0[0-9]{3})-(0[1-9]|1[0-2])-(0[1-9]|[12][0-9]|3[01])(Z|(\\+|-)((0[0-9]|1[0-3]):[0-5][0-9]|14:00))?)$"
                },
                "end_DateAndOrTime.time": {
                    "description": "Time as \"hh:mm:ss.sssZ\", which conforms with ISO 8601.\r\n\r\n\r\n--- An end date and/or time associated with a TimeSeries.\r\nThis identifies the date and/or time of the end of the unavailability being described in the time series.",
                    "modelReference": "http://iec.ch/TC57/2013/CIM-schema-cim16#DateAndOrTime.time",
                    "type": "string",
                    "pattern": "^((([01][0-9]|2[0-3]):[0-5][0-9]:[0-5][0-9](\\.[0-9]+)?|(24:00:00(\\.0+)?))(Z|(\\+|-)((0[0-9]|1[0-3]):[0-5][0-9]|14:00))?)$"
                },
                "in_Domain.mRID": {
                    "description": "The unique identification of the domain.\r\n\r\n--- The domain where erergy is going associated with a TimeSeries.",
                    "modelReference": "http://iec.ch/TC57/2013/CIM-schema-cim16#Domain.mRID",
                    "$ref": "#/definitions/AreaID_String"
                },
                "out_Domain.mRID": {
                    "description": "The unique identification of the domain.\r\n\r\n--- The  domain where energy is coming from associated with a TimeSeries.",
                    "modelReference": "http://iec.ch/TC57/2013/CIM-schema-cim16#Domain.mRID",
                    "$ref": "#/definitions/AreaID_String"
                },
                "production_RegisteredResource.location.name": {
                    "description": "The name is any free human readable and possibly non unique text naming the object.\r\n\r\n\r\n--- Characteristics of a production unit affected by the unavailability.\r\n\r\n--- The identification of the location of the production unit.",
                    "modelReference": "http://iec.ch/TC57/2013/CIM-schema-cim16#location.name",
                    "type": "string"
                },
                "production_RegisteredResource.mRID": {
                    "description": "The unique identification of a production unit resource.\r\n\r\n--- Characteristics of a production unit affected by the unavailability.",
                    "modelReference": "http://iec.ch/TC57/2013/CIM-schema-cim16#RegisteredResource.mRID",
                    "$ref": "#/definitions/ResourceID_String"
                },
                "production_RegisteredResource.name": {
                    "description": "The name is any free human readable and possibly non unique text naming the production unit.\r\n\r\n--- Characteristics of a production unit affected by the unavailability.",
                    "modelReference": "http://iec.ch/TC57/2013/CIM-schema-cim16#RegisteredResource.name",
                    "type": "string"
                },
                "production_RegisteredResource.pSRType.powerSystemResources.mRID": {
                    "description": "The unique identification of a generation unit.\r\n\r\n\r\n\r\n--- Characteristics of a production unit affected by the unavailability.\r\n\r\n--- The classification for this production unit.\r\n\r\n--- The generation unit dependent on a given type.",
                    "modelReference": "http://iec.ch/TC57/2013/CIM-schema-cim16#pSRType.powerSystemResources.mRID",
                    "$ref": "#/definitions/ResourceID_String"
                },
                "production_RegisteredResource.pSRType.powerSystemResources.name": {
                    "description": "The name of the generation unit.\r\n\r\n\r\n\r\n--- Characteristics of a production unit affected by the unavailability.\r\n\r\n--- The classification for this production unit.\r\n\r\n--- The generation unit dependent on a given type.",
                    "modelReference": "http://iec.ch/TC57/2013/CIM-schema-cim16#pSRType.powerSystemResources.name",
                    "type": "string"
                },
                "production_RegisteredResource.pSRType.powerSystemResources.nominalP": {
                    "description": "The nominal power of the object in question.\r\n\r\n\r\n\r\n--- Characteristics of a production unit affected by the unavailability.\r\n\r\n--- The classification for this production unit.\r\n\r\n--- The generation unit dependent on a given type.",
                    "modelReference": "http://iec.ch/TC57/2013/CIM-schema-cim16#pSRType.powerSystemResources.nominalP",
                    "$ref": "#/definitions/ESMP_ActivePower"
                },
                "production_RegisteredResource.pSRType.psrType": {
                    "description": "The coded type of a power system resource.\r\n\r\n\r\n\r\n--- Characteristics of a production unit affected by the unavailability.\r\n\r\n--- The classification for this production unit.",
                    "modelReference": "http://iec.ch/TC57/2013/CIM-schema-cim16#pSRType.psrType",
                    "$ref": "#/definitions/PsrType_String"
                },
                "quantity_Measure_Unit.name": {
                    "description": "Identification of the formal code for a measurement unit (UN/ECE Recommendation 20).\r\n\r\n\r\n--- The unit of measure associated with the quantities in a TimeSeries.",
                    "modelReference": "http://iec.ch/TC57/2013/CIM-schema-cim16#Measure_Unit.name",
                    "$ref": "#/definitions/MeasurementUnitKind_String"
                },
                "start_DateAndOrTime.date": {
                    "description": "Date as \"yyyy-mm-dd\", which conforms with ISO 8601.\r\n\r\n\r\n--- A start date and/or time associated with a TimeSeries.\r\nThis identifies the date and/or time of the start of the unavailability being described in the time series.",
                    "modelReference": "http://iec.ch/TC57/2013/CIM-schema-cim16#DateAndOrTime.date",
                    "type": "string",
                    "pattern": "^(-?([1-9][0-9]{3,}|0[0-9]{3})-(0[1-9]|1[0-2])-(0[1-9]|[12][0-9]|3[01])(Z|(\\+|-)((0[0-9]|1[0-3]):[0-5][0-9]|14:00))?)$"
                },
                "start_DateAndOrTime.time": {
                    "description": "Time as \"hh:mm:ss.sssZ\", which conforms with ISO 8601.\r\n\r\n\r\n--- A start date and/or time associated with a TimeSeries.\r\nThis identifies the date and/or time of the start of the unavailability being described in the time series.",
                    "modelReference": "http://iec.ch/TC57/2013/CIM-schema-cim16#DateAndOrTime.time",
                    "type": "string",
                    "pattern": "^((([01][0-9]|2[0-3]):[0-5][0-9]:[0-5][0-9](\\.[0-9]+)?|(24:00:00(\\.0+)?))(Z|(\\+|-)((0[0-9]|1[0-3]):[0-5][0-9]|14:00))?)$"
                },
                "Available_Period": {
                    "description": "The time interval and resolution  of available capacity for a period associated with a TimeSeries.",
                    "modelReference": "http://iec.ch/TC57/2013/CIM-schema-cim16#Period",
                    "type": "array",
                    "items": {
                        "$ref": "#/definitions/Series_Period"
                    },
                    "minItems": 0
                },
                "WindPowerFeedin_Period": {
                    "description": "The time interval and resolution  for a period associated with windpower feedin.",
                    "modelReference": "http://iec.ch/TC57/2013/CIM-schema-cim16#Period",
                    "type": "array",
                    "items": {
                        "$ref": "#/definitions/Series_Period"
                    },
                    "minItems": 0
                },
                "Reason": {
                    "description": "The reason information associated with a TimeSeries providing motivation information.",
                    "modelReference": "http://iec.ch/TC57/2013/CIM-schema-cim16#TimeSeries.Reason",
                    "type": "array",
                    "items": {
                        "$ref": "#/definitions/Reason"
                    },
                    "minItems": 0
                },
                "Asset_RegisteredResource": {
                    "description": "The identification of an asset.",
                    "modelReference": "http://iec.ch/TC57/2013/CIM-schema-cim16#RegisteredResource",
                    "type": "array",
                    "items": {
                        "$ref": "#/definitions/Asset_RegisteredResource"
                    },
                    "minItems": 0
                }
            },
            "required": [
                "mRID",
                "businessType",
                "start_DateAndOrTime.date",
                "start_DateAndOrTime.time",
                "end_DateAndOrTime.date",
                "end_DateAndOrTime.time",
                "quantity_Measure_Unit.name",
                "curveType"
            ]
        },
        "Unavailability_MarketDocument": {
            "id": "#Unavailability_MarketDocument",
            "title": "Unavailability_MarketDocument",
            "description": "An electronic document containing the information necessary to satisfy the business process concerning the previsional planned maintenance of assets and production and consumption resource objects as well as the punctual change of availability of  the same equipment.",
            "modelReference": "http://iec.ch/TC57/2013/CIM-schema-cim16#MarketDocument",
            "type": "object",
            "additionalProperties": false,
            "properties": {
                "mRID": {
                    "description": "Unique identification of the document being exchanged within a business process flow. This identifies a given unavailability document.",
                    "modelReference": "http://iec.ch/TC57/2013/CIM-schema-cim16#MarketDocument.mRID",
                    "$ref": "#/definitions/ID_String"
                },
                "createdDateTime": {
                    "description": "Identification of the date and time of the creation of the document.",
                    "modelReference": "http://iec.ch/TC57/2013/CIM-schema-cim16#MarketDocument.createdDateTime",
                    "$ref": "#/definitions/ESMP_DateTime"
                },
                "docStatus": {
                    "description": "Identification of the condition or position of the document with regard to its standing. It is used to identify an unavailability document that has been withdrawn or cancelled.",
                    "modelReference": "http://iec.ch/TC57/2013/CIM-schema-cim16#MarketDocument.docStatus",
                    "$ref": "#/definitions/Action_Status"
                },
                "process.processType": {
                    "description": "The identification of the nature of process that the document addresses.",
                    "modelReference": "http://iec.ch/TC57/2013/CIM-schema-cim16#process.processType",
                    "$ref": "#/definitions/ProcessKind_String"
                },
                "receiver_MarketParticipant.mRID": {
                    "description": "The identification of a party in the energy market.\r\n\r\n--- The document recipient.",
                    "modelReference": "http://iec.ch/TC57/2013/CIM-schema-cim16#MarketParticipant.mRID",
                    "$ref": "#/definitions/PartyID_String"
                },
                "receiver_MarketParticipant.marketRole.type": {
                    "description": "Identification of the role played by a market player.\r\n\r\n\r\n\r\n--- The document recipient.\r\n\r\n--- The role associated with a MarketParticipant.",
                    "modelReference": "http://iec.ch/TC57/2013/CIM-schema-cim16#marketRole.type",
                    "$ref": "#/definitions/MarketRoleKind_String"
                },
                "revisionNumber": {
                    "description": "Identification of the version that distinguishes one evolution of a document from another.",
                    "modelReference": "http://iec.ch/TC57/2013/CIM-schema-cim16#MarketDocument.revisionNumber",
                    "$ref": "#/definitions/ESMPVersion_String"
                },
                "sender_MarketParticipant.mRID": {
                    "description": "The identification of a party in the energy market.\r\n\r\n--- The document owner.",
                    "modelReference": "http://iec.ch/TC57/2013/CIM-schema-cim16#MarketParticipant.mRID",
                    "$ref": "#/definitions/PartyID_String"
                },
                "sender_MarketParticipant.marketRole.type": {
                    "description": "Identification of the role played by a market player.\r\n\r\n\r\n\r\n--- The document owner.\r\n\r\n--- The role associated with a MarketParticipant.",
                    "modelReference": "http://iec.ch/TC57/2013/CIM-schema-cim16#marketRole.type",
                    "$ref": "#/definitions/MarketRoleKind_String"
                },
                "type": {
                    "description": "The coded type of a document. The document type describes the principal characteristic of the document.",
                    "modelReference": "http://iec.ch/TC57/2013/CIM-schema-cim16#MarketDocument.type",
                    "$ref": "#/definitions/MessageKind_String"
                },
                "unavailability_Time_Period.timeInterval": {
                    "description": "The start and end date and time for a given interval.\r\n\r\n\r\n--- This information provides the start and end date and time of the time interval covering the whole unavailability document.",
                    "modelReference": "http://iec.ch/TC57/2013/CIM-schema-cim16#Time_Period.timeInterval",
                    "$ref": "#/definitions/ESMP_DateTimeInterval"
                },
                "TimeSeries": {
                    "description": "The time series that is associated with an electronic document.",
                    "modelReference": "http://iec.ch/TC57/2013/CIM-schema-cim16#MarketDocument.TimeSeries",
                    "type": "array",
                    "items": {
                        "$ref": "#/definitions/TimeSeries"
                    },
                    "minItems": 0
                },
                "Reason": {
                    "description": "The Reason associated with the electronic document header providing the reason for the unavailabilityt.",
                    "modelReference": "http://iec.ch/TC57/2013/CIM-schema-cim16#MarketDocument.Reason",
                    "type": "array",
                    "items": {
                        "$ref": "#/definitions/Reason"
                    },
                    "minItems": 0
                }
            },
            "required": [
                "mRID",
                "revisionNumber",
                "type",
                "process.processType",
                "createdDateTime",
                "sender_MarketParticipant.mRID",
                "sender_MarketParticipant.marketRole.type",
                "receiver_MarketParticipant.mRID",
                "receiver_MarketParticipant.marketRole.type",
                "unavailability_Time_Period.timeInterval"
            ]
        },
        "ResourceID_String": {
            "id": "#ResourceID_String",
            "title": "ResourceID_String",
            "description": "The identification of a resource object in the energy market.\r\n\r\nIn the ESMP context, it is an authorized issuing office that provides an agreed identification coding scheme for resources (generator, lines, substations, etc.) identification.",
            "modelReference": "http://iec.ch/TC57/2013/CIM-schema-cim16#String",
            "type": "object",
            "additionalProperties": false,
            "properties": {
                "codingScheme": {
                    "description": "DomainQualification.",
                    "$ref": "urn-entsoe-eu-wgedi-codelists.schema.json#/definitions/CodingSchemeTypeList",
                    "modelReference": "http://iec.ch/TC57/2013/CIM-schema-cim16#String.codingScheme"
                },
                "value": {
                    "description": "Main Core value Space.",
                    "type": "string",
                    "maxLength": 60,
                    "modelReference": "http://iec.ch/TC57/2013/CIM-schema-cim16#String.value"
                }
            },
            "required": [
                "codingScheme",
                "value"
            ]
        },
        "PsrType_String": {
            "id": "#PsrType_String",
            "title": "PsrType_String",
            "description": "The coded type of a power system resource.",
            "modelReference": "http://iec.ch/TC57/2013/CIM-schema-cim16#String",
            "type": "object",
            "additionalProperties": false,
            "properties": {
                "value": {
                    "description": "Main Core value Space.",
                    "$ref": "urn-entsoe-eu-wgedi-codelists.schema.json#/definitions/AssetTypeList"
                }
            },
            "required": [
                "value"
            ]
        },
        "Position_Integer": {
            "id": "#Position_Integer",
            "title": "Position_Integer",
            "description": "An integer value, this value is used as a sequential value representing the relative position of an entity within a space such as a time interval.",
            "modelReference": "http://iec.ch/TC57/2013/CIM-schema-cim16#Integer",
            "type": "object",
            "additionalProperties": false,
            "properties": {
                "value": {
                    "description": "Main Core value Space.",
                    "type": "integer",
                    "maximum": 999999,
                    "minimum": 1
                }
            },
            "required": [
                "value"
            ]
        },
        "ReasonCode_String": {
            "id": "#ReasonCode_String",
            "title": "ReasonCode_String",
            "description": "The coded motivation of an act.",
            "modelReference": "http://iec.ch/TC57/2013/CIM-schema-cim16#String",
            "type": "object",
            "additionalProperties": false,
            "properties": {
                "value": {
                    "description": "Main Core value Space.",
                    "$ref": "urn-entsoe-eu-wgedi-codelists.schema.json#/definitions/ReasonCodeTypeList"
                }
            },
            "required": [
                "value"
            ]
        },
        "ReasonText_String": {
            "id": "#ReasonText_String",
            "title": "ReasonText_String",
            "description": "The textual explanation of an act as a string of characters.",
            "modelReference": "http://iec.ch/TC57/2013/CIM-schema-cim16#String",
            "type": "object",
            "additionalProperties": false,
            "properties": {
                "value": {
                    "description": "Main Core value Space.",
                    "type": "string",
                    "maxLength": 512
                }
            },
            "required": [
                "value"
            ]
        },
        "YMDHM_DateTime": {
            "id": "#YMDHM_DateTime",
            "title": "YMDHM_DateTime",
            "description": "In ESMP, the date and time is expressed as \"YYYY-MM-DDThh:mmZ\", which conforms with ISO 8601 UTC time zone. This date and time is without the seconds.",
            "modelReference": "http://iec.ch/TC57/2013/CIM-schema-cim16#DateTime",
            "type": "object",
            "additionalProperties": false,
            "properties": {
                "value": {
                    "description": "The date and time as \"YYYY-MM-DDThh:mmZ\", which conforms with the ISO 8601 UTC time zone.",
                    "type": "string",
                    "pattern": "^((([0-9]{4})[\\-](0[13578]|1[02])[\\-](0[1-9]|[12][0-9]|3[01])|([0-9]{4})[\\-]((0[469])|(11))[\\-](0[1-9]|[12][0-9]|30))T(([01][0-9]|2[0-3]):[0-5][0-9])Z)|(([13579][26][02468][048]|[13579][01345789](0)[48]|[13579][01345789][2468][048]|[02468][048][02468][048]|[02468][1235679](0)[48]|[02468][1235679][2468][048]|[0-9][0-9][13579][26])[\\-](02)[\\-](0[1-9]|1[0-9]|2[0-9])T(([01][0-9]|2[0-3]):[0-5][0-9])Z)|(([13579][26][02468][1235679]|[13579][01345789](0)[01235679]|[13579][01345789][2468][1235679]|[02468][048][02468][1235679]|[02468][1235679](0)[01235679]|[02468][1235679][2468][1235679]|[0-9][0-9][13579][01345789])[\\-](02)[\\-](0[1-9]|1[0-9]|2[0-8])T(([01][0-9]|2[0-3]):[0-5][0-9])Z)$"
                }
            },
            "required": [
                "value"
            ]
        },
        "ESMP_DateTimeInterval": {
            "id": "#ESMP_DateTimeInterval",
            "title": "ESMP_DateTimeInterval",
            "description": "This datatype enables to express the start date and time, and the end date and time of a time interval with a specific pattern. This pattern is the YYYY-MM-DDThh:mmZ.",
            "modelReference": "http://iec.ch/TC57/2013/CIM-schema-cim16#DateTimeInterval",
            "type": "object",
            "additionalProperties": false,
            "properties": {
                "start": {
                    "description": "The start date and time of the interval with a minute resolution.",
                    "modelReference": "http://iec.ch/TC57/2013/CIM-schema-cim16#DateTimeInterval.start",
                    "$ref": "#/definitions/YMDHM_DateTime"
                },
                "end": {
                    "description": "The end date and time of the interval with a minute resolution.",
                    "modelReference": "http://iec.ch/TC57/2013/CIM-schema-cim16#DateTimeInterval.end",
                    "$ref": "#/definitions/YMDHM_DateTime"
                }
            },
            "required": [
                "start",
                "end"
            ]
        },
        "ID_String": {
            "id": "#ID_String",
            "title": "ID_String",
            "description": "A code to uniquely distinguish one occurrence of an entity from another.\r\n\r\nIn the ESMP context, the code is defined either by:\r\n- an emitting company that provides an agreed identification unique within a business context such as capacity auction identification, market agreement identification, etc.\r\n- a party (originator of the exchange) that provides a unique identification in the framework of a business exchange such as document identification, time series identification, bid identification, ...",
            "modelReference": "http://iec.ch/TC57/2013/CIM-schema-cim16#String",
            "type": "object",
            "additionalProperties": false,
            "properties": {
                "value": {
                    "description": "Main Core value Space.",
                    "type": "string",
                    "maxLength": 60
                }
            },
            "required": [
                "value"
            ]
        },
        "BusinessKind_String": {
            "id": "#BusinessKind_String",
            "title": "BusinessKind_String",
            "description": "The coded identification of the business type.",
            "modelReference": "http://iec.ch/TC57/2013/CIM-schema-cim16#String",
            "type": "object",
            "additionalProperties": false,
            "properties": {
                "value": {
                    "description": "Main Core value Space.",
                    "$ref": "urn-entsoe-eu-wgedi-codelists.schema.json#/definitions/BusinessTypeList"
                }
            },
            "required": [
                "value"
            ]
        },
        "AreaID_String": {
            "id": "#AreaID_String",
            "title": "AreaID_String",
            "description": "The coded identification of a domain, i.e. balance area, grid area, etc.\r\n\r\nIn the ESMP context, it is an authorized issuing office that provides an agreed identification coding scheme for domain identification.",
            "modelReference": "http://iec.ch/TC57/2013/CIM-schema-cim16#String",
            "type": "object",
            "additionalProperties": false,
            "properties": {
                "codingScheme": {
                    "description": "DomainQualification.",
                    "$ref": "urn-entsoe-eu-wgedi-codelists.schema.json#/definitions/CodingSchemeTypeList",
                    "modelReference": "http://iec.ch/TC57/2013/CIM-schema-cim16#String.codingScheme"
                },
                "value": {
                    "description": "Main Core value Space.",
                    "type": "string",
                    "maxLength": 18,
                    "modelReference": "http://iec.ch/TC57/2013/CIM-schema-cim16#String.value"
                }
            },
            "required": [
                "codingScheme",
                "value"
            ]
        },
        "MeasurementUnitKind_String": {
            "id": "#MeasurementUnitKind_String",
            "title": "MeasurementUnitKind_String",
            "description": "The coded identification of a unit of measure that is applied to a quantity. The measurement units shall be in compliance with UN/ECE Recommendation 20.",
            "modelReference": "http://iec.ch/TC57/2013/CIM-schema-cim16#String",
            "type": "object",
            "additionalProperties": false,
            "properties": {
                "value": {
                    "description": "Main Core value Space.",
                    "$ref": "urn-entsoe-eu-wgedi-codelists.schema.json#/definitions/UnitOfMeasureTypeList"
                }
            },
            "required": [
                "value"
            ]
        },
        "CurveType_String": {
            "id": "#CurveType_String",
            "title": "CurveType_String",
            "description": "The coded identification of the type of curve.",
            "modelReference": "http://iec.ch/TC57/2013/CIM-schema-cim16#String",
            "type": "object",
            "additionalProperties": false,
            "properties": {
                "value": {
                    "description": "Main Core value Space.",
                    "$ref": "urn-entsoe-eu-wgedi-codelists.schema.json#/definitions/CurveTypeList"
                }
            },
            "required": [
                "value"
            ]
        },
        "ESMP_ActivePower": {
            "id": "#ESMP_ActivePower",
            "title": "ESMP_ActivePower",
            "description": "The coded identification of the nominal power value.",
            "modelReference": "http://iec.ch/TC57/2013/CIM-schema-cim16#ActivePower",
            "type": "object",
            "additionalProperties": false,
            "properties": {
                "value": {
                    "description": "Main core space value.\r\nThe value is given in decimal format.",
                    "type": "number",
                    "pattern": "^([0-9]*\\.?[0-9]*)$",
                    "modelReference": "http://iec.ch/TC57/2013/CIM-schema-cim16#ActivePower.value"
                },
                "unit": {
                    "description": "The unit of the value expressed using the UN/CEFACT recommendations 20.",
                    "$ref": "urn-entsoe-eu-wgedi-codelists.schema.json#/definitions/UnitSymbol",
                    "const": "MAW",
                    "modelReference": "http://iec.ch/TC57/2013/CIM-schema-cim16#ActivePower.unit"
                }
            },
            "required": [
                "value",
                "unit"
            ]
        },
        "ESMPVersion_String": {
            "id": "#ESMPVersion_String",
            "title": "ESMPVersion_String",
            "description": "In ESMP, the coded value is restricted to digits.\r\n\r\nA code that distinguishes one evolution of an identified object from another. Information about a specific object may be sent several times, each transmission being identified by a different version number.",
            "modelReference": "http://iec.ch/TC57/2013/CIM-schema-cim16#String",
            "type": "object",
            "additionalProperties": false,
            "properties": {
                "value": {
                    "description": "Main Core value Space.",
                    "type": "string",
                    "pattern": "^[1-9]([0-9]){0,2}$"
                }
            },
            "required": [
                "value"
            ]
        },
        "MessageKind_String": {
            "id": "#MessageKind_String",
            "title": "MessageKind_String",
            "description": "The coded type of a document.",
            "modelReference": "http://iec.ch/TC57/2013/CIM-schema-cim16#String",
            "type": "object",
            "additionalProperties": false,
            "properties": {
                "value": {
                    "description": "Main Core value Space.",
                    "$ref": "urn-entsoe-eu-wgedi-codelists.schema.json#/definitions/MessageTypeList"
                }
            },
            "required": [
                "value"
            ]
        },
        "ProcessKind_String": {
            "id": "#ProcessKind_String",
            "title": "ProcessKind_String",
            "description": "The coded identification of the nature of process.",
            "modelReference": "http://iec.ch/TC57/2013/CIM-schema-cim16#String",
            "type": "object",
            "additionalProperties": false,
            "properties": {
                "value": {
                    "description": "Main Core value Space.",
                    "$ref": "urn-entsoe-eu-wgedi-codelists.schema.json#/definitions/ProcessTypeList"
                }
            },
            "required": [
                "value"
            ]
        },
        "ESMP_DateTime": {
            "id": "#ESMP_DateTime",
            "title": "ESMP_DateTime",
            "description": "In ESMP, the dateTime shall be expressed in UTC as YYYY-MM-DDThh:mm:ssZ.",
            "modelReference": "http://iec.ch/TC57/2013/CIM-schema-cim16#DateTime",
            "type": "object",
            "additionalProperties": false,
            "properties": {
                "value": {
                    "description": "Main Core value Space.",
                    "type": "string",
                    "pattern": "^((([0-9]{4})[\\-](0[13578]|1[02])[\\-](0[1-9]|[12][0-9]|3[01])|([0-9]{4})[\\-]((0[469])|(11))[\\-](0[1-9]|[12][0-9]|30))T(([01][0-9]|2[0-3]):[0-5][0-9]:[0-5][0-9])Z)|(([13579][26][02468][048]|[13579][01345789](0)[48]|[13579][01345789][2468][048]|[02468][048][02468][048]|[02468][1235679](0)[48]|[02468][1235679][2468][048]|[0-9][0-9][13579][26])[\\-](02)[\\-](0[1-9]|1[0-9]|2[0-9])T(([01][0-9]|2[0-3]):[0-5][0-9]:[0-5][0-9])Z)|(([13579][26][02468][1235679]|[13579][01345789](0)[01235679]|[13579][01345789][2468][1235679]|[02468][048][02468][1235679]|[02468][1235679](0)[01235679]|[02468][1235679][2468][1235679]|[0-9][0-9][13579][01345789])[\\-](02)[\\-](0[1-9]|1[0-9]|2[0-8])T(([01][0-9]|2[0-3]):[0-5][0-9]:[0-5][0-9])Z)$"
                }
            },
            "required": [
                "value"
            ]
        },
        "PartyID_String": {
            "id": "#PartyID_String",
            "title": "PartyID_String",
            "description": "The identification of an actor in the energy market.\r\n\r\nIn the ESMP context, it is an authorized issuing office that provides an agreed identification coding scheme for market participant identification.",
            "modelReference": "http://iec.ch/TC57/2013/CIM-schema-cim16#String",
            "type": "object",
            "additionalProperties": false,
            "properties": {
                "codingScheme": {
                    "description": "DomainQualification.",
                    "$ref": "urn-entsoe-eu-wgedi-codelists.schema.json#/definitions/CodingSchemeTypeList",
                    "modelReference": "http://iec.ch/TC57/2013/CIM-schema-cim16#String.codingScheme"
                },
                "value": {
                    "description": "Main Core value Space.",
                    "type": "string",
                    "maxLength": 16,
                    "modelReference": "http://iec.ch/TC57/2013/CIM-schema-cim16#String.value"
                }
            },
            "required": [
                "codingScheme",
                "value"
            ]
        },
        "MarketRoleKind_String": {
            "id": "#MarketRoleKind_String",
            "title": "MarketRoleKind_String",
            "description": "The identification of the role played by a party.",
            "modelReference": "http://iec.ch/TC57/2013/CIM-schema-cim16#String",
            "type": "object",
            "additionalProperties": false,
            "properties": {
                "value": {
                    "description": "Main Core value Space.",
                    "$ref": "urn-entsoe-eu-wgedi-codelists.schema.json#/definitions/RoleTypeList"
                }
            },
            "required": [
                "value"
            ]
        },
        "Status_String": {
            "id": "#Status_String",
            "title": "Status_String",
            "description": "The identification of the status of an object.",
            "modelReference": "http://iec.ch/TC57/2013/CIM-schema-cim16#String",
            "type": "object",
            "additionalProperties": false,
            "properties": {
                "value": {
                    "description": "Main Core value Space.",
                    "$ref": "urn-entsoe-eu-wgedi-codelists.schema.json#/definitions/StatusTypeList"
                }
            },
            "required": [
                "value"
            ]
        },
        "Action_Status": {
            "id": "#Action_Status",
            "title": "Action_Status",
            "description": "The coded identification of the status of an object.",
            "modelReference": "http://iec.ch/TC57/2013/CIM-schema-cim16#Status",
            "type": "object",
            "additionalProperties": false,
            "properties": {
                "value": {
                    "description": "Main Core value Space.",
                    "modelReference": "http://iec.ch/TC57/2013/CIM-schema-cim16#Status.value",
                    "$ref": "#/definitions/Status_String"
                }
            },
            "required": [
                "value"
            ]
        }
    }
}