{
    "$id": "ResourceQualification-Assembly",
    "$schema": "http://json-schema.org/draft-07/schema#",
    "title": "ResourceQualification-Assembly  profile generated 2021-02-09 13:35:42.178211",
    "description": " Description du profile ",
    "namespace": "http://iec.ch/TC57/2020/ResourceQualification-Assembly#",
    "type": "object",
    "additionalProperties": false,
    "properties": {
        "ResourceQualification_MarketDocument": {
            "$ref": "#/definitions/ResourceQualification_MarketDocument"
        }
    },
    "definitions": {
        "ResourceQualification-Assembly": {
            "$ref": "#"
        },
        "ConstraintDuration": {
            "id": "#ConstraintDuration",
            "title": "ConstraintDuration",
            "description": "Duration constraint to activate, to put in operation, to deactivate, ... a given event.",
            "modelReference": "http://iec.ch/TC57/2013/CIM-schema-cim16#ConstraintDuration",
            "type": "object",
            "additionalProperties": false,
            "properties": {
                "duration": {
                    "description": "The duration of the constraint.",
                    "modelReference": "http://iec.ch/TC57/2013/CIM-schema-cim16#ConstraintDuration.duration",
                    "type": "string",
                    "pattern": "^(-?)P(?=\\d|T\\d)(?:(\\d+)Y)?(?:(\\d+)M)?(?:(\\d+)([DW]))?(?:T(?:(\\d+)H)?(?:(\\d+)M)?(?:(\\d+(?:\\.\\d+)?)S)?)?$"
                }
            },
            "required": [
                "duration"
            ]
        },
        "Domain": {
            "id": "#Domain",
            "title": "Domain",
            "description": "A domain covering a number of related objects, such as market balance area, grid area, borders etc.",
            "modelReference": "http://iec.ch/TC57/2013/CIM-schema-cim16#Domain",
            "type": "object",
            "additionalProperties": false,
            "properties": {
                "mRID": {
                    "description": "The unique identification of the domain.\r\n\r\nIn the ESMP context, the \"model authority\" is defined as an authorized issuing office that provides an agreed identification coding scheme for market participant, domain, measurement point, resources (generator, lines, substations, etc.) identification.\r\n\r\nMaster resource identifier issued by a model authority. The mRID is globally unique within an exchange context.\r\nGlobal uniqueness is easily achieved by using a UUID for the mRID. It is strongly recommended to do this.\r\nFor CIMXML data files in RDF syntax, the mRID is mapped to rdf:ID or rdf:about attributes that identify CIM object elements.",
                    "modelReference": "http://iec.ch/TC57/2013/CIM-schema-cim16#Domain.mRID",
                    "$ref": "#/definitions/AreaID_String"
                }
            },
            "required": [
                "mRID"
            ]
        },
        "MktPSRType": {
            "id": "#MktPSRType",
            "title": "MktPSRType",
            "description": "The type of a power system resource.",
            "modelReference": "http://iec.ch/TC57/2013/CIM-schema-cim16#MktPSRType",
            "type": "object",
            "additionalProperties": false,
            "properties": {
                "psrType": {
                    "description": "The coded type of a power system resource.",
                    "modelReference": "http://iec.ch/TC57/2013/CIM-schema-cim16#MktPSRType.psrType",
                    "$ref": "#/definitions/PsrType_String"
                }
            },
            "required": [
                "psrType"
            ]
        },
        "Owner_MarketParticipant": {
            "id": "#Owner_MarketParticipant",
            "title": "Owner_MarketParticipant",
            "description": "The identification of the party participating in energy market business processes.",
            "modelReference": "http://iec.ch/TC57/2013/CIM-schema-cim16#MarketParticipant",
            "type": "object",
            "additionalProperties": false,
            "properties": {
                "mRID": {
                    "description": "The identification of a party in the energy market.\r\n\r\nIn the ESMP context, the \"model authority\" is defined as an authorized issuing office that provides an agreed identification coding scheme for market participant, domain, measurement point, resources (generator, lines, substations, etc.) identification.\r\n\r\nMaster resource identifier issued by a model authority. The mRID is globally unique within an exchange context.\r\nGlobal uniqueness is easily achieved by using a UUID for the mRID. It is strongly recommended to do this.\r\nFor CIMXML data files in RDF syntax, the mRID is mapped to rdf:ID or rdf:about attributes that identify CIM object elements.",
                    "modelReference": "http://iec.ch/TC57/2013/CIM-schema-cim16#MarketParticipant.mRID",
                    "$ref": "#/definitions/PartyID_String"
                },
                "electronicAddress": {
                    "description": "Electronic address.",
                    "modelReference": "http://iec.ch/TC57/2013/CIM-schema-cim16#MarketParticipant.electronicAddress",
                    "$ref": "#/definitions/ElectronicAddress"
                },
                "name": {
                    "description": "The name is any free human readable and possibly non unique text naming the object.",
                    "modelReference": "http://iec.ch/TC57/2013/CIM-schema-cim16#MarketParticipant.name",
                    "type": "string"
                },
                "phone1": {
                    "description": "Phone number.",
                    "modelReference": "http://iec.ch/TC57/2013/CIM-schema-cim16#MarketParticipant.phone1",
                    "$ref": "#/definitions/TelephoneNumber"
                },
                "streetAddress": {
                    "description": "Street address.",
                    "modelReference": "http://iec.ch/TC57/2013/CIM-schema-cim16#MarketParticipant.streetAddress",
                    "$ref": "#/definitions/StreetAddress"
                }
            }
        },
        "RegisteredResource": {
            "id": "#RegisteredResource",
            "title": "RegisteredResource",
            "description": "A resource that is registered through the market participant registration system. Examples include generating unit, load, and non-physical generator or load.",
            "modelReference": "http://iec.ch/TC57/2013/CIM-schema-cim16#RegisteredResource",
            "type": "object",
            "additionalProperties": false,
            "properties": {
                "description": {
                    "description": "The description is a free human readable text describing or naming the object. It may be non unique and may not correlate to a naming hierarchy.",
                    "modelReference": "http://iec.ch/TC57/2013/CIM-schema-cim16#RegisteredResource.description",
                    "type": "string"
                },
                "location.coordinateSystem.mRID": {
                    "description": "The identification of a type of coordinate system. \r\n\r\nMaster resource identifier issued by a model authority. The mRID is unique within an exchange context. Global uniqueness is easily achieved by using a UUID,  as specified in RFC 4122, for the mRID. The use of UUID is strongly recommended.\r\nFor CIMXML data files in RDF syntax conforming to IEC 61970-552 Edition 1, the mRID is mapped to rdf:ID or rdf:about attributes that identify CIM object elements.\n\r\n\r--- Location of this power system resource.\n\r--- Coordinate system used to describe position points of this location.",
                    "modelReference": "http://iec.ch/TC57/2013/CIM-schema-cim16#coordinateSystem.mRID",
                    "$ref": "#/definitions/CoordinateSystemKind_String"
                },
                "location.name": {
                    "description": "The name is any free human readable and possibly non unique text naming the object.\n\r--- Location of this power system resource.",
                    "modelReference": "http://iec.ch/TC57/2013/CIM-schema-cim16#location.name",
                    "type": "string"
                },
                "location.positionPoints.xPosition": {
                    "description": "X axis position.\n\r\n\r--- Location of this power system resource.\n\r--- Sequence of position points describing this location, expressed in coordinate system 'Location.CoordinateSystem'.",
                    "modelReference": "http://iec.ch/TC57/2013/CIM-schema-cim16#positionPoints.xPosition",
                    "type": "string"
                },
                "location.positionPoints.yPosition": {
                    "description": "Y axis position.\n\r\n\r--- Location of this power system resource.\n\r--- Sequence of position points describing this location, expressed in coordinate system 'Location.CoordinateSystem'.",
                    "modelReference": "http://iec.ch/TC57/2013/CIM-schema-cim16#positionPoints.yPosition",
                    "type": "string"
                },
                "location.positionPoints.zPosition": {
                    "description": "(if applicable) Z axis position.\n\r\n\r--- Location of this power system resource.\n\r--- Sequence of position points describing this location, expressed in coordinate system 'Location.CoordinateSystem'.",
                    "modelReference": "http://iec.ch/TC57/2013/CIM-schema-cim16#positionPoints.zPosition",
                    "type": "string"
                },
                "name": {
                    "description": "The name is any free human readable and possibly non unique text naming the object.",
                    "modelReference": "http://iec.ch/TC57/2013/CIM-schema-cim16#RegisteredResource.name",
                    "type": "string"
                },
                "ResourceCapacity": {
                    "description": "",
                    "modelReference": "http://iec.ch/TC57/2013/CIM-schema-cim16#RegisteredResource.ResourceCapacity",
                    "type": "array",
                    "items": {
                        "$ref": "#/definitions/ResourceCapacity"
                    },
                    "minItems": 0
                }
            },
            "required": [
                "name",
                "description"
            ]
        },
        "ResourceCapacity": {
            "id": "#ResourceCapacity",
            "title": "ResourceCapacity",
            "description": "This class model the various capacities of a resource.",
            "modelReference": "http://iec.ch/TC57/2013/CIM-schema-cim16#ResourceCapacity",
            "type": "object",
            "additionalProperties": false,
            "properties": {
                "capacityType": {
                    "description": "The capacity type.",
                    "modelReference": "http://iec.ch/TC57/2013/CIM-schema-cim16#ResourceCapacity.capacityType",
                    "$ref": "#/definitions/BusinessKind_String"
                },
                "defaultCapacity": {
                    "description": "The default capacity.",
                    "modelReference": "http://iec.ch/TC57/2013/CIM-schema-cim16#ResourceCapacity.defaultCapacity",
                    "type": "number"
                }
            }
        },
        "ResourceQualification_MarketDocument": {
            "id": "#ResourceQualification_MarketDocument",
            "title": "ResourceQualification_MarketDocument",
            "description": "An electronic document containing the information necessary to satisfy the requirements of a given business process.",
            "modelReference": "http://iec.ch/TC57/2013/CIM-schema-cim16#MarketDocument",
            "type": "object",
            "additionalProperties": false,
            "properties": {
                "mRID": {
                    "description": "The unique identification of the document being exchanged within a business process flow.\r\n\r\nIn the ESMP context, the \"model authority\" is defined as a party (originator of the exchange) that provides an identification in the context of a business exchange such as document identification, ...\r\n\r\nMaster resource identifier issued by a model authority. The mRID is globally unique within an exchange context.\r\nGlobal uniqueness is easily achieved by using a UUID for the mRID. It is strongly recommended to do this.\r\nFor CIMXML data files in RDF syntax, the mRID is mapped to rdf:ID or rdf:about attributes that identify CIM object elements.",
                    "modelReference": "http://iec.ch/TC57/2013/CIM-schema-cim16#MarketDocument.mRID",
                    "$ref": "#/definitions/ID_String"
                },
                "createdDateTime": {
                    "description": "The date and time of the creation of the document.",
                    "modelReference": "http://iec.ch/TC57/2013/CIM-schema-cim16#MarketDocument.createdDateTime",
                    "$ref": "#/definitions/ESMP_DateTime"
                },
                "process.processType": {
                    "description": "The identification of the nature of process that the document addresses.\n\r--- The Process associated with an electronic document header that is valid for the whole document.",
                    "modelReference": "http://iec.ch/TC57/2013/CIM-schema-cim16#process.processType",
                    "$ref": "#/definitions/ProcessKind_String"
                },
                "receiver_MarketParticipant.mRID": {
                    "description": "The identification of a party in the energy market.\r\n\r\nIn the ESMP context, the \"model authority\" is defined as an authorized issuing office that provides an agreed identification coding scheme for market participant, domain, measurement point, resources (generator, lines, substations, etc.) identification.\r\n\r\nMaster resource identifier issued by a model authority. The mRID is globally unique within an exchange context.\r\nGlobal uniqueness is easily achieved by using a UUID for the mRID. It is strongly recommended to do this.\r\nFor CIMXML data files in RDF syntax, the mRID is mapped to rdf:ID or rdf:about attributes that identify CIM object elements.\n\r--- The MarketParticipant associated with an electronic document header.",
                    "modelReference": "http://iec.ch/TC57/2013/CIM-schema-cim16#MarketParticipant.mRID",
                    "$ref": "#/definitions/PartyID_String"
                },
                "receiver_MarketParticipant.marketRole.type": {
                    "description": "The identification of the role played by a market player.\n\r\n\r--- The MarketParticipant associated with an electronic document header.\n\r--- The role associated with a MarketParticipant.",
                    "modelReference": "http://iec.ch/TC57/2013/CIM-schema-cim16#marketRole.type",
                    "$ref": "#/definitions/MarketRoleKind_String"
                },
                "revisionNumber": {
                    "description": "The identification of the version that distinguishes one evolution of a document from another.",
                    "modelReference": "http://iec.ch/TC57/2013/CIM-schema-cim16#MarketDocument.revisionNumber",
                    "$ref": "#/definitions/ESMPVersion_String"
                },
                "sender_MarketParticipant.mRID": {
                    "description": "The identification of a party in the energy market.\r\n\r\nIn the ESMP context, the \"model authority\" is defined as an authorized issuing office that provides an agreed identification coding scheme for market participant, domain, measurement point, resources (generator, lines, substations, etc.) identification.\r\n\r\nMaster resource identifier issued by a model authority. The mRID is globally unique within an exchange context.\r\nGlobal uniqueness is easily achieved by using a UUID for the mRID. It is strongly recommended to do this.\r\nFor CIMXML data files in RDF syntax, the mRID is mapped to rdf:ID or rdf:about attributes that identify CIM object elements.\n\r--- The MarketParticipant associated with an electronic document header.",
                    "modelReference": "http://iec.ch/TC57/2013/CIM-schema-cim16#MarketParticipant.mRID",
                    "$ref": "#/definitions/PartyID_String"
                },
                "sender_MarketParticipant.marketRole.type": {
                    "description": "The identification of the role played by a market player.\n\r\n\r--- The MarketParticipant associated with an electronic document header.\n\r--- The role associated with a MarketParticipant.",
                    "modelReference": "http://iec.ch/TC57/2013/CIM-schema-cim16#marketRole.type",
                    "$ref": "#/definitions/MarketRoleKind_String"
                },
                "type": {
                    "description": "The coded type of a document. The document type describes the principal characteristic of the document.",
                    "modelReference": "http://iec.ch/TC57/2013/CIM-schema-cim16#MarketDocument.type",
                    "$ref": "#/definitions/MessageKind_String"
                },
                "TimeSeries": {
                    "description": "The time series that is associated with an electronic document.",
                    "modelReference": "http://iec.ch/TC57/2013/CIM-schema-cim16#MarketDocument.TimeSeries",
                    "type": "array",
                    "items": {
                        "$ref": "#/definitions/ResourceQualification_TimeSeries"
                    },
                    "minItems": 1
                },
                "Time_Period": {
                    "description": "The time interval that is associated with an electronic document and which is valid for the whole document.",
                    "modelReference": "http://iec.ch/TC57/2013/CIM-schema-cim16#MarketDocument.Time_Period",
                    "$ref": "#/definitions/Time_Period"
                }
            },
            "required": [
                "mRID",
                "revisionNumber",
                "type",
                "createdDateTime",
                "process.processType",
                "sender_MarketParticipant.mRID",
                "sender_MarketParticipant.marketRole.type",
                "receiver_MarketParticipant.mRID",
                "receiver_MarketParticipant.marketRole.type",
                "TimeSeries",
                "Time_Period"
            ]
        },
        "ResourceQualification_TimeSeries": {
            "id": "#ResourceQualification_TimeSeries",
            "title": "ResourceQualification_TimeSeries",
            "description": "A set of time-ordered quantities being exchanged in relation to a product.\r\nIn the ESMP profile, the TimeSeries provides not only time-ordered quantities but also time-ordered information.",
            "modelReference": "http://iec.ch/TC57/2013/CIM-schema-cim16#TimeSeries",
            "type": "object",
            "additionalProperties": false,
            "properties": {
                "mRID": {
                    "description": "A unique identification of the time series.\r\n\r\nIn the ESMP context, the \"model authority\" is defined as a party (originator of the exchange) that provides a unique identification in the context of a business exchange such as time series identification, bid identification, ...\r\n\r\nMaster resource identifier issued by a model authority. The mRID is globally unique within an exchange context.\r\nGlobal uniqueness is easily achieved by using a UUID for the mRID. It is strongly recommended to do this.\r\nFor CIMXML data files in RDF syntax, the mRID is mapped to rdf:ID or rdf:about attributes that identify CIM object elements.",
                    "modelReference": "http://iec.ch/TC57/2013/CIM-schema-cim16#TimeSeries.mRID",
                    "$ref": "#/definitions/ID_String"
                },
                "marketEvaluationPoint.connectionCategory": {
                    "description": "A code used to specify the connection category.\n\r--- The identification of a measurement point associated with a TimeSeries.",
                    "modelReference": "http://iec.ch/TC57/2013/CIM-schema-cim16#marketEvaluationPoint.connectionCategory",
                    "type": "string"
                },
                "marketEvaluationPoint.mRID": {
                    "description": "A unique identification of the measurement point.\r\n\r\nIn the ESMP context, the \"model authority\" is defined as an authorized issuing office that provides an agreed identification coding scheme for market participant, domain, measurement point, resources (generator, lines, substations, etc.) identification.\r\n\r\nMaster resource identifier issued by a model authority. The mRID is globally unique within an exchange context.\r\nGlobal uniqueness is easily achieved by using a UUID for the mRID. It is strongly recommended to do this.\r\nFor CIMXML data files in RDF syntax, the mRID is mapped to rdf:ID or rdf:about attributes that identify CIM object elements.\n\r--- The identification of a measurement point associated with a TimeSeries.",
                    "modelReference": "http://iec.ch/TC57/2013/CIM-schema-cim16#marketEvaluationPoint.mRID",
                    "$ref": "#/definitions/MeasurementPointID_String"
                },
                "DownRegulation_TimePeriod": {
                    "description": "The time interval associated with a TimeSeries within an electronic document.",
                    "modelReference": "http://iec.ch/TC57/2013/CIM-schema-cim16#TimeSeries.DownRegulation_TimePeriod",
                    "type": "array",
                    "items": {
                        "$ref": "#/definitions/Time_Period"
                    },
                    "minItems": 1
                },
                "UpRegulation_TimePeriod": {
                    "description": "The time interval associated with a TimeSeries within an electronic document.",
                    "modelReference": "http://iec.ch/TC57/2013/CIM-schema-cim16#TimeSeries.UpRegulation_TimePeriod",
                    "type": "array",
                    "items": {
                        "$ref": "#/definitions/Time_Period"
                    },
                    "minItems": 1
                },
                "RegisteredResource": {
                    "description": "The identification of a resource associated with a TimeSeries.",
                    "modelReference": "http://iec.ch/TC57/2013/CIM-schema-cim16#TimeSeries.RegisteredResource",
                    "type": "array",
                    "items": {
                        "$ref": "#/definitions/RegisteredResource"
                    },
                    "minItems": 0
                },
                "Owner": {
                    "description": "The identification of a market participant associated with a TimeSeries.",
                    "modelReference": "http://iec.ch/TC57/2013/CIM-schema-cim16#TimeSeries.Owner",
                    "type": "array",
                    "items": {
                        "$ref": "#/definitions/Owner_MarketParticipant"
                    },
                    "minItems": 0
                },
                "MktPSRType": {
                    "description": "The identification of the type of resource associated with a TimeSeries.",
                    "modelReference": "http://iec.ch/TC57/2013/CIM-schema-cim16#TimeSeries.MktPSRType",
                    "type": "array",
                    "items": {
                        "$ref": "#/definitions/MktPSRType"
                    },
                    "minItems": 1
                },
                "Domain": {
                    "description": "The domain associated with a TimeSeries.",
                    "modelReference": "http://iec.ch/TC57/2013/CIM-schema-cim16#TimeSeries.Domain",
                    "type": "array",
                    "items": {
                        "$ref": "#/definitions/Domain"
                    },
                    "minItems": 0
                },
                "RecoveryTime_ConstraintDuration": {
                    "description": "The constraint duration for the process described in the TimeSeries.",
                    "modelReference": "http://iec.ch/TC57/2013/CIM-schema-cim16#TimeSeries.RecoveryTime_ConstraintDuration",
                    "type": "array",
                    "items": {
                        "$ref": "#/definitions/ConstraintDuration"
                    },
                    "minItems": 0
                },
                "MaximumDuration_ConstraintDuration": {
                    "description": "The constraint duration for the process described in the TimeSeries.",
                    "modelReference": "http://iec.ch/TC57/2013/CIM-schema-cim16#TimeSeries.MaximumDuration_ConstraintDuration",
                    "type": "array",
                    "items": {
                        "$ref": "#/definitions/ConstraintDuration"
                    },
                    "minItems": 0
                }
            },
            "required": [
                "mRID",
                "marketEvaluationPoint.mRID",
                "DownRegulation_TimePeriod",
                "UpRegulation_TimePeriod",
                "MktPSRType"
            ]
        },
        "Time_Period": {
            "id": "#Time_Period",
            "title": "Time_Period",
            "description": "The identification of a time interval or a duration.",
            "modelReference": "http://iec.ch/TC57/2013/CIM-schema-cim16#Period",
            "type": "object",
            "additionalProperties": false,
            "properties": {
                "timeInterval": {
                    "description": "The start and end date and time for a given interval.",
                    "modelReference": "http://iec.ch/TC57/2013/CIM-schema-cim16#Period.timeInterval",
                    "$ref": "#/definitions/ESMP_DateTimeInterval"
                }
            },
            "required": [
                "timeInterval"
            ]
        },
        "AreaID_String": {
            "id": "#AreaID_String",
            "title": "AreaID_String",
            "description": "The coded identification of a domain, i.e. balance area, grid area, etc.\r\n\r\nIn the ESMP context, it is an authorized issuing office that provides an agreed identification coding scheme for domain identification.",
            "modelReference": "http://iec.ch/TC57/2013/CIM-schema-cim16#String",
            "type": "object",
            "additionalProperties": false,
            "properties": {
                "codingScheme": {
                    "description": "DomainQualification.",
                    "$ref": "urn-entsoe-eu-wgedi-codelists.schema.json#/definitions/CodingSchemeTypeList",
                    "modelReference": "http://iec.ch/TC57/2013/CIM-schema-cim16#String.codingScheme"
                },
                "value": {
                    "description": "Main Core value Space.",
                    "type": "string",
                    "maxLength": 18,
                    "modelReference": "http://iec.ch/TC57/2013/CIM-schema-cim16#String.value"
                }
            },
            "required": [
                "codingScheme",
                "value"
            ]
        },
        "PsrType_String": {
            "id": "#PsrType_String",
            "title": "PsrType_String",
            "description": "The coded type of a power system resource.",
            "modelReference": "http://iec.ch/TC57/2013/CIM-schema-cim16#String",
            "type": "object",
            "additionalProperties": false,
            "properties": {
                "value": {
                    "description": "Main Core value Space.",
                    "$ref": "urn-entsoe-eu-wgedi-codelists.schema.json#/definitions/AssetTypeList"
                }
            },
            "required": [
                "value"
            ]
        },
        "PartyID_String": {
            "id": "#PartyID_String",
            "title": "PartyID_String",
            "description": "The identification of an actor in the energy market.\r\n\r\nIn the ESMP context, it is an authorized issuing office that provides an agreed identification coding scheme for market participant identification.",
            "modelReference": "http://iec.ch/TC57/2013/CIM-schema-cim16#String",
            "type": "object",
            "additionalProperties": false,
            "properties": {
                "codingScheme": {
                    "description": "DomainQualification.",
                    "$ref": "urn-entsoe-eu-wgedi-codelists.schema.json#/definitions/CodingSchemeTypeList",
                    "modelReference": "http://iec.ch/TC57/2013/CIM-schema-cim16#String.codingScheme"
                },
                "value": {
                    "description": "Main Core value Space.",
                    "type": "string",
                    "maxLength": 16,
                    "modelReference": "http://iec.ch/TC57/2013/CIM-schema-cim16#String.value"
                }
            },
            "required": [
                "codingScheme",
                "value"
            ]
        },
        "Characters70_String": {
            "id": "#Characters70_String",
            "title": "Characters70_String",
            "description": "A string consisting of a sequence of 8 bit characters. The character encoding is UTF-8. \r\nThe string has 70 characters.",
            "modelReference": "http://iec.ch/TC57/2013/CIM-schema-cim16#String",
            "type": "object",
            "additionalProperties": false,
            "properties": {
                "value": {
                    "description": "The string length is restricted to 70 characters.",
                    "type": "string",
                    "maxLength": 70
                }
            },
            "required": [
                "value"
            ]
        },
        "StreetDetail": {
            "id": "#StreetDetail",
            "title": "StreetDetail",
            "description": "Street details, in the context of address.",
            "modelReference": "http://iec.ch/TC57/2013/CIM-schema-cim16#StreetDetail",
            "type": "object",
            "additionalProperties": false,
            "properties": {
                "addressGeneral": {
                    "description": "First line of a free form address or some additional address information (for example a mail stop).",
                    "modelReference": "http://iec.ch/TC57/2013/CIM-schema-cim16#StreetDetail.addressGeneral",
                    "$ref": "#/definitions/Characters70_String"
                },
                "addressGeneral2": {
                    "description": "If applicable, second line of a free form address (unstructured address).",
                    "modelReference": "http://iec.ch/TC57/2013/CIM-schema-cim16#StreetDetail.addressGeneral2",
                    "$ref": "#/definitions/Characters70_String"
                },
                "addressGeneral3": {
                    "description": "If applicable, third line of a free form address (unstructured address).",
                    "modelReference": "http://iec.ch/TC57/2013/CIM-schema-cim16#StreetDetail.addressGeneral3",
                    "$ref": "#/definitions/Characters70_String"
                },
                "floorIdentification": {
                    "description": "The identification by name or number, expressed as text, of the floor in the building as part of this address.",
                    "modelReference": "http://iec.ch/TC57/2013/CIM-schema-cim16#StreetDetail.floorIdentification",
                    "type": "string",
                    "maxLength": 70
                }
            },
            "required": [
                "floorIdentification"
            ]
        },
        "Characters10_String": {
            "id": "#Characters10_String",
            "title": "Characters10_String",
            "description": "A string consisting of a sequence of 8 bit characters. The character encoding is UTF-8.\r\nThe string length is restricted to 10 characters.",
            "modelReference": "http://iec.ch/TC57/2013/CIM-schema-cim16#String",
            "type": "object",
            "additionalProperties": false,
            "properties": {
                "value": {
                    "description": "The string length is restricted to 10 characters.",
                    "type": "string",
                    "maxLength": 10
                }
            },
            "required": [
                "value"
            ]
        },
        "Characters35_String": {
            "id": "#Characters35_String",
            "title": "Characters35_String",
            "description": "A string consisting of a sequence of 8 bit characters. The character encoding is UTF-8.\r\nThe string length is restricted to 35 characters.",
            "modelReference": "http://iec.ch/TC57/2013/CIM-schema-cim16#String",
            "type": "object",
            "additionalProperties": false,
            "properties": {
                "value": {
                    "description": "The string length is restricted to 35 characters.",
                    "type": "string",
                    "maxLength": 35
                }
            },
            "required": [
                "value"
            ]
        },
        "Characters2_String": {
            "id": "#Characters2_String",
            "title": "Characters2_String",
            "description": "A string consisting of a sequence of 8 bit characters. The character encoding is UTF-8. \r\nThe string length is restricted to 2 alphabetic characters.",
            "modelReference": "http://iec.ch/TC57/2013/CIM-schema-cim16#String",
            "type": "object",
            "additionalProperties": false,
            "properties": {
                "value": {
                    "description": "The string length is restricted to 2 alphabetic characters for the ISO country code (ISO 3166-1).",
                    "type": "string",
                    "minimum": 2,
                    "maximum": 2,
                    "pattern": "^[A-Z]*$"
                }
            },
            "required": [
                "value"
            ]
        },
        "TownDetail": {
            "id": "#TownDetail",
            "title": "TownDetail",
            "description": "Town details, in the context of address.",
            "modelReference": "http://iec.ch/TC57/2013/CIM-schema-cim16#TownDetail",
            "type": "object",
            "additionalProperties": false,
            "properties": {
                "name": {
                    "description": "Town name.",
                    "modelReference": "http://iec.ch/TC57/2013/CIM-schema-cim16#TownDetail.name",
                    "$ref": "#/definitions/Characters35_String"
                },
                "country": {
                    "description": "Name of the country (ISO 3166 2 character code identification).",
                    "modelReference": "http://iec.ch/TC57/2013/CIM-schema-cim16#TownDetail.country",
                    "$ref": "#/definitions/Characters2_String"
                }
            },
            "required": [
                "name",
                "country"
            ]
        },
        "StreetAddress": {
            "id": "#StreetAddress",
            "title": "StreetAddress",
            "description": "General purpose street address information.",
            "modelReference": "http://iec.ch/TC57/2013/CIM-schema-cim16#StreetAddress",
            "type": "object",
            "additionalProperties": false,
            "properties": {
                "streetDetail": {
                    "description": "Street detail.",
                    "modelReference": "http://iec.ch/TC57/2013/CIM-schema-cim16#StreetAddress.streetDetail",
                    "$ref": "#/definitions/StreetDetail"
                },
                "postalCode": {
                    "description": "Postal code for the address.",
                    "modelReference": "http://iec.ch/TC57/2013/CIM-schema-cim16#StreetAddress.postalCode",
                    "$ref": "#/definitions/Characters10_String"
                },
                "townDetail": {
                    "description": "Town detail.",
                    "modelReference": "http://iec.ch/TC57/2013/CIM-schema-cim16#StreetAddress.townDetail",
                    "$ref": "#/definitions/TownDetail"
                },
                "language": {
                    "description": "The language in which the address is specified using ISO60039-1 two digit code.",
                    "modelReference": "http://iec.ch/TC57/2013/CIM-schema-cim16#StreetAddress.language",
                    "type": "string",
                    "minimum": 2,
                    "maximum": 2,
                    "pattern": "^[A-Z]*$"
                }
            },
            "required": [
                "streetDetail",
                "postalCode",
                "townDetail"
            ]
        },
        "Characters15_String": {
            "id": "#Characters15_String",
            "title": "Characters15_String",
            "description": "A string consisting of a sequence of 8 bit characters. The character encoding is UTF-8. \r\nThe string length is restricted to 15 characters.",
            "modelReference": "http://iec.ch/TC57/2013/CIM-schema-cim16#String",
            "type": "object",
            "additionalProperties": false,
            "properties": {
                "value": {
                    "description": "The string length is restricted to 15 characters.",
                    "type": "string",
                    "maxLength": 15
                }
            },
            "required": [
                "value"
            ]
        },
        "TelephoneNumber": {
            "id": "#TelephoneNumber",
            "title": "TelephoneNumber",
            "description": "Telephone number.",
            "modelReference": "http://iec.ch/TC57/2013/CIM-schema-cim16#TelephoneNumber",
            "type": "object",
            "additionalProperties": false,
            "properties": {
                "ituPhone": {
                    "description": "Phone number according to ITU E.164.",
                    "modelReference": "http://iec.ch/TC57/2013/CIM-schema-cim16#TelephoneNumber.ituPhone",
                    "$ref": "#/definitions/Characters15_String"
                }
            },
            "required": [
                "ituPhone"
            ]
        },
        "ElectronicAddress": {
            "id": "#ElectronicAddress",
            "title": "ElectronicAddress",
            "description": "Electronic address information.",
            "modelReference": "http://iec.ch/TC57/2013/CIM-schema-cim16#ElectronicAddress",
            "type": "object",
            "additionalProperties": false,
            "properties": {
                "email1": {
                    "description": "Primary email address.",
                    "modelReference": "http://iec.ch/TC57/2013/CIM-schema-cim16#ElectronicAddress.email1",
                    "$ref": "#/definitions/Characters70_String"
                }
            },
            "required": [
                "email1"
            ]
        },
        "CoordinateSystemKind_String": {
            "id": "#CoordinateSystemKind_String",
            "title": "CoordinateSystemKind_String",
            "description": "The identification of the nature of an energy product such as power, energy, reactive power, etc.",
            "modelReference": "http://iec.ch/TC57/2013/CIM-schema-cim16#String",
            "type": "object",
            "additionalProperties": false,
            "properties": {
                "value": {
                    "description": "Main Core value Space.",
                    "$ref": "urn-entsoe-eu-wgedi-codelists.schema.json#/definitions/CoordinateSystemTypeList"
                }
            },
            "required": [
                "value"
            ]
        },
        "BusinessKind_String": {
            "id": "#BusinessKind_String",
            "title": "BusinessKind_String",
            "description": "The coded identification of the business type.",
            "modelReference": "http://iec.ch/TC57/2013/CIM-schema-cim16#String",
            "type": "object",
            "additionalProperties": false,
            "properties": {
                "value": {
                    "description": "Main Core value Space.",
                    "$ref": "urn-entsoe-eu-wgedi-codelists.schema.json#/definitions/BusinessTypeList"
                }
            },
            "required": [
                "value"
            ]
        },
        "ID_String": {
            "id": "#ID_String",
            "title": "ID_String",
            "description": "A code to uniquely distinguish one occurrence of an entity from another.\r\n\r\nIn the ESMP context, the code is defined either by:\r\n- an emitting company that provides an agreed identification unique within a business context such as capacity auction identification, market agreement identification, etc.\r\n- a party (originator of the exchange) that provides a unique identification in the framework of a business exchange such as document identification, time series identification, bid identification, ...",
            "modelReference": "http://iec.ch/TC57/2013/CIM-schema-cim16#String",
            "type": "object",
            "additionalProperties": false,
            "properties": {
                "value": {
                    "description": "Main Core value Space.",
                    "type": "string",
                    "maxLength": 60
                }
            },
            "required": [
                "value"
            ]
        },
        "ESMPVersion_String": {
            "id": "#ESMPVersion_String",
            "title": "ESMPVersion_String",
            "description": "In ESMP, the coded value is restricted to digits.\r\n\r\nA code that distinguishes one evolution of an identified object from another. Information about a specific object may be sent several times, each transmission being identified by a different version number.",
            "modelReference": "http://iec.ch/TC57/2013/CIM-schema-cim16#String",
            "type": "object",
            "additionalProperties": false,
            "properties": {
                "value": {
                    "description": "Main Core value Space.",
                    "type": "string",
                    "pattern": "^[1-9]([0-9]){0,2}$"
                }
            },
            "required": [
                "value"
            ]
        },
        "MessageKind_String": {
            "id": "#MessageKind_String",
            "title": "MessageKind_String",
            "description": "The coded type of a document.",
            "modelReference": "http://iec.ch/TC57/2013/CIM-schema-cim16#String",
            "type": "object",
            "additionalProperties": false,
            "properties": {
                "value": {
                    "description": "Main Core value Space.",
                    "$ref": "urn-entsoe-eu-wgedi-codelists.schema.json#/definitions/MessageTypeList"
                }
            },
            "required": [
                "value"
            ]
        },
        "ESMP_DateTime": {
            "id": "#ESMP_DateTime",
            "title": "ESMP_DateTime",
            "description": "In ESMP, the dateTime shall be expressed in UTC as YYYY-MM-DDThh:mm:ssZ.",
            "modelReference": "http://iec.ch/TC57/2013/CIM-schema-cim16#DateTime",
            "type": "object",
            "additionalProperties": false,
            "properties": {
                "value": {
                    "description": "Main Core value Space.",
                    "type": "string",
                    "pattern": "^((([0-9]{4})[\\-](0[13578]|1[02])[\\-](0[1-9]|[12][0-9]|3[01])|([0-9]{4})[\\-]((0[469])|(11))[\\-](0[1-9]|[12][0-9]|30))T(([01][0-9]|2[0-3]):[0-5][0-9]:[0-5][0-9])Z)|(([13579][26][02468][048]|[13579][01345789](0)[48]|[13579][01345789][2468][048]|[02468][048][02468][048]|[02468][1235679](0)[48]|[02468][1235679][2468][048]|[0-9][0-9][13579][26])[\\-](02)[\\-](0[1-9]|1[0-9]|2[0-9])T(([01][0-9]|2[0-3]):[0-5][0-9]:[0-5][0-9])Z)|(([13579][26][02468][1235679]|[13579][01345789](0)[01235679]|[13579][01345789][2468][1235679]|[02468][048][02468][1235679]|[02468][1235679](0)[01235679]|[02468][1235679][2468][1235679]|[0-9][0-9][13579][01345789])[\\-](02)[\\-](0[1-9]|1[0-9]|2[0-8])T(([01][0-9]|2[0-3]):[0-5][0-9]:[0-5][0-9])Z)$"
                }
            },
            "required": [
                "value"
            ]
        },
        "ProcessKind_String": {
            "id": "#ProcessKind_String",
            "title": "ProcessKind_String",
            "description": "The coded identification of the nature of process.",
            "modelReference": "http://iec.ch/TC57/2013/CIM-schema-cim16#String",
            "type": "object",
            "additionalProperties": false,
            "properties": {
                "value": {
                    "description": "Main Core value Space.",
                    "$ref": "urn-entsoe-eu-wgedi-codelists.schema.json#/definitions/ProcessTypeList"
                }
            },
            "required": [
                "value"
            ]
        },
        "MarketRoleKind_String": {
            "id": "#MarketRoleKind_String",
            "title": "MarketRoleKind_String",
            "description": "The identification of the role played by a party.",
            "modelReference": "http://iec.ch/TC57/2013/CIM-schema-cim16#String",
            "type": "object",
            "additionalProperties": false,
            "properties": {
                "value": {
                    "description": "Main Core value Space.",
                    "$ref": "urn-entsoe-eu-wgedi-codelists.schema.json#/definitions/RoleTypeList"
                }
            },
            "required": [
                "value"
            ]
        },
        "MeasurementPointID_String": {
            "id": "#MeasurementPointID_String",
            "title": "MeasurementPointID_String",
            "description": "The coded identification of a domain covering a number of related objects, such as metering point, accounting point, etc.\r\n\r\nIn the ESMP context, it is an authorized issuing office that provides an agreed identification coding scheme for measurement point identification.",
            "modelReference": "http://iec.ch/TC57/2013/CIM-schema-cim16#String",
            "type": "object",
            "additionalProperties": false,
            "properties": {
                "codingScheme": {
                    "description": "DomainQualification.",
                    "$ref": "urn-entsoe-eu-wgedi-codelists.schema.json#/definitions/CodingSchemeTypeList",
                    "modelReference": "http://iec.ch/TC57/2013/CIM-schema-cim16#String.codingScheme"
                },
                "value": {
                    "description": "Main Core value Space.",
                    "type": "string",
                    "maxLength": 35,
                    "modelReference": "http://iec.ch/TC57/2013/CIM-schema-cim16#String.value"
                }
            },
            "required": [
                "codingScheme",
                "value"
            ]
        },
        "YMDHM_DateTime": {
            "id": "#YMDHM_DateTime",
            "title": "YMDHM_DateTime",
            "description": "In ESMP, the date and time is expressed as \"YYYY-MM-DDThh:mmZ\", which conforms with ISO 8601 UTC time zone. This date and time is without the seconds.",
            "modelReference": "http://iec.ch/TC57/2013/CIM-schema-cim16#DateTime",
            "type": "object",
            "additionalProperties": false,
            "properties": {
                "value": {
                    "description": "The date and time as \"YYYY-MM-DDThh:mmZ\", which conforms with the ISO 8601 UTC time zone.",
                    "type": "string",
                    "pattern": "^((([0-9]{4})[\\-](0[13578]|1[02])[\\-](0[1-9]|[12][0-9]|3[01])|([0-9]{4})[\\-]((0[469])|(11))[\\-](0[1-9]|[12][0-9]|30))T(([01][0-9]|2[0-3]):[0-5][0-9])Z)|(([13579][26][02468][048]|[13579][01345789](0)[48]|[13579][01345789][2468][048]|[02468][048][02468][048]|[02468][1235679](0)[48]|[02468][1235679][2468][048]|[0-9][0-9][13579][26])[\\-](02)[\\-](0[1-9]|1[0-9]|2[0-9])T(([01][0-9]|2[0-3]):[0-5][0-9])Z)|(([13579][26][02468][1235679]|[13579][01345789](0)[01235679]|[13579][01345789][2468][1235679]|[02468][048][02468][1235679]|[02468][1235679](0)[01235679]|[02468][1235679][2468][1235679]|[0-9][0-9][13579][01345789])[\\-](02)[\\-](0[1-9]|1[0-9]|2[0-8])T(([01][0-9]|2[0-3]):[0-5][0-9])Z)$"
                }
            },
            "required": [
                "value"
            ]
        },
        "ESMP_DateTimeInterval": {
            "id": "#ESMP_DateTimeInterval",
            "title": "ESMP_DateTimeInterval",
            "description": "This datatype enables to express the start date and time, and the end date and time of a time interval with a specific pattern. This pattern is the YYYY-MM-DDThh:mmZ.",
            "modelReference": "http://iec.ch/TC57/2013/CIM-schema-cim16#DateTimeInterval",
            "type": "object",
            "additionalProperties": false,
            "properties": {
                "start": {
                    "description": "The start date and time of the interval with a minute resolution.",
                    "modelReference": "http://iec.ch/TC57/2013/CIM-schema-cim16#DateTimeInterval.start",
                    "$ref": "#/definitions/YMDHM_DateTime"
                },
                "end": {
                    "description": "The end date and time of the interval with a minute resolution.",
                    "modelReference": "http://iec.ch/TC57/2013/CIM-schema-cim16#DateTimeInterval.end",
                    "$ref": "#/definitions/YMDHM_DateTime"
                }
            },
            "required": [
                "start",
                "end"
            ]
        }
    }
}