{
    "$schema": "https://json-schema.org/draft-04/schema#",
    "id": "urn:iec62325.351:tc57wg16:451-n:smtaresultsdocument:1:0",
    "definitions": {
        "Position_Integer": {
            "allOf": [
                {
                    "type": "integer",
                    "maximum": 999999,
                    "exclusiveMaximum": false,
                    "minimum": 1,
                    "exclusiveMinimum": false
                }
            ]
        },
        "ReasonCodeTypeList": {
            "allOf": [
                {
                    "type": "string"
                },
                {
                    "enum": [
                        "999",
                        "A01",
                        "A02",
                        "A03",
                        "A04",
                        "A05",
                        "A06",
                        "A07",
                        "A08",
                        "A09",
                        "A10",
                        "A20",
                        "A21",
                        "A22",
                        "A23",
                        "A24",
                        "A25",
                        "A26",
                        "A27",
                        "A28",
                        "A29",
                        "A30",
                        "A41",
                        "A42",
                        "A43",
                        "A44",
                        "A45",
                        "A46",
                        "A47",
                        "A48",
                        "A49",
                        "A50",
                        "A51",
                        "A52",
                        "A53",
                        "A54",
                        "A55",
                        "A56",
                        "A57",
                        "A58",
                        "A59",
                        "A60",
                        "A61",
                        "A62",
                        "A63",
                        "A64",
                        "A65",
                        "A66",
                        "A67",
                        "A68",
                        "A69",
                        "A70",
                        "A71",
                        "A72",
                        "A73",
                        "A74",
                        "A75",
                        "A76",
                        "A77",
                        "A78",
                        "A79",
                        "A80",
                        "A81",
                        "A82",
                        "A83",
                        "A84",
                        "A85",
                        "A86",
                        "A87",
                        "A88",
                        "A89",
                        "A90",
                        "A91",
                        "A92",
                        "A93",
                        "A94",
                        "A95",
                        "A96",
                        "A97",
                        "A98",
                        "A99",
                        "B01",
                        "B02",
                        "B03",
                        "B04",
                        "B05",
                        "B06",
                        "B07",
                        "B08",
                        "B09",
                        "B10",
                        "B11",
                        "B12",
                        "B13",
                        "B14",
                        "B15",
                        "B16",
                        "B17",
                        "B18",
                        "B19",
                        "B20",
                        "B21",
                        "B22",
                        "B23",
                        "B24",
                        "B25",
                        "B26",
                        "B27",
                        "B28",
                        "B29",
                        "B30",
                        "B31",
                        "B32",
                        "B33",
                        "B34",
                        "B35",
                        "B36",
                        "B37",
                        "B38",
                        "B39",
                        "B40",
                        "B41",
                        "B42",
                        "B43",
                        "B44",
                        "B45",
                        "B46",
                        "B47",
                        "B48",
                        "B49",
                        "B50",
                        "B51",
                        "B52",
                        "B53",
                        "B54",
                        "B55",
                        "B56",
                        "B57",
                        "B58",
                        "B59",
                        "B60",
                        "B61",
                        "B62",
                        "B63",
                        "B64",
                        "B65",
                        "B66",
                        "B67",
                        "999"
                    ]
                }
            ]
        },
        "ReasonCode_String": {
            "allOf": [
                {
                    "$ref": "#/definitions/ReasonCodeTypeList"
                }
            ]
        },
        "ReasonText_String": {
            "allOf": [
                {
                    "type": "string",
                    "maxLength": 512
                }
            ]
        },
        "YMDHM_DateTime": {
            "allOf": [
                {
                    "type": "string",
                    "pattern": "((([0-9]{4})[\\-](0[13578]|1[02])[\\-](0[1-9]|[12][0-9]|3[01])|([0-9]{4})[\\-]((0[469])|(11))[\\-](0[1-9]|[12][0-9]|30))T(([01][0-9]|2[0-3]):[0-5][0-9])Z)|(([13579][26][02468][048]|[13579][01345789](0)[48]|[13579][01345789][2468][048]|[02468][048][02468][048]|[02468][1235679](0)[48]|[02468][1235679][2468][048]|[0-9][0-9][13579][26])[\\-](02)[\\-](0[1-9]|1[0-9]|2[0-9])T(([01][0-9]|2[0-3]):[0-5][0-9])Z)|(([13579][26][02468][1235679]|[13579][01345789](0)[01235679]|[13579][01345789][2468][1235679]|[02468][048][02468][1235679]|[02468][1235679](0)[01235679]|[02468][1235679][2468][1235679]|[0-9][0-9][13579][01345789])[\\-](02)[\\-](0[1-9]|1[0-9]|2[0-8])T(([01][0-9]|2[0-3]):[0-5][0-9])Z)"
                }
            ]
        },
        "ID_String": {
            "allOf": [
                {
                    "type": "string",
                    "maxLength": 35
                }
            ]
        },
        "ESMPVersion_String": {
            "allOf": [
                {
                    "type": "string",
                    "pattern": "[1-9]([0-9]){0,2}"
                }
            ]
        },
        "MessageTypeList": {
            "allOf": [
                {
                    "type": "string"
                },
                {
                    "enum": [
                        "A01",
                        "A02",
                        "A03",
                        "A04",
                        "A05",
                        "A06",
                        "A07",
                        "A08",
                        "A09",
                        "A10",
                        "A11",
                        "A12",
                        "A13",
                        "A14",
                        "A15",
                        "A16",
                        "A17",
                        "A18",
                        "A19",
                        "A20",
                        "A21",
                        "A22",
                        "A23",
                        "A24",
                        "A25",
                        "A26",
                        "A27",
                        "A28",
                        "A30",
                        "A31",
                        "A32",
                        "A33",
                        "A34",
                        "A35",
                        "A36",
                        "A37",
                        "A38",
                        "A39",
                        "A40",
                        "A41",
                        "A42",
                        "A43",
                        "A44",
                        "A45",
                        "A46",
                        "A47",
                        "A48",
                        "A49",
                        "A50",
                        "A51",
                        "A52",
                        "A53",
                        "A54",
                        "A55",
                        "A56",
                        "A57",
                        "A58",
                        "A59",
                        "A60",
                        "A61",
                        "A62",
                        "A63",
                        "A64",
                        "A65",
                        "A66",
                        "A67",
                        "A68",
                        "A69",
                        "A70",
                        "A71",
                        "A72",
                        "A73",
                        "A74",
                        "A75",
                        "A76",
                        "A77",
                        "A78",
                        "A79",
                        "A80",
                        "A81",
                        "A82",
                        "A83",
                        "A84",
                        "A85",
                        "A86",
                        "A87",
                        "A88",
                        "A89",
                        "A90",
                        "A91",
                        "A92",
                        "A93",
                        "A94",
                        "A95",
                        "A96",
                        "A97",
                        "A98",
                        "A99",
                        "B01",
                        "B02",
                        "B03",
                        "B04",
                        "B05",
                        "B06",
                        "B07",
                        "B08",
                        "B09",
                        "B10",
                        "B11",
                        "B12",
                        "B13",
                        "B14",
                        "B15",
                        "B16",
                        "B17",
                        "B18",
                        "B19",
                        "B20",
                        "B21",
                        "B22",
                        "B23",
                        "B24",
                        "B25",
                        "B26",
                        "B27",
                        "B28",
                        "B29",
                        "B30",
                        "B31",
                        "B32",
                        "B33",
                        "B34",
                        "B35",
                        "B36",
                        "B37",
                        "B38",
                        "B39",
                        "B40",
                        "B41",
                        "B42",
                        "B43",
                        "B44",
                        "B45",
                        "B46",
                        "B47",
                        "B48",
                        "A01"
                    ]
                }
            ]
        },
        "MessageKind_String": {
            "allOf": [
                {
                    "$ref": "#/definitions/MessageTypeList"
                }
            ]
        },
        "ProcessTypeList": {
            "allOf": [
                {
                    "type": "string"
                },
                {
                    "enum": [
                        "A01",
                        "A02",
                        "A03",
                        "A04",
                        "A05",
                        "A06",
                        "A07",
                        "A08",
                        "A09",
                        "A10",
                        "A11",
                        "A12",
                        "A13",
                        "A14",
                        "A15",
                        "A16",
                        "A17",
                        "A18",
                        "A19",
                        "A20",
                        "A21",
                        "A22",
                        "A23",
                        "A24",
                        "A25",
                        "A26",
                        "A27",
                        "A28",
                        "A29",
                        "A30",
                        "A31",
                        "A32",
                        "A33",
                        "A34",
                        "A35",
                        "A36",
                        "A37",
                        "A38",
                        "A39",
                        "A40",
                        "A41",
                        "A42",
                        "A43",
                        "A44",
                        "A45",
                        "A46",
                        "A47",
                        "A48",
                        "A49",
                        "A50",
                        "A51",
                        "A52",
                        "A53",
                        "A54",
                        "A55",
                        "A56",
                        "A57",
                        "A58",
                        "A59",
                        "A60",
                        "A61",
                        "A62",
                        "A63",
                        "A64",
                        "A65",
                        "A01"
                    ]
                }
            ]
        },
        "ProcessKind_String": {
            "allOf": [
                {
                    "$ref": "#/definitions/ProcessTypeList"
                }
            ]
        },
        "PartyID_String-base": {
            "allOf": [
                {
                    "type": "string",
                    "maxLength": 16
                }
            ]
        },
        "RoleTypeList": {
            "allOf": [
                {
                    "type": "string"
                },
                {
                    "enum": [
                        "A01",
                        "A02",
                        "A03",
                        "A04",
                        "A05",
                        "A06",
                        "A07",
                        "A08",
                        "A09",
                        "A10",
                        "A11",
                        "A12",
                        "A13",
                        "A14",
                        "A15",
                        "A16",
                        "A17",
                        "A18",
                        "A19",
                        "A20",
                        "A21",
                        "A22",
                        "A23",
                        "A24",
                        "A25",
                        "A26",
                        "A27",
                        "A28",
                        "A29",
                        "A30",
                        "A31",
                        "A32",
                        "A33",
                        "A34",
                        "A35",
                        "A36",
                        "A37",
                        "A38",
                        "A39",
                        "A40",
                        "A41",
                        "A42",
                        "A43",
                        "A44",
                        "A45",
                        "A46",
                        "A47",
                        "A48",
                        "A49",
                        "A50",
                        "A51",
                        "A52",
                        "A01"
                    ]
                }
            ]
        },
        "MarketRoleKind_String": {
            "allOf": [
                {
                    "$ref": "#/definitions/RoleTypeList"
                }
            ]
        },
        "ESMP_DateTime": {
            "allOf": [
                {
                    "type": "string",
                    "format": "date-time"
                }
            ]
        },
        "BusinessTypeList": {
            "allOf": [
                {
                    "type": "string"
                },
                {
                    "enum": [
                        "A01",
                        "A02",
                        "A03",
                        "A04",
                        "A05",
                        "A06",
                        "A07",
                        "A08",
                        "A09",
                        "A10",
                        "A11",
                        "A12",
                        "A13",
                        "A14",
                        "A15",
                        "A16",
                        "A17",
                        "A18",
                        "A19",
                        "A20",
                        "A21",
                        "A22",
                        "A23",
                        "A24",
                        "A25",
                        "A26",
                        "A27",
                        "A28",
                        "A29",
                        "A30",
                        "A31",
                        "A32",
                        "A33",
                        "A34",
                        "A35",
                        "A36",
                        "A37",
                        "A38",
                        "A40",
                        "A41",
                        "A42",
                        "A43",
                        "A44",
                        "A45",
                        "A46",
                        "A47",
                        "A48",
                        "A49",
                        "A50",
                        "A51",
                        "A52",
                        "A53",
                        "A54",
                        "A55",
                        "A56",
                        "A57",
                        "A58",
                        "A59",
                        "A60",
                        "A61",
                        "A62",
                        "A63",
                        "A64",
                        "A65",
                        "A66",
                        "A67",
                        "A68",
                        "A69",
                        "A70",
                        "A71",
                        "A72",
                        "A73",
                        "A74",
                        "A75",
                        "A76",
                        "A77",
                        "A78",
                        "A79",
                        "A80",
                        "A81",
                        "A82",
                        "A83",
                        "A84",
                        "A85",
                        "A86",
                        "A87",
                        "A88",
                        "A89",
                        "A90",
                        "A91",
                        "A92",
                        "A93",
                        "A94",
                        "A95",
                        "A96",
                        "A97",
                        "A98",
                        "A99",
                        "B01",
                        "B02",
                        "B03",
                        "B04",
                        "B05",
                        "B06",
                        "B07",
                        "B08",
                        "B09",
                        "B10",
                        "B11",
                        "B12",
                        "B13",
                        "B14",
                        "B15",
                        "B16",
                        "B17",
                        "B18",
                        "B19",
                        "B20",
                        "B21",
                        "B22",
                        "B23",
                        "B24",
                        "B25",
                        "B26",
                        "B27",
                        "B28",
                        "B29",
                        "B30",
                        "B31",
                        "B32",
                        "B33",
                        "B34",
                        "B35",
                        "B36",
                        "B37",
                        "B38",
                        "B39",
                        "B40",
                        "B41",
                        "B42",
                        "B43",
                        "B44",
                        "B45",
                        "B46",
                        "B47",
                        "B48",
                        "B49",
                        "B50",
                        "B51",
                        "B52",
                        "B53",
                        "B54",
                        "B55",
                        "B56",
                        "B57",
                        "B58",
                        "B59",
                        "B60",
                        "B61",
                        "B62",
                        "B63",
                        "B64",
                        "B65",
                        "B66",
                        "B67",
                        "B68",
                        "B69",
                        "B70",
                        "B71",
                        "B72",
                        "B73",
                        "B74",
                        "B75",
                        "B76",
                        "B77",
                        "B78",
                        "B79",
                        "B80",
                        "B81",
                        "B82",
                        "B83",
                        "B84",
                        "B85",
                        "B86",
                        "B87",
                        "B88",
                        "B89",
                        "B90",
                        "B91",
                        "B92",
                        "B93",
                        "B94",
                        "B95",
                        "B96",
                        "B97",
                        "B98",
                        "B99",
                        "C01",
                        "C02",
                        "C03",
                        "C04",
                        "C05",
                        "C06",
                        "C07",
                        "C08",
                        "C09",
                        "C10",
                        "C11",
                        "C12",
                        "C13",
                        "C14",
                        "C15",
                        "C16",
                        "C17",
                        "C18",
                        "C19",
                        "C20",
                        "C21",
                        "C22",
                        "C23",
                        "C24",
                        "C25",
                        "C26",
                        "C27",
                        "C28",
                        "C29",
                        "C30",
                        "C31",
                        "C32",
                        "C33",
                        "C34",
                        "C35",
                        "C36",
                        "C37",
                        "C38",
                        "C39",
                        "C40",
                        "C41",
                        "C42",
                        "C43",
                        "C44",
                        "C45",
                        "C46",
                        "C47",
                        "C48",
                        "C49",
                        "C50",
                        "C51",
                        "C52",
                        "C53",
                        "C54",
                        "C55",
                        "C56",
                        "C57",
                        "C58",
                        "C59",
                        "C60",
                        "C61",
                        "C62",
                        "C63",
                        "C64",
                        "C65",
                        "C66",
                        "C67",
                        "C68",
                        "C69",
                        "C70",
                        "C71",
                        "C72",
                        "C73",
                        "C74",
                        "C75",
                        "C76",
                        "C77",
                        "C78",
                        "C79",
                        "C80",
                        "C81",
                        "C82",
                        "C83",
                        "C84",
                        "C85",
                        "A01"
                    ]
                }
            ]
        },
        "BusinessKind_String": {
            "allOf": [
                {
                    "$ref": "#/definitions/BusinessTypeList"
                }
            ]
        },
        "EnergyProductTypeList": {
            "allOf": [
                {
                    "type": "string"
                },
                {
                    "enum": [
                        "8716867000016",
                        "8716867000023",
                        "8716867000030",
                        "8716867000047",
                        "8716867000115",
                        "8716867000122",
                        "8716867000139",
                        "8716867000146",
                        "8716867009911",
                        "8716867000016"
                    ]
                }
            ]
        },
        "EnergyProductKind_String": {
            "allOf": [
                {
                    "$ref": "#/definitions/EnergyProductTypeList"
                }
            ]
        },
        "CurveTypeList": {
            "allOf": [
                {
                    "type": "string"
                },
                {
                    "enum": [
                        "A01",
                        "A02",
                        "A03",
                        "A04",
                        "A05",
                        "A01"
                    ]
                }
            ]
        },
        "CurveType_String": {
            "allOf": [
                {
                    "$ref": "#/definitions/CurveTypeList"
                }
            ]
        },
        "UnitOfMeasureTypeList": {
            "allOf": [
                {
                    "type": "string"
                },
                {
                    "enum": [
                        "A59",
                        "A90",
                        "A97",
                        "AMP",
                        "C62",
                        "CEL",
                        "D54",
                        "DD",
                        "E08",
                        "GWH",
                        "HMQ",
                        "HTZ",
                        "KEL",
                        "KMT",
                        "KVR",
                        "KVT",
                        "KWH",
                        "KWT",
                        "MAH",
                        "MAR",
                        "MAW",
                        "MIN",
                        "MMT",
                        "MQS",
                        "MTQ",
                        "MTR",
                        "MTS",
                        "MTZ",
                        "MVA",
                        "MWH",
                        "P1",
                        "SEC",
                        "WTT",
                        "A59"
                    ]
                }
            ]
        },
        "MeasurementUnitKind_String": {
            "allOf": [
                {
                    "$ref": "#/definitions/UnitOfMeasureTypeList"
                }
            ]
        },
        "AreaID_String-base": {
            "allOf": [
                {
                    "type": "string",
                    "maxLength": 18
                }
            ]
        },
        "ResourceID_String-base": {
            "allOf": [
                {
                    "type": "string",
                    "maxLength": 60
                }
            ]
        },
        "AssetTypeList": {
            "allOf": [
                {
                    "type": "string"
                },
                {
                    "enum": [
                        "A01",
                        "A02",
                        "A03",
                        "A04",
                        "A05",
                        "A06",
                        "A07",
                        "A08",
                        "A09",
                        "A10",
                        "A11",
                        "A12",
                        "A13",
                        "B01",
                        "B02",
                        "B03",
                        "B04",
                        "B05",
                        "B06",
                        "B07",
                        "B08",
                        "B09",
                        "B10",
                        "B11",
                        "B12",
                        "B13",
                        "B14",
                        "B15",
                        "B16",
                        "B17",
                        "B18",
                        "B19",
                        "B20",
                        "B21",
                        "B22",
                        "B23",
                        "B24",
                        "B25",
                        "B26",
                        "B27",
                        "B28",
                        "B29",
                        "B30",
                        "B31",
                        "B32",
                        "B33",
                        "B34",
                        "B35",
                        "B36",
                        "B37",
                        "B38",
                        "B39",
                        "B40",
                        "B41",
                        "B42",
                        "B43",
                        "B44",
                        "B45",
                        "B46",
                        "B47",
                        "B48",
                        "B49",
                        "B50",
                        "B51",
                        "B52",
                        "A01"
                    ]
                }
            ]
        },
        "PsrType_String": {
            "allOf": [
                {
                    "$ref": "#/definitions/AssetTypeList"
                }
            ]
        },
        "Point": {
            "type": "object",
            "properties": {
                "position": {
                    "$ref": "#/definitions/Position_Integer"
                },
                "quantity": {
                    "type": "number"
                },
                "posFR_Quantity.quantity": {
                    "type": "number"
                },
                "negFR_Quantity.quantity": {
                    "type": "number"
                },
                "Reason": {
                    "type": "array",
                    "items": {
                        "$ref": "#/definitions/Reason"
                    }
                }
            },
            "required": [
                "position",
                "quantity"
            ]
        },
        "Reason": {
            "type": "object",
            "properties": {
                "code": {
                    "$ref": "#/definitions/ReasonCode_String"
                },
                "text": {
                    "$ref": "#/definitions/ReasonText_String"
                }
            },
            "required": [
                "code"
            ]
        },
        "ESMP_DateTimeInterval": {
            "type": "object",
            "properties": {
                "start": {
                    "$ref": "#/definitions/YMDHM_DateTime"
                },
                "end": {
                    "$ref": "#/definitions/YMDHM_DateTime"
                }
            },
            "required": [
                "start",
                "end"
            ]
        },
        "Series_Period": {
            "type": "object",
            "properties": {
                "timeInterval": {
                    "$ref": "#/definitions/ESMP_DateTimeInterval"
                },
                "resolution": {
                    "type": "string"
                },
                "Point": {
                    "type": "array",
                    "minItems": 1,
                    "items": {
                        "$ref": "#/definitions/Point"
                    }
                }
            },
            "required": [
                "timeInterval",
                "resolution",
                "Point"
            ]
        },
        "CodingSchemeTypeList": {
            "allOf": [
                {
                    "type": "string"
                },
                {
                    "enum": [
                        "A01",
                        "A02",
                        "A10",
                        "NAD",
                        "NAL",
                        "NAM",
                        "NAT",
                        "NAZ",
                        "NBA",
                        "NBE",
                        "NBG",
                        "NCH",
                        "NCS",
                        "NCY",
                        "NCZ",
                        "NDE",
                        "NDK",
                        "NEE",
                        "NES",
                        "NFI",
                        "NFR",
                        "NGB",
                        "NGE",
                        "NGI",
                        "NGR",
                        "NHR",
                        "NHU",
                        "NIE",
                        "NIT",
                        "NKG",
                        "NKZ",
                        "NLI",
                        "NLT",
                        "NLU",
                        "NLV",
                        "NMA",
                        "NMD",
                        "NMK",
                        "NNL",
                        "NNN",
                        "NNO",
                        "NPL",
                        "NPT",
                        "NRO",
                        "NRU",
                        "NSE",
                        "NSI",
                        "NSK",
                        "NTR",
                        "NUA",
                        "A01"
                    ]
                }
            ]
        },
        "PartyID_String": {
            "type": "object",
            "required": [
                "codingScheme"
            ],
            "properties": {
                "value": {
                    "$ref": "#/definitions/PartyID_String-base"
                },
                "codingScheme": {
                    "$ref": "#/definitions/CodingSchemeTypeList"
                }
            }
        },
        "ShortMediumTermAdequacyResults_MarketDocument": {
            "type": "object",
            "properties": {
                "mRID": {
                    "$ref": "#/definitions/ID_String"
                },
                "revisionNumber": {
                    "$ref": "#/definitions/ESMPVersion_String"
                },
                "type": {
                    "$ref": "#/definitions/MessageKind_String"
                },
                "process.processType": {
                    "$ref": "#/definitions/ProcessKind_String"
                },
                "sender_MarketParticipant.mRID": {
                    "$ref": "#/definitions/PartyID_String"
                },
                "sender_MarketParticipant.marketRole.type": {
                    "$ref": "#/definitions/MarketRoleKind_String"
                },
                "receiver_MarketParticipant.mRID": {
                    "$ref": "#/definitions/PartyID_String"
                },
                "receiver_MarketParticipant.marketRole.type": {
                    "$ref": "#/definitions/MarketRoleKind_String"
                },
                "createdDateTime": {
                    "$ref": "#/definitions/ESMP_DateTime"
                },
                "time_Period.timeInterval": {
                    "$ref": "#/definitions/ESMP_DateTimeInterval"
                },
                "TimeSeries": {
                    "type": "array",
                    "items": {
                        "$ref": "#/definitions/TimeSeries"
                    }
                },
                "Reason": {
                    "type": "array",
                    "items": {
                        "$ref": "#/definitions/Reason"
                    }
                }
            },
            "required": [
                "mRID",
                "revisionNumber",
                "type",
                "process.processType",
                "sender_MarketParticipant.mRID",
                "sender_MarketParticipant.marketRole.type",
                "receiver_MarketParticipant.mRID",
                "receiver_MarketParticipant.marketRole.type",
                "createdDateTime",
                "time_Period.timeInterval"
            ]
        },
        "AreaID_String": {
            "type": "object",
            "required": [
                "codingScheme"
            ],
            "properties": {
                "value": {
                    "$ref": "#/definitions/AreaID_String-base"
                },
                "codingScheme": {
                    "$ref": "#/definitions/CodingSchemeTypeList"
                }
            }
        },
        "ResourceID_String": {
            "type": "object",
            "required": [
                "codingScheme"
            ],
            "properties": {
                "value": {
                    "$ref": "#/definitions/ResourceID_String-base"
                },
                "codingScheme": {
                    "$ref": "#/definitions/CodingSchemeTypeList"
                }
            }
        },
        "TimeSeries": {
            "type": "object",
            "properties": {
                "mRID": {
                    "$ref": "#/definitions/ID_String"
                },
                "businessType": {
                    "$ref": "#/definitions/BusinessKind_String"
                },
                "product": {
                    "$ref": "#/definitions/EnergyProductKind_String"
                },
                "curveType": {
                    "$ref": "#/definitions/CurveType_String"
                },
                "measurement_Unit.name": {
                    "$ref": "#/definitions/MeasurementUnitKind_String"
                },
                "in_Domain.mRID": {
                    "$ref": "#/definitions/AreaID_String"
                },
                "out_Domain.mRID": {
                    "$ref": "#/definitions/AreaID_String"
                },
                "connectingLine_RegisteredResource.mRID": {
                    "$ref": "#/definitions/ResourceID_String"
                },
                "mktPSRType.psrType": {
                    "$ref": "#/definitions/PsrType_String"
                },
                "Period": {
                    "type": "array",
                    "minItems": 1,
                    "items": {
                        "$ref": "#/definitions/Series_Period"
                    }
                },
                "Reason": {
                    "type": "array",
                    "items": {
                        "$ref": "#/definitions/Reason"
                    }
                }
            },
            "required": [
                "mRID",
                "businessType",
                "product",
                "curveType",
                "measurement_Unit.name",
                "Period"
            ]
        }
    },
    "anyOf": [
        {
            "type": "object",
            "properties": {
                "ShortMediumTermAdequacyResults_MarketDocument": {
                    "$ref": "#/definitions/ShortMediumTermAdequacyResults_MarketDocument"
                }
            }
        }
    ],
    "required": [
        "ShortMediumTermAdequacyResults_MarketDocument"
    ]
}