{
    "$id": "Capacity-allocation-configuration-assembly-model",
    "$schema": "http://json-schema.org/draft-07/schema#",
    "title": "Capacity-allocation-configuration-assembly-model  profile generated 2021-02-04 17:27:07.918522",
    "description": " Description du profile ",
    "namespace": "urn:iec62325.351:tc57wg16:451-6:capacityallocationconfigurationdocument:1:2",
    "type": "object",
    "additionalProperties": false,
    "properties": {
        "CapacityAllocationConfiguration_MarketDocument": {
            "$ref": "#/definitions/CapacityAllocationConfiguration_MarketDocument"
        }
    },
    "definitions": {
        "Capacity-allocation-configuration-assembly-model": {
            "$ref": "#"
        },
        "Allocation_TimeSeries": {
            "id": "#Allocation_TimeSeries",
            "title": "Allocation_TimeSeries",
            "description": "The Allocation_TimeSeries provide the necessary information about what is auctioned as transmission capacity.",
            "modelReference": "http://iec.ch/TC57/2013/CIM-schema-cim16#TimeSeries",
            "type": "object",
            "additionalProperties": false,
            "properties": {
                "allocation_Period.timeInterval": {
                    "description": "The start and end date and time for a given interval.\r\n\r\n\r\n--- The allocation period is the period of time during an auction when capacity allocation (e.g. auction for explicit capacity) is carried out",
                    "modelReference": "http://iec.ch/TC57/2013/CIM-schema-cim16#Period.timeInterval",
                    "$ref": "#/definitions/ESMP_DateTimeInterval"
                },
                "alreadyAllocatedCapacityProvider_MarketParticipant.mRID": {
                    "description": "The identification of a party in the energy market.\r\n\r\n--- The identification of a market participant associated with a TimeSeries.\r\nThe party providing data describing the already allocated capacity.",
                    "modelReference": "http://iec.ch/TC57/2013/CIM-schema-cim16#MarketParticipant.mRID",
                    "$ref": "#/definitions/PartyID_String"
                },
                "auction.allocationMode": {
                    "description": "The identification of the method of allocation in an auction.",
                    "modelReference": "http://iec.ch/TC57/2013/CIM-schema-cim16#auction.allocationMode",
                    "$ref": "#/definitions/AllocationMode_String"
                },
                "auction.type": {
                    "description": "The kind of the auction (e.g. implicit,  explicit, ...).",
                    "modelReference": "http://iec.ch/TC57/2013/CIM-schema-cim16#auction.type",
                    "$ref": "#/definitions/AuctionKind_String"
                },
                "auctionRevenueProvider_MarketParticipant.mRID": {
                    "description": "The identification of a party in the energy market.\r\n\r\n--- The identification of a market participant associated with a TimeSeries.\r\nThe party providing data describing the auction revenue.",
                    "modelReference": "http://iec.ch/TC57/2013/CIM-schema-cim16#MarketParticipant.mRID",
                    "$ref": "#/definitions/PartyID_String"
                },
                "bidding_Period.timeInterval": {
                    "description": "The start and end date and time for a given interval.\r\n\r\n\r\n--- The beginning and ending date and time of the bidding period within which capacity traders can submit a bid to the transmission capacity allocator.",
                    "modelReference": "http://iec.ch/TC57/2013/CIM-schema-cim16#Period.timeInterval",
                    "$ref": "#/definitions/ESMP_DateTimeInterval"
                },
                "cancelledTS": {
                    "description": "An indicator stating that the allocation instance is cancelled.",
                    "modelReference": "http://iec.ch/TC57/2013/CIM-schema-cim16#TimeSeries.cancelledTS",
                    "$ref": "#/definitions/ESMPBoolean_String"
                },
                "capacityThirdCountriesProvider_MarketParticipant.mRID": {
                    "description": "The identification of a party in the energy market.\r\n\r\n--- The identification of a market participant associated with a TimeSeries.\r\nThe party providing data describing the cross-zonal capacities allocated between bidding zones in Member States and third countries.",
                    "modelReference": "http://iec.ch/TC57/2013/CIM-schema-cim16#MarketParticipant.mRID",
                    "$ref": "#/definitions/PartyID_String"
                },
                "conductingParty_MarketParticipant.mRID": {
                    "description": "The identification of a party in the energy market.\r\n\r\n--- The identification of the party who manages the allocation process.\r\nThe party conducting the capacity allocation.",
                    "modelReference": "http://iec.ch/TC57/2013/CIM-schema-cim16#MarketParticipant.mRID",
                    "$ref": "#/definitions/PartyID_String"
                },
                "congestionIncome_MarketParticipant.mRID": {
                    "description": "The identification of a party in the energy market.\r\n\r\n--- The identification of a market participant associated with a TimeSeries.\r\nThe party providing data describing the congestion income.",
                    "modelReference": "http://iec.ch/TC57/2013/CIM-schema-cim16#MarketParticipant.mRID",
                    "$ref": "#/definitions/PartyID_String"
                },
                "connectingLine_RegisteredResource.mRID": {
                    "description": "The unique identification of a resource.\r\n\r\nIn the ESMP context, the \"model authority\" is defined as an authorized issuing office that provides an agreed identification coding scheme for market participant, domain, measurement point, resources (generator, lines, substations, etc.) identification.\r\n\r\nMaster resource identifier issued by a model authority. The mRID is globally unique within an exchange context.\r\nGlobal uniqueness is easily achieved by using a UUID for the mRID. It is strongly recommended to do this.\r\nFor CIMXML data files in RDF syntax, the mRID is mapped to rdf:ID or rdf:about attributes that identify CIM object elements.\r\n\r\n--- The identification of a resource associated with a TimeSeries.",
                    "modelReference": "http://iec.ch/TC57/2013/CIM-schema-cim16#RegisteredResource.mRID",
                    "$ref": "#/definitions/ResourceID_String"
                },
                "delivery_Period.timeInterval": {
                    "description": "The start and end date and time for a given interval.\r\n\r\n\r\n--- The beginning and ending date and time of the period when the capacity is to be used. ",
                    "modelReference": "http://iec.ch/TC57/2013/CIM-schema-cim16#Period.timeInterval",
                    "$ref": "#/definitions/ESMP_DateTimeInterval"
                },
                "description": {
                    "description": "The description is a free human readable text describing or naming the object. It may be non unique and may not correlate to a naming hierarchy.",
                    "modelReference": "http://iec.ch/TC57/2013/CIM-schema-cim16#TimeSeries.description",
                    "$ref": "#/definitions/Characters100_String"
                },
                "marketAgreement.type": {
                    "description": "The specification of the kind of the agreement, e.g. long term, daily contract. \r\n\r\n--- The contract type defines the conditions under which the capacity will be allocated.",
                    "modelReference": "http://iec.ch/TC57/2013/CIM-schema-cim16#marketAgreement.type",
                    "$ref": "#/definitions/CapacityContractKind_String"
                },
                "name": {
                    "description": "The name is any free human readable and possibly non unique text naming the object.\r\nThis attribute identifies the allocation instance. It may be non unique; however the combination of the name and delivery_Period shall be unique.",
                    "modelReference": "http://iec.ch/TC57/2013/CIM-schema-cim16#TimeSeries.name",
                    "$ref": "#/definitions/Characters20_String"
                },
                "offeredCapacityProvider_MarketParticipant.mRID": {
                    "description": "The identification of a party in the energy market.\r\n\r\n--- The identification of a market participant associated with a TimeSeries.\r\nThe party providing data describing the offered capacity.",
                    "modelReference": "http://iec.ch/TC57/2013/CIM-schema-cim16#MarketParticipant.mRID",
                    "$ref": "#/definitions/PartyID_String"
                },
                "subType_Auction.type": {
                    "description": "Additional information about the auction, i.e. shadow auction.",
                    "modelReference": "http://iec.ch/TC57/2013/CIM-schema-cim16#Auction.type",
                    "$ref": "#/definitions/AuctionKind_String"
                },
                "timeZone_AttributeInstanceComponent.attribute": {
                    "description": "Definition of the time zone where the allocation is planned. This information could be used to map the UTC datetime values into the local business time.\r\nThe identification of an attribute for a given request component.\r\n\r\n--- It provides the information of the local time zone where the allocation will be carried out.",
                    "modelReference": "http://iec.ch/TC57/2013/CIM-schema-cim16#AttributeInstanceComponent.attribute",
                    "type": "string"
                },
                "useOfCapacityProvider_MarketParticipant.mRID": {
                    "description": "The identification of a party in the energy market.\r\n\r\n--- The identification of a market participant associated with a TimeSeries.\r\nThe party providing data describing the requested and allocated capacity, the price of the capacity and possibly also the auction revenue.",
                    "modelReference": "http://iec.ch/TC57/2013/CIM-schema-cim16#MarketParticipant.mRID",
                    "$ref": "#/definitions/PartyID_String"
                },
                "Point": {
                    "description": "The values and the position associated with the TimeSeries.",
                    "modelReference": "http://iec.ch/TC57/2013/CIM-schema-cim16#TimeSeries.Point",
                    "type": "array",
                    "items": {
                        "$ref": "#/definitions/Point"
                    },
                    "minItems": 1
                }
            },
            "required": [
                "name",
                "auction.type",
                "marketAgreement.type",
                "timeZone_AttributeInstanceComponent.attribute",
                "delivery_Period.timeInterval",
                "allocation_Period.timeInterval",
                "Point"
            ]
        },
        "CapacityAllocationConfiguration_MarketDocument": {
            "id": "#CapacityAllocationConfiguration_MarketDocument",
            "title": "CapacityAllocationConfiguration_MarketDocument",
            "description": "An electronic document containing the information necessary to satisfy the requirements of a given business process.\r\nThe CapacityAllocationConfiguration_MarketDocument is issued by the data provider to inform about the transmission capacity allocation calendar\r\nIt provides information on the auction that will be carried out.",
            "modelReference": "http://iec.ch/TC57/2013/CIM-schema-cim16#MarketDocument",
            "type": "object",
            "additionalProperties": false,
            "properties": {
                "mRID": {
                    "description": "The unique identification of the document being exchanged within a business process flow.",
                    "modelReference": "http://iec.ch/TC57/2013/CIM-schema-cim16#MarketDocument.mRID",
                    "$ref": "#/definitions/ID_String"
                },
                "createdDateTime": {
                    "description": "The date and time of the creation of the document.",
                    "modelReference": "http://iec.ch/TC57/2013/CIM-schema-cim16#MarketDocument.createdDateTime",
                    "$ref": "#/definitions/ESMP_DateTime"
                },
                "process.classificationType": {
                    "description": "The classification mechanism used to group a set of objects together within a business process. The grouping may be of a detailed or a summary nature.",
                    "modelReference": "http://iec.ch/TC57/2013/CIM-schema-cim16#process.classificationType",
                    "$ref": "#/definitions/ClassificationKind_String"
                },
                "process.processType": {
                    "description": "The identification of the nature of process that the document addresses.",
                    "modelReference": "http://iec.ch/TC57/2013/CIM-schema-cim16#process.processType",
                    "$ref": "#/definitions/ProcessKind_String"
                },
                "receiver_MarketParticipant.mRID": {
                    "description": "The identification of a party in the energy market.\r\n\r\n--- Document recipient.",
                    "modelReference": "http://iec.ch/TC57/2013/CIM-schema-cim16#MarketParticipant.mRID",
                    "$ref": "#/definitions/PartyID_String"
                },
                "receiver_MarketParticipant.marketRole.type": {
                    "description": "The identification of the role played by a market player.\r\n\r\n\r\n--- Document recipient.\r\n\r\n--- The role associated with a MarketParticipant.",
                    "modelReference": "http://iec.ch/TC57/2013/CIM-schema-cim16#marketRole.type",
                    "$ref": "#/definitions/MarketRoleKind_String"
                },
                "sender_MarketParticipant.mRID": {
                    "description": "The identification of a party in the energy market.\r\n\r\n--- Document owner.",
                    "modelReference": "http://iec.ch/TC57/2013/CIM-schema-cim16#MarketParticipant.mRID",
                    "$ref": "#/definitions/PartyID_String"
                },
                "sender_MarketParticipant.marketRole.type": {
                    "description": "The identification of the role played by a market player.\r\n\r\n\r\n--- Document owner.\r\n\r\n--- The role associated with a MarketParticipant.",
                    "modelReference": "http://iec.ch/TC57/2013/CIM-schema-cim16#marketRole.type",
                    "$ref": "#/definitions/MarketRoleKind_String"
                },
                "type": {
                    "description": "The coded type of a document. The document type describes the principal characteristic of the document.",
                    "modelReference": "http://iec.ch/TC57/2013/CIM-schema-cim16#MarketDocument.type",
                    "$ref": "#/definitions/MessageKind_String"
                },
                "Allocation_TimeSeries": {
                    "description": "The time series that is associated with an electronic document.",
                    "modelReference": "http://iec.ch/TC57/2013/CIM-schema-cim16#MarketDocument.Allocation_TimeSeries",
                    "type": "array",
                    "items": {
                        "$ref": "#/definitions/Allocation_TimeSeries"
                    },
                    "minItems": 1,
                    "maxItems": 31
                }
            },
            "required": [
                "mRID",
                "type",
                "process.processType",
                "sender_MarketParticipant.mRID",
                "sender_MarketParticipant.marketRole.type",
                "receiver_MarketParticipant.mRID",
                "receiver_MarketParticipant.marketRole.type",
                "createdDateTime",
                "Allocation_TimeSeries"
            ]
        },
        "Point": {
            "id": "#Point",
            "title": "Point",
            "description": "The identification of the values.",
            "modelReference": "http://iec.ch/TC57/2013/CIM-schema-cim16#Point",
            "type": "object",
            "additionalProperties": false,
            "properties": {
                "position": {
                    "description": "A sequential value representing a relative sequence number.\r\nThis defines the sequence of the capacity product within a given auction category such as Base 1 or Base 2. This corresponds to the auction round being carried out for a product category.",
                    "modelReference": "http://iec.ch/TC57/2013/CIM-schema-cim16#Point.position",
                    "$ref": "#/definitions/Position_Integer"
                },
                "timeSeries.auction.category": {
                    "description": "The product category of an auction.\r\n\r\n\r\n--- TheTimeSeries provides additional information related to a Position within a given time interval.\r\n\r\n--- The auction characteristics that are associated with a TimeSeries.\r\nThe category of the capacity product as defined by market rules. This information describes what hours of the day are covered by the product. The following codes have been initially defined:\r\nA01: Base\r\nA02: Peak\r\nA03: Off-peak\r\nA04: Hourly",
                    "modelReference": "http://iec.ch/TC57/2013/CIM-schema-cim16#auction.category",
                    "$ref": "#/definitions/Category_String"
                },
                "timeSeries.currency_Unit.name": {
                    "description": "The identification of the formal code for a currency (ISO 4217).\r\n\r\n\r\n--- TheTimeSeries provides additional information related to a Position within a given time interval.\r\n\r\n--- The currency associated with a TimeSeries.",
                    "modelReference": "http://iec.ch/TC57/2013/CIM-schema-cim16#Unit.name",
                    "$ref": "#/definitions/CurrencyCode_String"
                },
                "timeSeries.in_Domain.mRID": {
                    "description": "The unique identification of the domain.\r\n\r\n\r\n--- TheTimeSeries provides additional information related to a Position within a given time interval.\r\n\r\n--- The identification of the area where the energy is flowing into.\r\nThe identification of the area where the energy is destined for the capacity product.\r\nThe codification scheme used for the coded identification is indicated by the coding scheme attribute.",
                    "modelReference": "http://iec.ch/TC57/2013/CIM-schema-cim16#Domain.mRID",
                    "$ref": "#/definitions/AreaID_String"
                },
                "timeSeries.name": {
                    "description": "The name is any free human readable and possibly non unique text naming the object.\r\nAny human readable and possibly non unique text naming the capacity product, for example EURO Base 1 FR&gt;BE.\r\n\r\n--- TheTimeSeries provides additional information related to a Position within a given time interval.",
                    "modelReference": "http://iec.ch/TC57/2013/CIM-schema-cim16#timeSeries.name",
                    "type": "string"
                },
                "timeSeries.out_Domain.mRID": {
                    "description": "The unique identification of the domain.\r\n\r\n\r\n--- TheTimeSeries provides additional information related to a Position within a given time interval.\r\n\r\n--- The identification of the area from where the energy is coming.\r\nThe identification of the area where the energy is destined for the capacity product.\r\nThe codification scheme used for the coded identification is indicated by the coding scheme attribute.",
                    "modelReference": "http://iec.ch/TC57/2013/CIM-schema-cim16#Domain.mRID",
                    "$ref": "#/definitions/AreaID_String"
                }
            },
            "required": [
                "position",
                "timeSeries.name",
                "timeSeries.in_Domain.mRID",
                "timeSeries.out_Domain.mRID",
                "timeSeries.currency_Unit.name"
            ]
        },
        "Characters20_String": {
            "id": "#Characters20_String",
            "title": "Characters20_String",
            "description": "A string consisting of a sequence of 8 bit characters. The character encoding is UTF-8. \r\nThe string length is restricted to 20 characters.",
            "modelReference": "http://iec.ch/TC57/2013/CIM-schema-cim16#String",
            "type": "object",
            "additionalProperties": false,
            "properties": {
                "value": {
                    "description": "The string length is restricted to 20 characters.",
                    "type": "string",
                    "maxLength": 20
                }
            },
            "required": [
                "value"
            ]
        },
        "ESMPBoolean_String": {
            "id": "#ESMPBoolean_String",
            "title": "ESMPBoolean_String",
            "description": "The attribute is a Boolean, either 0 or 1 value, \"No\" or \"Yes\", or two values defined in a code list.",
            "modelReference": "http://iec.ch/TC57/2013/CIM-schema-cim16#String",
            "type": "object",
            "additionalProperties": false,
            "properties": {
                "value": {
                    "description": "Main Core value Space.",
                    "$ref": "urn-entsoe-eu-wgedi-codelists.schema.json#/definitions/IndicatorTypeList"
                }
            },
            "required": [
                "value"
            ]
        },
        "Characters100_String": {
            "id": "#Characters100_String",
            "title": "Characters100_String",
            "description": "A string consisting of a sequence of 8 bit characters. The character encoding is UTF-8. \r\nThe string length is restricted to 100 characters.",
            "modelReference": "http://iec.ch/TC57/2013/CIM-schema-cim16#String",
            "type": "object",
            "additionalProperties": false,
            "properties": {
                "value": {
                    "description": "The string length is restricted to 100 characters.",
                    "type": "string",
                    "maxLength": 100
                }
            },
            "required": [
                "value"
            ]
        },
        "AuctionKind_String": {
            "id": "#AuctionKind_String",
            "title": "AuctionKind_String",
            "description": "The coded representation of different types of auction.",
            "modelReference": "http://iec.ch/TC57/2013/CIM-schema-cim16#String",
            "type": "object",
            "additionalProperties": false,
            "properties": {
                "value": {
                    "description": "Main Core value Space.",
                    "$ref": "urn-entsoe-eu-wgedi-codelists.schema.json#/definitions/AuctionTypeList"
                }
            },
            "required": [
                "value"
            ]
        },
        "AllocationMode_String": {
            "id": "#AllocationMode_String",
            "title": "AllocationMode_String",
            "description": "The identification of the method of allocation in an auction.",
            "modelReference": "http://iec.ch/TC57/2013/CIM-schema-cim16#String",
            "type": "object",
            "additionalProperties": false,
            "properties": {
                "value": {
                    "description": "Main Core value Space.",
                    "$ref": "urn-entsoe-eu-wgedi-codelists.schema.json#/definitions/AllocationModeTypeList"
                }
            },
            "required": [
                "value"
            ]
        },
        "CapacityContractKind_String": {
            "id": "#CapacityContractKind_String",
            "title": "CapacityContractKind_String",
            "description": "The coded identification of a contract type, e.g. daily auction, weekly auction, monthly auction, yearly auction, etc. ",
            "modelReference": "http://iec.ch/TC57/2013/CIM-schema-cim16#String",
            "type": "object",
            "additionalProperties": false,
            "properties": {
                "value": {
                    "description": "Main Core value Space.",
                    "$ref": "urn-entsoe-eu-wgedi-codelists.schema.json#/definitions/ContractTypeList"
                }
            },
            "required": [
                "value"
            ]
        },
        "YMDHM_DateTime": {
            "id": "#YMDHM_DateTime",
            "title": "YMDHM_DateTime",
            "description": "In ESMP, the date and time is expressed as \"YYYY-MM-DDThh:mmZ\", which conforms with ISO 8601 UTC time zone. This date and time is without the seconds.",
            "modelReference": "http://iec.ch/TC57/2013/CIM-schema-cim16#DateTime",
            "type": "object",
            "additionalProperties": false,
            "properties": {
                "value": {
                    "description": "The date and time as \"YYYY-MM-DDThh:mmZ\", which conforms with the ISO 8601 UTC time zone.",
                    "type": "string",
                    "pattern": "^((([0-9]{4})[\\-](0[13578]|1[02])[\\-](0[1-9]|[12][0-9]|3[01])|([0-9]{4})[\\-]((0[469])|(11))[\\-](0[1-9]|[12][0-9]|30))T(([01][0-9]|2[0-3]):[0-5][0-9])Z)|(([13579][26][02468][048]|[13579][01345789](0)[48]|[13579][01345789][2468][048]|[02468][048][02468][048]|[02468][1235679](0)[48]|[02468][1235679][2468][048]|[0-9][0-9][13579][26])[\\-](02)[\\-](0[1-9]|1[0-9]|2[0-9])T(([01][0-9]|2[0-3]):[0-5][0-9])Z)|(([13579][26][02468][1235679]|[13579][01345789](0)[01235679]|[13579][01345789][2468][1235679]|[02468][048][02468][1235679]|[02468][1235679](0)[01235679]|[02468][1235679][2468][1235679]|[0-9][0-9][13579][01345789])[\\-](02)[\\-](0[1-9]|1[0-9]|2[0-8])T(([01][0-9]|2[0-3]):[0-5][0-9])Z)$"
                }
            },
            "required": [
                "value"
            ]
        },
        "ESMP_DateTimeInterval": {
            "id": "#ESMP_DateTimeInterval",
            "title": "ESMP_DateTimeInterval",
            "description": "This datatype enables to express the start date and time, and the end date and time of a time interval with a specific pattern. This pattern is the YYYY-MM-DDThh:mmZ.",
            "modelReference": "http://iec.ch/TC57/2013/CIM-schema-cim16#DateTimeInterval",
            "type": "object",
            "additionalProperties": false,
            "properties": {
                "start": {
                    "description": "The start date and time of the interval with a minute resolution.",
                    "modelReference": "http://iec.ch/TC57/2013/CIM-schema-cim16#DateTimeInterval.start",
                    "$ref": "#/definitions/YMDHM_DateTime"
                },
                "end": {
                    "description": "The end date and time of the interval with a minute resolution.",
                    "modelReference": "http://iec.ch/TC57/2013/CIM-schema-cim16#DateTimeInterval.end",
                    "$ref": "#/definitions/YMDHM_DateTime"
                }
            },
            "required": [
                "start",
                "end"
            ]
        },
        "PartyID_String": {
            "id": "#PartyID_String",
            "title": "PartyID_String",
            "description": "The identification of an actor in the energy market.\r\n\r\nIn the ESMP context, it is an authorized issuing office that provides an agreed identification coding scheme for market participant identification.",
            "modelReference": "http://iec.ch/TC57/2013/CIM-schema-cim16#String",
            "type": "object",
            "additionalProperties": false,
            "properties": {
                "codingScheme": {
                    "description": "DomainQualification.",
                    "$ref": "urn-entsoe-eu-wgedi-codelists.schema.json#/definitions/CodingSchemeTypeList",
                    "modelReference": "http://iec.ch/TC57/2013/CIM-schema-cim16#String.codingScheme"
                },
                "value": {
                    "description": "Main Core value Space.",
                    "type": "string",
                    "maxLength": 16,
                    "modelReference": "http://iec.ch/TC57/2013/CIM-schema-cim16#String.value"
                }
            },
            "required": [
                "codingScheme",
                "value"
            ]
        },
        "ResourceID_String": {
            "id": "#ResourceID_String",
            "title": "ResourceID_String",
            "description": "The identification of a resource object in the energy market.\r\n\r\nIn the ESMP context, it is an authorized issuing office that provides an agreed identification coding scheme for resources (generator, lines, substations, etc.) identification.",
            "modelReference": "http://iec.ch/TC57/2013/CIM-schema-cim16#String",
            "type": "object",
            "additionalProperties": false,
            "properties": {
                "codingScheme": {
                    "description": "DomainQualification.",
                    "$ref": "urn-entsoe-eu-wgedi-codelists.schema.json#/definitions/CodingSchemeTypeList",
                    "modelReference": "http://iec.ch/TC57/2013/CIM-schema-cim16#String.codingScheme"
                },
                "value": {
                    "description": "Main Core value Space.",
                    "type": "string",
                    "maxLength": 60,
                    "modelReference": "http://iec.ch/TC57/2013/CIM-schema-cim16#String.value"
                }
            },
            "required": [
                "codingScheme",
                "value"
            ]
        },
        "ID_String": {
            "id": "#ID_String",
            "title": "ID_String",
            "description": "A code to uniquely distinguish one occurrence of an entity from another.\r\n\r\nIn the ESMP context, the code is defined either by:\r\n- an emitting company that provides an agreed identification unique within a business context such as capacity auction identification, market agreement identification, etc.\r\n- a party (originator of the exchange) that provides a unique identification in the framework of a business exchange such as document identification, time series identification, bid identification, ...",
            "modelReference": "http://iec.ch/TC57/2013/CIM-schema-cim16#String",
            "type": "object",
            "additionalProperties": false,
            "properties": {
                "value": {
                    "description": "Main Core value Space.",
                    "type": "string",
                    "maxLength": 60
                }
            },
            "required": [
                "value"
            ]
        },
        "MessageKind_String": {
            "id": "#MessageKind_String",
            "title": "MessageKind_String",
            "description": "The coded type of a document.",
            "modelReference": "http://iec.ch/TC57/2013/CIM-schema-cim16#String",
            "type": "object",
            "additionalProperties": false,
            "properties": {
                "value": {
                    "description": "Main Core value Space.",
                    "$ref": "urn-entsoe-eu-wgedi-codelists.schema.json#/definitions/MessageTypeList"
                }
            },
            "required": [
                "value"
            ]
        },
        "ProcessKind_String": {
            "id": "#ProcessKind_String",
            "title": "ProcessKind_String",
            "description": "The coded identification of the nature of process.",
            "modelReference": "http://iec.ch/TC57/2013/CIM-schema-cim16#String",
            "type": "object",
            "additionalProperties": false,
            "properties": {
                "value": {
                    "description": "Main Core value Space.",
                    "$ref": "urn-entsoe-eu-wgedi-codelists.schema.json#/definitions/ProcessTypeList"
                }
            },
            "required": [
                "value"
            ]
        },
        "ClassificationKind_String": {
            "id": "#ClassificationKind_String",
            "title": "ClassificationKind_String",
            "description": "The coded identification of the classification mechanism used to group a set of objects together. The grouping may be of a detailed or a summary nature.",
            "modelReference": "http://iec.ch/TC57/2013/CIM-schema-cim16#String",
            "type": "object",
            "additionalProperties": false,
            "properties": {
                "value": {
                    "description": "Main Core value Space.",
                    "$ref": "urn-entsoe-eu-wgedi-codelists.schema.json#/definitions/ClassificationTypeList"
                }
            },
            "required": [
                "value"
            ]
        },
        "MarketRoleKind_String": {
            "id": "#MarketRoleKind_String",
            "title": "MarketRoleKind_String",
            "description": "The identification of the role played by a party.",
            "modelReference": "http://iec.ch/TC57/2013/CIM-schema-cim16#String",
            "type": "object",
            "additionalProperties": false,
            "properties": {
                "value": {
                    "description": "Main Core value Space.",
                    "$ref": "urn-entsoe-eu-wgedi-codelists.schema.json#/definitions/RoleTypeList"
                }
            },
            "required": [
                "value"
            ]
        },
        "ESMP_DateTime": {
            "id": "#ESMP_DateTime",
            "title": "ESMP_DateTime",
            "description": "In ESMP, the dateTime shall be expressed in UTC as YYYY-MM-DDThh:mm:ssZ.",
            "modelReference": "http://iec.ch/TC57/2013/CIM-schema-cim16#DateTime",
            "type": "object",
            "additionalProperties": false,
            "properties": {
                "value": {
                    "description": "Main Core value Space.",
                    "type": "string",
                    "pattern": "^((([0-9]{4})[\\-](0[13578]|1[02])[\\-](0[1-9]|[12][0-9]|3[01])|([0-9]{4})[\\-]((0[469])|(11))[\\-](0[1-9]|[12][0-9]|30))T(([01][0-9]|2[0-3]):[0-5][0-9]:[0-5][0-9])Z)|(([13579][26][02468][048]|[13579][01345789](0)[48]|[13579][01345789][2468][048]|[02468][048][02468][048]|[02468][1235679](0)[48]|[02468][1235679][2468][048]|[0-9][0-9][13579][26])[\\-](02)[\\-](0[1-9]|1[0-9]|2[0-9])T(([01][0-9]|2[0-3]):[0-5][0-9]:[0-5][0-9])Z)|(([13579][26][02468][1235679]|[13579][01345789](0)[01235679]|[13579][01345789][2468][1235679]|[02468][048][02468][1235679]|[02468][1235679](0)[01235679]|[02468][1235679][2468][1235679]|[0-9][0-9][13579][01345789])[\\-](02)[\\-](0[1-9]|1[0-9]|2[0-8])T(([01][0-9]|2[0-3]):[0-5][0-9]:[0-5][0-9])Z)$"
                }
            },
            "required": [
                "value"
            ]
        },
        "Position_Integer": {
            "id": "#Position_Integer",
            "title": "Position_Integer",
            "description": "An integer value, this value is used as a sequential value representing the relative position of an entity within a space such as a time interval.",
            "modelReference": "http://iec.ch/TC57/2013/CIM-schema-cim16#Integer",
            "type": "object",
            "additionalProperties": false,
            "properties": {
                "value": {
                    "description": "Main Core value Space.",
                    "type": "integer",
                    "maximum": 999999,
                    "minimum": 1
                }
            },
            "required": [
                "value"
            ]
        },
        "AreaID_String": {
            "id": "#AreaID_String",
            "title": "AreaID_String",
            "description": "The coded identification of a domain, i.e. balance area, grid area, etc.\r\n\r\nIn the ESMP context, it is an authorized issuing office that provides an agreed identification coding scheme for domain identification.",
            "modelReference": "http://iec.ch/TC57/2013/CIM-schema-cim16#String",
            "type": "object",
            "additionalProperties": false,
            "properties": {
                "codingScheme": {
                    "description": "DomainQualification.",
                    "$ref": "urn-entsoe-eu-wgedi-codelists.schema.json#/definitions/CodingSchemeTypeList",
                    "modelReference": "http://iec.ch/TC57/2013/CIM-schema-cim16#String.codingScheme"
                },
                "value": {
                    "description": "Main Core value Space.",
                    "type": "string",
                    "maxLength": 18,
                    "modelReference": "http://iec.ch/TC57/2013/CIM-schema-cim16#String.value"
                }
            },
            "required": [
                "codingScheme",
                "value"
            ]
        },
        "CurrencyCode_String": {
            "id": "#CurrencyCode_String",
            "title": "CurrencyCode_String",
            "description": "The coded identification of legal tender using ISO 4217 3 alpha codes.",
            "modelReference": "http://iec.ch/TC57/2013/CIM-schema-cim16#String",
            "type": "object",
            "additionalProperties": false,
            "properties": {
                "value": {
                    "description": "Main Core value Space.",
                    "$ref": "urn-entsoe-eu-wgedi-codelists.schema.json#/definitions/CurrencyTypeList"
                }
            },
            "required": [
                "value"
            ]
        },
        "Category_String": {
            "id": "#Category_String",
            "title": "Category_String",
            "description": "The identification of a product category.",
            "modelReference": "http://iec.ch/TC57/2013/CIM-schema-cim16#String",
            "type": "object",
            "additionalProperties": false,
            "properties": {
                "value": {
                    "description": "Main Core value Space.",
                    "$ref": "urn-entsoe-eu-wgedi-codelists.schema.json#/definitions/CategoryTypeList"
                }
            },
            "required": [
                "value"
            ]
        }
    }
}