{
    "$id": "Network-outage-configuration-assembly-model",
    "$schema": "http://json-schema.org/draft-07/schema#",
    "title": "Network-outage-configuration-assembly-model  profile generated 2021-02-09 14:22:57.811800",
    "description": " Description du profile ",
    "namespace": "urn:iec62325.351:tc57wg16:451-n:mltopconfigurationdocument:1:1",
    "type": "object",
    "additionalProperties": false,
    "properties": {
        "Ref_MarketDocument": {
            "$ref": "#/definitions/Ref_MarketDocument"
        }
    },
    "definitions": {
        "Network-outage-configuration-assembly-model": {
            "$ref": "#"
        },
        "Domain": {
            "id": "#Domain",
            "title": "Domain",
            "description": "A domain covering a number of related objects, such as market balance area, grid area, borders etc.",
            "modelReference": "http://iec.ch/TC57/2013/CIM-schema-cim16#Domain",
            "type": "object",
            "additionalProperties": false,
            "properties": {
                "mRID": {
                    "description": "The unique identification of the domain.",
                    "modelReference": "http://iec.ch/TC57/2013/CIM-schema-cim16#Domain.mRID",
                    "$ref": "#/definitions/AreaID_String"
                }
            },
            "required": [
                "mRID"
            ]
        },
        "Other_MarketParticipant": {
            "id": "#Other_MarketParticipant",
            "title": "Other_MarketParticipant",
            "description": "The identification of the party that provides the information concerning the resource object defined in the time series.",
            "modelReference": "http://iec.ch/TC57/2013/CIM-schema-cim16#MarketParticipant",
            "type": "object",
            "additionalProperties": false,
            "properties": {
                "mRID": {
                    "description": "The identification of a party in the energy market.",
                    "modelReference": "http://iec.ch/TC57/2013/CIM-schema-cim16#MarketParticipant.mRID",
                    "$ref": "#/definitions/PartyID_String"
                }
            },
            "required": [
                "mRID"
            ]
        },
        "Ref_MarketDocument": {
            "id": "#Ref_MarketDocument",
            "title": "Ref_MarketDocument",
            "description": "An electronic document containing the information necessary to satisfy the requirements of the configuration management process.\r\nThe Ref_MarketDocument is used to transmit the information necessary to configure the outage planning configuration process.\r\nThe Ref_MarketDocument is also used to transmit modifications that evolve the initial configuration information over time.",
            "modelReference": "http://iec.ch/TC57/2013/CIM-schema-cim16#MarketDocument",
            "type": "object",
            "additionalProperties": false,
            "properties": {
                "mRID": {
                    "description": "Unique identification of the configuration document being exchanged within a given business process flow.",
                    "modelReference": "http://iec.ch/TC57/2013/CIM-schema-cim16#MarketDocument.mRID",
                    "$ref": "#/definitions/ID_String"
                },
                "createdDateTime": {
                    "description": "The date and time of the creation of the document.",
                    "modelReference": "http://iec.ch/TC57/2013/CIM-schema-cim16#MarketDocument.createdDateTime",
                    "$ref": "#/definitions/ESMP_DateTime"
                },
                "process.processType": {
                    "description": "The identification of the nature of process that the document addresses.",
                    "modelReference": "http://iec.ch/TC57/2013/CIM-schema-cim16#process.processType",
                    "$ref": "#/definitions/ProcessKind_String"
                },
                "receiver_MarketParticipant.mRID": {
                    "description": "The identification of a party in the energy market.\n\r--- Document recipient.",
                    "modelReference": "http://iec.ch/TC57/2013/CIM-schema-cim16#MarketParticipant.mRID",
                    "$ref": "#/definitions/PartyID_String"
                },
                "receiver_MarketParticipant.marketRole.type": {
                    "description": "The identification of the role played by a market player.\n\r\n\r--- Document recipient.\n\r--- The role associated with a MarketParticipant.",
                    "modelReference": "http://iec.ch/TC57/2013/CIM-schema-cim16#marketRole.type",
                    "$ref": "#/definitions/MarketRoleKind_String"
                },
                "sender_MarketParticipant.mRID": {
                    "description": "The identification of a party in the energy market.\n\r--- Document owner.",
                    "modelReference": "http://iec.ch/TC57/2013/CIM-schema-cim16#MarketParticipant.mRID",
                    "$ref": "#/definitions/PartyID_String"
                },
                "sender_MarketParticipant.marketRole.type": {
                    "description": "The identification of the role played by a market player.\n\r\n\r--- Document owner.\n\r--- The role associated with a MarketParticipant.",
                    "modelReference": "http://iec.ch/TC57/2013/CIM-schema-cim16#marketRole.type",
                    "$ref": "#/definitions/MarketRoleKind_String"
                },
                "type": {
                    "description": "The coded type of a document. The document type describes the principal characteristic of the document.",
                    "modelReference": "http://iec.ch/TC57/2013/CIM-schema-cim16#MarketDocument.type",
                    "$ref": "#/definitions/MessageKind_String"
                },
                "TimeSeries": {
                    "description": "",
                    "modelReference": "http://iec.ch/TC57/2013/CIM-schema-cim16#MarketDocument.TimeSeries",
                    "type": "array",
                    "items": {
                        "$ref": "#/definitions/TimeSeries"
                    },
                    "minItems": 1
                }
            },
            "required": [
                "mRID",
                "type",
                "createdDateTime",
                "process.processType",
                "sender_MarketParticipant.mRID",
                "sender_MarketParticipant.marketRole.type",
                "receiver_MarketParticipant.mRID",
                "receiver_MarketParticipant.marketRole.type",
                "TimeSeries"
            ]
        },
        "RegisteredResource": {
            "id": "#RegisteredResource",
            "title": "RegisteredResource",
            "description": "A resource that is registered through the market participant registration system. Examples include network element, generating unit, load, and non-physical generator or load.",
            "modelReference": "http://iec.ch/TC57/2013/CIM-schema-cim16#RegisteredResource",
            "type": "object",
            "additionalProperties": false,
            "properties": {
                "mRID": {
                    "description": "The unique identification of a resource.",
                    "modelReference": "http://iec.ch/TC57/2013/CIM-schema-cim16#RegisteredResource.mRID",
                    "$ref": "#/definitions/ResourceID_String"
                },
                "interesting_MarketObjectStatus.status": {
                    "description": "The coded condition or position of an object with regard to its standing.\r\n\n\r--- The status of the registered resource, e.g. connected, disconnedted, outage, ...",
                    "modelReference": "http://iec.ch/TC57/2013/CIM-schema-cim16#MarketObjectStatus.status",
                    "$ref": "#/definitions/Status_String"
                },
                "location.name": {
                    "description": "The name is any free human readable and possibly non unique text naming the object.\r\nThe location of the element for the outage.\n\r--- Location of this power system resource.",
                    "modelReference": "http://iec.ch/TC57/2013/CIM-schema-cim16#location.name",
                    "$ref": "#/definitions/Characters200_String"
                },
                "name": {
                    "description": "The name is any free human readable and possibly non unique text naming the object.",
                    "modelReference": "http://iec.ch/TC57/2013/CIM-schema-cim16#RegisteredResource.name",
                    "type": "string"
                },
                "pSRType.powerSystemResources.highVoltageLimit": {
                    "description": "The bus bar's high voltage limit\n\r\n\r--- The identification of the type of resource associated with this RegisteredResource.\n\r--- The voltage level of the RegisteredResource having the MktPSRType.",
                    "modelReference": "http://iec.ch/TC57/2013/CIM-schema-cim16#powerSystemResources.highVoltageLimit",
                    "$ref": "#/definitions/ESMP_Voltage"
                },
                "pSRType.powerSystemResources.lowVoltageLimit": {
                    "description": "The bus bar's low voltage limit\n\r\n\r--- The identification of the type of resource associated with this RegisteredResource.\n\r--- The voltage level of the RegisteredResource having the MktPSRType.",
                    "modelReference": "http://iec.ch/TC57/2013/CIM-schema-cim16#powerSystemResources.lowVoltageLimit",
                    "$ref": "#/definitions/ESMP_Voltage"
                },
                "pSRType.psrType": {
                    "description": "The coded type of a power system resource.\r\n\n\r--- The identification of the type of resource associated with this RegisteredResource.",
                    "modelReference": "http://iec.ch/TC57/2013/CIM-schema-cim16#pSRType.psrType",
                    "$ref": "#/definitions/PsrType_String"
                },
                "relevant_MarketObjectStatus.status": {
                    "description": "The coded condition or position of an object with regard to its standing.\r\n\n\r--- The status of the registered resource, e.g. connected, disconnedted, outage, ...",
                    "modelReference": "http://iec.ch/TC57/2013/CIM-schema-cim16#MarketObjectStatus.status",
                    "$ref": "#/definitions/Status_String"
                },
                "Associated_Domain": {
                    "description": "The identification of the domain linked by the registered resource.",
                    "modelReference": "http://iec.ch/TC57/2013/CIM-schema-cim16#Domain",
                    "type": "array",
                    "items": {
                        "$ref": "#/definitions/Domain"
                    },
                    "minItems": 0
                }
            },
            "required": [
                "mRID",
                "name",
                "pSRType.psrType",
                "pSRType.powerSystemResources.highVoltageLimit"
            ]
        },
        "Specific_RegisteredResource": {
            "id": "#Specific_RegisteredResource",
            "title": "Specific_RegisteredResource",
            "description": "A resource that is registered through the market participant registration system. Examples include generating unit, load, and non-physical generator or load.",
            "modelReference": "http://iec.ch/TC57/2013/CIM-schema-cim16#RegisteredResource",
            "type": "object",
            "additionalProperties": false,
            "properties": {
                "mRID": {
                    "description": "The unique identification of a resource.",
                    "modelReference": "http://iec.ch/TC57/2013/CIM-schema-cim16#RegisteredResource.mRID",
                    "$ref": "#/definitions/ResourceID_String"
                }
            },
            "required": [
                "mRID"
            ]
        },
        "TimeSeries": {
            "id": "#TimeSeries",
            "title": "TimeSeries",
            "description": "A time series shall exist to describe a specific production unit, generating unit, transmission asset or consumption unit. It conveys the data related to the configuration of the defined information. ",
            "modelReference": "http://iec.ch/TC57/2013/CIM-schema-cim16#TimeSeries",
            "type": "object",
            "additionalProperties": false,
            "properties": {
                "active_Measurement_Unit.name": {
                    "description": "The identification of the formal code for a measurement unit (UN/ECE Recommendation 20).\n\r--- The unit for active generation or consumption.",
                    "modelReference": "http://iec.ch/TC57/2013/CIM-schema-cim16#Measurement_Unit.name",
                    "$ref": "#/definitions/MeasurementUnitKind_String"
                },
                "cancelledTS": {
                    "description": "An indicator stating that the TimeSeries, identified by the mRID, is withdrawn as well as all the values sent in a previous version of the TimeSeries in a previous document.",
                    "modelReference": "http://iec.ch/TC57/2013/CIM-schema-cim16#TimeSeries.cancelledTS",
                    "$ref": "#/definitions/ESMPBoolean_String"
                },
                "description": {
                    "description": "Any other information about the network element defined by the mRID of the RegisteredResource.\r\nThe description is a free human readable text describing or naming the object. It may be non unique and may not correlate to a naming hierarchy.",
                    "modelReference": "http://iec.ch/TC57/2013/CIM-schema-cim16#TimeSeries.description",
                    "type": "string"
                },
                "endLifetime_DateAndOrTime.date": {
                    "description": "The date as \"YYYY-MM-DD\", which conforms with ISO 8601.\n\r--- The date when the network element will be withdrawn of service.",
                    "modelReference": "http://iec.ch/TC57/2013/CIM-schema-cim16#DateAndOrTime.date",
                    "type": "string",
                    "pattern": "^(-?([1-9][0-9]{3,}|0[0-9]{3})-(0[1-9]|1[0-2])-(0[1-9]|[12][0-9]|3[01])(Z|(\\+|-)((0[0-9]|1[0-3]):[0-5][0-9]|14:00))?)$"
                },
                "implementation_DateAndOrTime.date": {
                    "description": "The date as \"YYYY-MM-DD\", which conforms with ISO 8601.\n\r--- The date of application of the information provided.\r\nThis identifies the date of the effective implementation of the information provided in the time series.\r\nIn the case of a creation this signifies that the object will be operational at this date.\r\nIn the case of modification this signifies that the changes will be operational at this date.\r\nIn the case of a deactivation this signifies that the deactivation will be effective at this date.",
                    "modelReference": "http://iec.ch/TC57/2013/CIM-schema-cim16#DateAndOrTime.date",
                    "type": "string",
                    "pattern": "^(-?([1-9][0-9]{3,}|0[0-9]{3})-(0[1-9]|1[0-2])-(0[1-9]|[12][0-9]|3[01])(Z|(\\+|-)((0[0-9]|1[0-3]):[0-5][0-9]|14:00))?)$"
                },
                "installedConsumption_Quantity.quantity": {
                    "description": "The quantity value.\r\nThe association role provides the information about what is expressed.\n\r--- The quantity information associated to a TimeSeries.\r\nFor a consumption unit, the installed consumption capacity.",
                    "modelReference": "http://iec.ch/TC57/2013/CIM-schema-cim16#Quantity.quantity",
                    "type": "number"
                },
                "installedGeneration_Quantity.quantity": {
                    "description": "The quantity value.\r\nThe association role provides the information about what is expressed.\n\r--- The quantity information associated to a TimeSeries.\r\nFor a generating unit, the installed generation capacity.",
                    "modelReference": "http://iec.ch/TC57/2013/CIM-schema-cim16#Quantity.quantity",
                    "type": "number"
                },
                "installedReactive_Quantity.quantity": {
                    "description": "The quantity value.\r\nThe association role provides the information about what is expressed.\n\r--- The quantity information associated to a TimeSeries.\r\nFor a unit, the reactive capacity.",
                    "modelReference": "http://iec.ch/TC57/2013/CIM-schema-cim16#Quantity.quantity",
                    "type": "number"
                },
                "multipod_RegisteredResource.mRID": {
                    "description": "The unique identification of a resource.\r\n\r\nIn the ESMP context, the \"model authority\" is defined as an authorized issuing office that provides an agreed identification coding scheme for market participant, domain, measurement point, resources (generator, lines, substations, etc.) identification.\r\n\r\nMaster resource identifier issued by a model authority. The mRID is globally unique within an exchange context.\r\nGlobal uniqueness is easily achieved by using a UUID for the mRID. It is strongly recommended to do this.\r\nFor CIMXML data files in RDF syntax, the mRID is mapped to rdf:ID or rdf:about attributes that identify CIM object elements.\n\r--- The identification of a resource associated with a TimeSeries.\r\nThe network element which is within the multipod.",
                    "modelReference": "http://iec.ch/TC57/2013/CIM-schema-cim16#RegisteredResource.mRID",
                    "$ref": "#/definitions/ResourceID_String"
                },
                "owner_MarketParticipant.mRID": {
                    "description": "The identification of a party in the energy market.\n\r--- The party who provides the information related to the RegisteredResource outage.",
                    "modelReference": "http://iec.ch/TC57/2013/CIM-schema-cim16#MarketParticipant.mRID",
                    "$ref": "#/definitions/PartyID_String"
                },
                "reactive_Measurement_Unit.name": {
                    "description": "The identification of the formal code for a measurement unit (UN/ECE Recommendation 20).\n\r--- The unit for reactive power.",
                    "modelReference": "http://iec.ch/TC57/2013/CIM-schema-cim16#Measurement_Unit.name",
                    "$ref": "#/definitions/MeasurementUnitKind_String"
                },
                "startLifetime_DateAndOrTime.date": {
                    "description": "The date as \"YYYY-MM-DD\", which conforms with ISO 8601.\n\r--- The date when the network element was put in service.",
                    "modelReference": "http://iec.ch/TC57/2013/CIM-schema-cim16#DateAndOrTime.date",
                    "type": "string",
                    "pattern": "^(-?([1-9][0-9]{3,}|0[0-9]{3})-(0[1-9]|1[0-2])-(0[1-9]|[12][0-9]|3[01])(Z|(\\+|-)((0[0-9]|1[0-3]):[0-5][0-9]|14:00))?)$"
                },
                "Specific_RegisteredResource": {
                    "description": "The identification of a resource associated with a TimeSeries.\r\nThe list of network elements that have a specific relationship to the network element object of this configuration.",
                    "modelReference": "http://iec.ch/TC57/2013/CIM-schema-cim16#RegisteredResource",
                    "type": "array",
                    "items": {
                        "$ref": "#/definitions/Specific_RegisteredResource"
                    },
                    "minItems": 0
                },
                "RegisteredResource": {
                    "description": "The identification of a resource associated with a TimeSeries.\r\nThe network element to be configured.",
                    "modelReference": "http://iec.ch/TC57/2013/CIM-schema-cim16#TimeSeries.RegisteredResource",
                    "$ref": "#/definitions/RegisteredResource"
                },
                "Coordination_MarketParticipant": {
                    "description": "The list of parties who are involved in the coordination outage process",
                    "modelReference": "http://iec.ch/TC57/2013/CIM-schema-cim16#MarketParticipant",
                    "type": "array",
                    "items": {
                        "$ref": "#/definitions/Other_MarketParticipant"
                    },
                    "minItems": 0
                },
                "Interested_MarketParticipant": {
                    "description": "The list of parties that are interested in information about outage of the network element object of the TimeSeries.\r\nThese parties shall be notified that a case or a change to a case for an element was uploaded/inserted.",
                    "modelReference": "http://iec.ch/TC57/2013/CIM-schema-cim16#MarketParticipant",
                    "type": "array",
                    "items": {
                        "$ref": "#/definitions/Other_MarketParticipant"
                    },
                    "minItems": 0
                },
                "Domain": {
                    "description": "The domain where the resource object associated with a TimeSeries resides.",
                    "modelReference": "http://iec.ch/TC57/2013/CIM-schema-cim16#TimeSeries.Domain",
                    "type": "array",
                    "items": {
                        "$ref": "#/definitions/Domain"
                    },
                    "minItems": 1
                }
            },
            "required": [
                "owner_MarketParticipant.mRID",
                "startLifetime_DateAndOrTime.date",
                "RegisteredResource",
                "Domain"
            ]
        },
        "AreaID_String": {
            "id": "#AreaID_String",
            "title": "AreaID_String",
            "description": "The coded identification of a domain, i.e. balance area, grid area, etc.\r\n\r\nIn the ESMP context, it is an authorized issuing office that provides an agreed identification coding scheme for domain identification.",
            "modelReference": "http://iec.ch/TC57/2013/CIM-schema-cim16#String",
            "type": "object",
            "additionalProperties": false,
            "properties": {
                "codingScheme": {
                    "description": "DomainQualification.",
                    "$ref": "urn-entsoe-eu-wgedi-codelists.schema.json#/definitions/CodingSchemeTypeList",
                    "modelReference": "http://iec.ch/TC57/2013/CIM-schema-cim16#String.codingScheme"
                },
                "value": {
                    "description": "Main Core value Space.",
                    "type": "string",
                    "maxLength": 18,
                    "modelReference": "http://iec.ch/TC57/2013/CIM-schema-cim16#String.value"
                }
            },
            "required": [
                "codingScheme",
                "value"
            ]
        },
        "PartyID_String": {
            "id": "#PartyID_String",
            "title": "PartyID_String",
            "description": "The identification of an actor in the energy market.\r\n\r\nIn the ESMP context, it is an authorized issuing office that provides an agreed identification coding scheme for market participant identification.",
            "modelReference": "http://iec.ch/TC57/2013/CIM-schema-cim16#String",
            "type": "object",
            "additionalProperties": false,
            "properties": {
                "codingScheme": {
                    "description": "DomainQualification.",
                    "$ref": "urn-entsoe-eu-wgedi-codelists.schema.json#/definitions/CodingSchemeTypeList",
                    "modelReference": "http://iec.ch/TC57/2013/CIM-schema-cim16#String.codingScheme"
                },
                "value": {
                    "description": "Main Core value Space.",
                    "type": "string",
                    "maxLength": 16,
                    "modelReference": "http://iec.ch/TC57/2013/CIM-schema-cim16#String.value"
                }
            },
            "required": [
                "codingScheme",
                "value"
            ]
        },
        "ID_String": {
            "id": "#ID_String",
            "title": "ID_String",
            "description": "A code to uniquely distinguish one occurrence of an entity from another.\r\n\r\nIn the ESMP context, the code is defined either by:\r\n- an emitting company that provides an agreed identification unique within a business context such as capacity auction identification, market agreement identification, etc.\r\n- a party (originator of the exchange) that provides a unique identification in the framework of a business exchange such as document identification, time series identification, bid identification, ...",
            "modelReference": "http://iec.ch/TC57/2013/CIM-schema-cim16#String",
            "type": "object",
            "additionalProperties": false,
            "properties": {
                "value": {
                    "description": "Main Core value Space.",
                    "type": "string",
                    "maxLength": 60
                }
            },
            "required": [
                "value"
            ]
        },
        "MessageKind_String": {
            "id": "#MessageKind_String",
            "title": "MessageKind_String",
            "description": "The coded type of a document.",
            "modelReference": "http://iec.ch/TC57/2013/CIM-schema-cim16#String",
            "type": "object",
            "additionalProperties": false,
            "properties": {
                "value": {
                    "description": "Main Core value Space.",
                    "$ref": "urn-entsoe-eu-wgedi-codelists.schema.json#/definitions/MessageTypeList"
                }
            },
            "required": [
                "value"
            ]
        },
        "ESMP_DateTime": {
            "id": "#ESMP_DateTime",
            "title": "ESMP_DateTime",
            "description": "In ESMP, the dateTime shall be expressed in UTC as YYYY-MM-DDThh:mm:ssZ.",
            "modelReference": "http://iec.ch/TC57/2013/CIM-schema-cim16#DateTime",
            "type": "object",
            "additionalProperties": false,
            "properties": {
                "value": {
                    "description": "Main Core value Space.",
                    "type": "string",
                    "pattern": "^((([0-9]{4})[\\-](0[13578]|1[02])[\\-](0[1-9]|[12][0-9]|3[01])|([0-9]{4})[\\-]((0[469])|(11))[\\-](0[1-9]|[12][0-9]|30))T(([01][0-9]|2[0-3]):[0-5][0-9]:[0-5][0-9])Z)|(([13579][26][02468][048]|[13579][01345789](0)[48]|[13579][01345789][2468][048]|[02468][048][02468][048]|[02468][1235679](0)[48]|[02468][1235679][2468][048]|[0-9][0-9][13579][26])[\\-](02)[\\-](0[1-9]|1[0-9]|2[0-9])T(([01][0-9]|2[0-3]):[0-5][0-9]:[0-5][0-9])Z)|(([13579][26][02468][1235679]|[13579][01345789](0)[01235679]|[13579][01345789][2468][1235679]|[02468][048][02468][1235679]|[02468][1235679](0)[01235679]|[02468][1235679][2468][1235679]|[0-9][0-9][13579][01345789])[\\-](02)[\\-](0[1-9]|1[0-9]|2[0-8])T(([01][0-9]|2[0-3]):[0-5][0-9]:[0-5][0-9])Z)$"
                }
            },
            "required": [
                "value"
            ]
        },
        "ProcessKind_String": {
            "id": "#ProcessKind_String",
            "title": "ProcessKind_String",
            "description": "The coded identification of the nature of process.",
            "modelReference": "http://iec.ch/TC57/2013/CIM-schema-cim16#String",
            "type": "object",
            "additionalProperties": false,
            "properties": {
                "value": {
                    "description": "Main Core value Space.",
                    "$ref": "urn-entsoe-eu-wgedi-codelists.schema.json#/definitions/ProcessTypeList"
                }
            },
            "required": [
                "value"
            ]
        },
        "MarketRoleKind_String": {
            "id": "#MarketRoleKind_String",
            "title": "MarketRoleKind_String",
            "description": "The identification of the role played by a party.",
            "modelReference": "http://iec.ch/TC57/2013/CIM-schema-cim16#String",
            "type": "object",
            "additionalProperties": false,
            "properties": {
                "value": {
                    "description": "Main Core value Space.",
                    "$ref": "urn-entsoe-eu-wgedi-codelists.schema.json#/definitions/RoleTypeList"
                }
            },
            "required": [
                "value"
            ]
        },
        "ESMP_Voltage": {
            "id": "#ESMP_Voltage",
            "title": "ESMP_Voltage",
            "description": "The coded identification of a voltage value.",
            "modelReference": "http://iec.ch/TC57/2013/CIM-schema-cim16#Voltage",
            "type": "object",
            "additionalProperties": false,
            "properties": {
                "value": {
                    "description": "Main Core value Space.\r\nThe value is expressed as a simple precision and no mantisse.",
                    "type": "number",
                    "pattern": "^([0-9]*\\.?[0-9]*)$",
                    "modelReference": "http://iec.ch/TC57/2013/CIM-schema-cim16#Voltage.value"
                },
                "unit": {
                    "description": "The unit of the value, the UN/CEFACT recommendation 20 is used as coding scheme of the unit.",
                    "$ref": "urn-entsoe-eu-wgedi-codelists.schema.json#/definitions/UnitSymbol",
                    "const": "KVT",
                    "modelReference": "http://iec.ch/TC57/2013/CIM-schema-cim16#Voltage.unit"
                }
            },
            "required": [
                "value",
                "unit"
            ]
        },
        "Status_String": {
            "id": "#Status_String",
            "title": "Status_String",
            "description": "The identification of the status of an object.",
            "modelReference": "http://iec.ch/TC57/2013/CIM-schema-cim16#String",
            "type": "object",
            "additionalProperties": false,
            "properties": {
                "value": {
                    "description": "Main Core value Space.",
                    "$ref": "urn-entsoe-eu-wgedi-codelists.schema.json#/definitions/StatusTypeList"
                }
            },
            "required": [
                "value"
            ]
        },
        "ResourceID_String": {
            "id": "#ResourceID_String",
            "title": "ResourceID_String",
            "description": "The identification of a resource object in the energy market.\r\n\r\nIn the ESMP context, it is an authorized issuing office that provides an agreed identification coding scheme for resources (generator, lines, substations, etc.) identification.",
            "modelReference": "http://iec.ch/TC57/2013/CIM-schema-cim16#String",
            "type": "object",
            "additionalProperties": false,
            "properties": {
                "codingScheme": {
                    "description": "DomainQualification.",
                    "$ref": "urn-entsoe-eu-wgedi-codelists.schema.json#/definitions/CodingSchemeTypeList",
                    "modelReference": "http://iec.ch/TC57/2013/CIM-schema-cim16#String.codingScheme"
                },
                "value": {
                    "description": "Main Core value Space.",
                    "type": "string",
                    "maxLength": 60,
                    "modelReference": "http://iec.ch/TC57/2013/CIM-schema-cim16#String.value"
                }
            },
            "required": [
                "codingScheme",
                "value"
            ]
        },
        "Characters200_String": {
            "id": "#Characters200_String",
            "title": "Characters200_String",
            "description": "A string consisting of a sequence of 8 bit characters. The character encoding is UTF-8. \r\nThe string length is restricted to 200 characters.",
            "modelReference": "http://iec.ch/TC57/2013/CIM-schema-cim16#String",
            "type": "object",
            "additionalProperties": false,
            "properties": {
                "value": {
                    "description": "The string length is restricted to 200 characters.",
                    "type": "string",
                    "maxLength": 200
                }
            },
            "required": [
                "value"
            ]
        },
        "PsrType_String": {
            "id": "#PsrType_String",
            "title": "PsrType_String",
            "description": "The coded type of a power system resource.",
            "modelReference": "http://iec.ch/TC57/2013/CIM-schema-cim16#String",
            "type": "object",
            "additionalProperties": false,
            "properties": {
                "value": {
                    "description": "Main Core value Space.",
                    "$ref": "urn-entsoe-eu-wgedi-codelists.schema.json#/definitions/AssetTypeList"
                }
            },
            "required": [
                "value"
            ]
        },
        "MeasurementUnitKind_String": {
            "id": "#MeasurementUnitKind_String",
            "title": "MeasurementUnitKind_String",
            "description": "The coded identification of a unit of measure that is applied to a quantity. The measurement units shall be in compliance with UN/ECE Recommendation 20.",
            "modelReference": "http://iec.ch/TC57/2013/CIM-schema-cim16#String",
            "type": "object",
            "additionalProperties": false,
            "properties": {
                "value": {
                    "description": "Main Core value Space.",
                    "$ref": "urn-entsoe-eu-wgedi-codelists.schema.json#/definitions/UnitOfMeasureTypeList"
                }
            },
            "required": [
                "value"
            ]
        },
        "ESMPBoolean_String": {
            "id": "#ESMPBoolean_String",
            "title": "ESMPBoolean_String",
            "description": "The attribute is a Boolean, either 0 or 1 value, \"No\" or \"Yes\", or two values defined in a code list.",
            "modelReference": "http://iec.ch/TC57/2013/CIM-schema-cim16#String",
            "type": "object",
            "additionalProperties": false,
            "properties": {
                "value": {
                    "description": "Main Core value Space.",
                    "$ref": "urn-entsoe-eu-wgedi-codelists.schema.json#/definitions/IndicatorTypeList"
                }
            },
            "required": [
                "value"
            ]
        }
    }
}