{
    "$id": "EIC-document-assembly-model",
    "$schema": "http://json-schema.org/draft-07/schema#",
    "title": "EIC-document-assembly-model  profile generated 2021-02-09 14:20:02.684807",
    "description": " Description du profile ",
    "namespace": "urn:iec62325.351:tc57wg16:451-n:eicdocument:1:0",
    "type": "object",
    "additionalProperties": false,
    "properties": {
        "EIC_MarketDocument": {
            "$ref": "#/definitions/EIC_MarketDocument"
        }
    },
    "definitions": {
        "EIC-document-assembly-model": {
            "$ref": "#"
        },
        "EICCode_MarketDocument": {
            "id": "#EICCode_MarketDocument",
            "title": "EICCode_MarketDocument",
            "description": "A document describing the EIC code, which identification is provided in the mRID attribute.\r\nAn electronic document containing the information necessary to satisfy the requirements of a given business process.",
            "modelReference": "http://iec.ch/TC57/2013/CIM-schema-cim16#MarketDocument",
            "type": "object",
            "additionalProperties": false,
            "properties": {
                "mRID": {
                    "description": "The EIC code that is managed in the process (creation, update, deactivation, reactivation, publication).",
                    "modelReference": "http://iec.ch/TC57/2013/CIM-schema-cim16#MarketDocument.mRID",
                    "$ref": "#/definitions/EICCode_String"
                },
                "attributeInstanceComponent.attribute": {
                    "description": "The identification of an EIC code either as local EIC code or international EIC code in order to keep either locally or to send to the central registry.\r\nThe identification of an attribute for a given request component.\r\n\r\n--- This attribute states if the EIC code is either a local EIC code or an international EIC code.\r\nThe default value is that the EIC code is a local EIC code; thus \"no value\" attribute means that the code is a local EIC code.",
                    "modelReference": "http://iec.ch/TC57/2013/CIM-schema-cim16#attributeInstanceComponent.attribute",
                    "type": "string"
                },
                "deactivationRequested_DateAndOrTime.date": {
                    "description": "The date as \"YYYY-MM-DD\", which conforms with ISO 8601.\r\n\r\n--- Date when the deactivation will be done.",
                    "modelReference": "http://iec.ch/TC57/2013/CIM-schema-cim16#DateAndOrTime.date",
                    "type": "string",
                    "pattern": "^(-?([1-9][0-9]{3,}|0[0-9]{3})-(0[1-9]|1[0-2])-(0[1-9]|[12][0-9]|3[01])(Z|(\\+|-)((0[0-9]|1[0-3]):[0-5][0-9]|14:00))?)$"
                },
                "description": {
                    "description": "The description of the EIC code.\r\nThe description is a free human readable text describing or naming the object. It may be non unique and may not correlate to a naming hierarchy.",
                    "modelReference": "http://iec.ch/TC57/2013/CIM-schema-cim16#MarketDocument.description",
                    "$ref": "#/definitions/Characters700_String"
                },
                "display_Names.name": {
                    "description": "Any free text that name the object.\r\n\r\n--- The display name or short name to be used on displays.",
                    "modelReference": "http://iec.ch/TC57/2013/CIM-schema-cim16#Names.name",
                    "$ref": "#/definitions/Characters16_String"
                },
                "docStatus": {
                    "description": "The status of the EIC code document, i.e. active or inactive.\r\nThis status is for publication information.\r\nThe identification of the condition or position of the document with regard to its standing.",
                    "modelReference": "http://iec.ch/TC57/2013/CIM-schema-cim16#MarketDocument.docStatus",
                    "$ref": "#/definitions/Action_Status"
                },
                "eICCode_MarketParticipant.aCERCode_Names.name": {
                    "description": "Any free text that name the object.\r\nThe other codes that may be used to identify an entity.\r\n\r\n\r\n--- Additional information when the EIC code is the one of a market participant, such as company address, ACER code, VAT code.\r\n\r\n--- The ACER code associated to the EIC code of the market participant.",
                    "modelReference": "http://iec.ch/TC57/2013/CIM-schema-cim16#Names.name",
                    "$ref": "#/definitions/ACERCode_String"
                },
                "eICCode_MarketParticipant.streetAddress": {
                    "description": "Street address when the EIC code is the one of a market participant, i.e. company..\r\n\r\n--- Additional information when the EIC code is the one of a market participant, such as company address, ACER code, VAT code.",
                    "modelReference": "http://iec.ch/TC57/2013/CIM-schema-cim16#MarketParticipant.streetAddress",
                    "$ref": "#/definitions/StreetAddress"
                },
                "eICCode_MarketParticipant.vATCode_Names.name": {
                    "description": "Any free text that name the object.\r\n\r\n\r\n--- Additional information when the EIC code is the one of a market participant, such as company address, ACER code, VAT code.\r\n\r\n--- The VAT code associated with the EIC code of the market participant.",
                    "modelReference": "http://iec.ch/TC57/2013/CIM-schema-cim16#Names.name",
                    "$ref": "#/definitions/VATCode_String"
                },
                "eICContact_MarketParticipant.electronicAddress": {
                    "description": "Electronic address.\r\n\r\n--- The information about the contact person for the EIC code.",
                    "modelReference": "http://iec.ch/TC57/2013/CIM-schema-cim16#MarketParticipant.electronicAddress",
                    "$ref": "#/definitions/ElectronicAddress"
                },
                "eICContact_MarketParticipant.name": {
                    "description": "The name is any free human readable and possibly non unique text naming the object.\r\n\r\n--- The information about the contact person for the EIC code.",
                    "modelReference": "http://iec.ch/TC57/2013/CIM-schema-cim16#MarketParticipant.name",
                    "$ref": "#/definitions/Characters70_String"
                },
                "eICContact_MarketParticipant.phone1": {
                    "description": "Phone number.\r\n\r\n--- The information about the contact person for the EIC code.",
                    "modelReference": "http://iec.ch/TC57/2013/CIM-schema-cim16#MarketParticipant.phone1",
                    "$ref": "#/definitions/TelephoneNumber"
                },
                "eICParent_MarketDocument.mRID": {
                    "description": "The identification of the parent for the EIC code (hierarchical description).\r\nFor a market participant, the parent is the mother company.\r\nFor the areas, the parent provides information about aggregation, e.g. a control block is composed of control areas, etc.\r\n\r\n--- The EIC code of the parent (market participant, area, resource object, etc.) of the EIC code.",
                    "modelReference": "http://iec.ch/TC57/2013/CIM-schema-cim16#MarketDocument.mRID",
                    "$ref": "#/definitions/EICCode_String"
                },
                "eICResponsible_MarketParticipant.mRID": {
                    "description": "The identification of a party in the energy market.\r\n\r\n--- The party responsible of the object identified by the EIC code (mRID attribute).",
                    "modelReference": "http://iec.ch/TC57/2013/CIM-schema-cim16#MarketParticipant.mRID",
                    "$ref": "#/definitions/EICCode_String"
                },
                "lastRequest_DateAndOrTime.date": {
                    "description": "The date as \"YYYY-MM-DD\", which conforms with ISO 8601.\r\n\r\n--- Date of the request",
                    "modelReference": "http://iec.ch/TC57/2013/CIM-schema-cim16#DateAndOrTime.date",
                    "type": "string",
                    "pattern": "^(-?([1-9][0-9]{3,}|0[0-9]{3})-(0[1-9]|1[0-2])-(0[1-9]|[12][0-9]|3[01])(Z|(\\+|-)((0[0-9]|1[0-3]):[0-5][0-9]|14:00))?)$"
                },
                "long_Names.name": {
                    "description": "Any free text that name the object.\r\n\r\n--- The long name or the \"full\" name of the EIC party or object being identified by the EIC code.",
                    "modelReference": "http://iec.ch/TC57/2013/CIM-schema-cim16#Names.name",
                    "$ref": "#/definitions/Characters70_String"
                },
                "status": {
                    "description": "The action requested to be carried out, e.g. creation of the EIC code, update, deactivation, reactivation.\r\nStatus of subject matter (e.g., Agreement, Work) this document represents. For status of the document itself, use 'docStatus' attribute.",
                    "modelReference": "http://iec.ch/TC57/2013/CIM-schema-cim16#MarketDocument.status",
                    "$ref": "#/definitions/Action_Status"
                },
                "Function_Names": {
                    "description": "All function names of this identified object.",
                    "modelReference": "http://iec.ch/TC57/2013/CIM-schema-cim16#MarketDocument.Function_Names",
                    "type": "array",
                    "items": {
                        "$ref": "#/definitions/Function_Name"
                    },
                    "minItems": 0
                }
            },
            "required": [
                "long_Names.name",
                "display_Names.name",
                "lastRequest_DateAndOrTime.date"
            ]
        },
        "EIC_MarketDocument": {
            "id": "#EIC_MarketDocument",
            "title": "EIC_MarketDocument",
            "description": "An electronic document containing the information necessary to satisfy the requirements of a given business process.",
            "modelReference": "http://iec.ch/TC57/2013/CIM-schema-cim16#MarketDocument",
            "type": "object",
            "additionalProperties": false,
            "properties": {
                "mRID": {
                    "description": "The unique identification of the document being exchanged within a business process flow.",
                    "modelReference": "http://iec.ch/TC57/2013/CIM-schema-cim16#MarketDocument.mRID",
                    "$ref": "#/definitions/ID_String"
                },
                "createdDateTime": {
                    "description": "The date and time of the creation of the document.",
                    "modelReference": "http://iec.ch/TC57/2013/CIM-schema-cim16#MarketDocument.createdDateTime",
                    "$ref": "#/definitions/ESMP_DateTime"
                },
                "receiver_MarketParticipant.mRID": {
                    "description": "The identification of a party in the energy market.\r\n\r\n--- The recipient of the document.",
                    "modelReference": "http://iec.ch/TC57/2013/CIM-schema-cim16#MarketParticipant.mRID",
                    "$ref": "#/definitions/PartyID_String"
                },
                "receiver_MarketParticipant.marketRole.type": {
                    "description": "The identification of the role played by a market player.\r\n\r\n--- The recipient of the document.",
                    "modelReference": "http://iec.ch/TC57/2013/CIM-schema-cim16#marketRole.type",
                    "$ref": "#/definitions/MarketRoleKind_String"
                },
                "revisionNumber": {
                    "description": "The identification of the version that distinguishes one evolution of a document from another.",
                    "modelReference": "http://iec.ch/TC57/2013/CIM-schema-cim16#MarketDocument.revisionNumber",
                    "$ref": "#/definitions/ESMPVersion_String"
                },
                "sender_MarketParticipant.mRID": {
                    "description": "The identification of a party in the energy market.\r\n\r\n--- The sender of the document.",
                    "modelReference": "http://iec.ch/TC57/2013/CIM-schema-cim16#MarketParticipant.mRID",
                    "$ref": "#/definitions/PartyID_String"
                },
                "sender_MarketParticipant.marketRole.type": {
                    "description": "The identification of the role played by a market player.\r\n\r\n--- The sender of the document.",
                    "modelReference": "http://iec.ch/TC57/2013/CIM-schema-cim16#marketRole.type",
                    "$ref": "#/definitions/MarketRoleKind_String"
                },
                "type": {
                    "description": "The coded type of a document. The document type describes the principal characteristic of the document.",
                    "modelReference": "http://iec.ch/TC57/2013/CIM-schema-cim16#MarketDocument.type",
                    "$ref": "#/definitions/MessageKind_String"
                },
                "EICCode_MarketDocument": {
                    "description": "The information on the EIC code.",
                    "modelReference": "http://iec.ch/TC57/2013/CIM-schema-cim16#MarketDocument.EICCode_MarketDocument",
                    "type": "array",
                    "items": {
                        "$ref": "#/definitions/EICCode_MarketDocument"
                    },
                    "minItems": 0
                }
            },
            "required": [
                "mRID",
                "revisionNumber",
                "type",
                "createdDateTime"
            ]
        },
        "Function_Name": {
            "id": "#Function_Name",
            "title": "Function_Name",
            "description": "The Name class provides the means to define any number of human readable  names for an object. A name is <b>not</b> to be used for defining inter-object relationships. For inter-object relationships instead use the object identification 'mRID'.",
            "modelReference": "http://iec.ch/TC57/2013/CIM-schema-cim16#Name",
            "type": "object",
            "additionalProperties": false,
            "properties": {
                "name": {
                    "description": "For the EIC code, the list of functions.\r\nAny free text that name the object.",
                    "modelReference": "http://iec.ch/TC57/2013/CIM-schema-cim16#Name.name",
                    "$ref": "#/definitions/Characters70_String"
                }
            },
            "required": [
                "name"
            ]
        },
        "EICCode_String": {
            "id": "#EICCode_String",
            "title": "EICCode_String",
            "description": "An EIC code, the length is of 16 characters.",
            "modelReference": "http://iec.ch/TC57/2013/CIM-schema-cim16#String",
            "type": "object",
            "additionalProperties": false,
            "properties": {
                "value": {
                    "description": "Main Core value Space.",
                    "type": "string",
                    "minimum": 16,
                    "maximum": 16,
                    "pattern": "^([A-Z0-9]{2}(([A-Z0-9]|[-]){13})[A-Z0-9])$"
                }
            },
            "required": [
                "value"
            ]
        },
        "Characters16_String": {
            "id": "#Characters16_String",
            "title": "Characters16_String",
            "description": "A string consisting of a sequence of 8 bit characters. The character encoding is UTF-8. \r\nThe string length is restricted to 16 characters string.",
            "modelReference": "http://iec.ch/TC57/2013/CIM-schema-cim16#String",
            "type": "object",
            "additionalProperties": false,
            "properties": {
                "value": {
                    "description": "Main Core value Space.",
                    "type": "string",
                    "maxLength": 16,
                    "pattern": "^([A-Z\\-\\+_0-9]+)$"
                }
            },
            "required": [
                "value"
            ]
        },
        "ACERCode_String": {
            "id": "#ACERCode_String",
            "title": "ACERCode_String",
            "description": "An ACER code, i.e. length of 12 characters.",
            "modelReference": "http://iec.ch/TC57/2013/CIM-schema-cim16#String",
            "type": "object",
            "additionalProperties": false,
            "properties": {
                "value": {
                    "description": "Main Core value Space.",
                    "type": "string",
                    "minimum": 12,
                    "maximum": 12,
                    "pattern": "^([A-Za-z0-9_]+\\.[A-Z][A-Z])$"
                }
            },
            "required": [
                "value"
            ]
        },
        "VATCode_String": {
            "id": "#VATCode_String",
            "title": "VATCode_String",
            "description": "A VAT code, i.e. length of 14 characters.",
            "modelReference": "http://iec.ch/TC57/2013/CIM-schema-cim16#String",
            "type": "object",
            "additionalProperties": false,
            "properties": {
                "value": {
                    "description": "Main Core value Space.",
                    "type": "string",
                    "maxLength": 14,
                    "pattern": "^([A-Z0-9]+)$"
                }
            },
            "required": [
                "value"
            ]
        },
        "Characters700_String": {
            "id": "#Characters700_String",
            "title": "Characters700_String",
            "description": "A string consisting of a sequence of 8 bit characters. The character encoding is UTF-8. \r\nThe string length is restricted to 700 characters string.",
            "modelReference": "http://iec.ch/TC57/2013/CIM-schema-cim16#String",
            "type": "object",
            "additionalProperties": false,
            "properties": {
                "value": {
                    "description": "Main Core value Space.",
                    "type": "string",
                    "maxLength": 700
                }
            },
            "required": [
                "value"
            ]
        },
        "Status_String": {
            "id": "#Status_String",
            "title": "Status_String",
            "description": "The identification of the status of an object.",
            "modelReference": "http://iec.ch/TC57/2013/CIM-schema-cim16#String",
            "type": "object",
            "additionalProperties": false,
            "properties": {
                "value": {
                    "description": "Main Core value Space.",
                    "$ref": "urn-entsoe-eu-wgedi-codelists.schema.json#/definitions/StatusTypeList"
                }
            },
            "required": [
                "value"
            ]
        },
        "Action_Status": {
            "id": "#Action_Status",
            "title": "Action_Status",
            "description": "The coded identification of the status of an object.",
            "modelReference": "http://iec.ch/TC57/2013/CIM-schema-cim16#Status",
            "type": "object",
            "additionalProperties": false,
            "properties": {
                "value": {
                    "description": "Main Core value Space.",
                    "modelReference": "http://iec.ch/TC57/2013/CIM-schema-cim16#Status.value",
                    "$ref": "#/definitions/Status_String"
                }
            },
            "required": [
                "value"
            ]
        },
        "Characters70_String": {
            "id": "#Characters70_String",
            "title": "Characters70_String",
            "description": "A string consisting of a sequence of 8 bit characters. The character encoding is UTF-8. \r\nThe string has 70 characters.",
            "modelReference": "http://iec.ch/TC57/2013/CIM-schema-cim16#String",
            "type": "object",
            "additionalProperties": false,
            "properties": {
                "value": {
                    "description": "The string length is restricted to 70 characters.",
                    "type": "string",
                    "maxLength": 70
                }
            },
            "required": [
                "value"
            ]
        },
        "Characters15_String": {
            "id": "#Characters15_String",
            "title": "Characters15_String",
            "description": "A string consisting of a sequence of 8 bit characters. The character encoding is UTF-8. \r\nThe string length is restricted to 15 characters.",
            "modelReference": "http://iec.ch/TC57/2013/CIM-schema-cim16#String",
            "type": "object",
            "additionalProperties": false,
            "properties": {
                "value": {
                    "description": "The string length is restricted to 15 characters.",
                    "type": "string",
                    "maxLength": 15
                }
            },
            "required": [
                "value"
            ]
        },
        "TelephoneNumber": {
            "id": "#TelephoneNumber",
            "title": "TelephoneNumber",
            "description": "Telephone number.",
            "modelReference": "http://iec.ch/TC57/2013/CIM-schema-cim16#TelephoneNumber",
            "type": "object",
            "additionalProperties": false,
            "properties": {
                "ituPhone": {
                    "description": "Phone number according to ITU E.164.",
                    "modelReference": "http://iec.ch/TC57/2013/CIM-schema-cim16#TelephoneNumber.ituPhone",
                    "$ref": "#/definitions/Characters15_String"
                }
            },
            "required": [
                "ituPhone"
            ]
        },
        "ElectronicAddress": {
            "id": "#ElectronicAddress",
            "title": "ElectronicAddress",
            "description": "Electronic address information.",
            "modelReference": "http://iec.ch/TC57/2013/CIM-schema-cim16#ElectronicAddress",
            "type": "object",
            "additionalProperties": false,
            "properties": {
                "email1": {
                    "description": "Primary email address.",
                    "modelReference": "http://iec.ch/TC57/2013/CIM-schema-cim16#ElectronicAddress.email1",
                    "$ref": "#/definitions/Characters70_String"
                }
            },
            "required": [
                "email1"
            ]
        },
        "StreetDetail": {
            "id": "#StreetDetail",
            "title": "StreetDetail",
            "description": "Street details, in the context of address.",
            "modelReference": "http://iec.ch/TC57/2013/CIM-schema-cim16#StreetDetail",
            "type": "object",
            "additionalProperties": false,
            "properties": {
                "addressGeneral": {
                    "description": "First line of a free form address or some additional address information (for example a mail stop).",
                    "modelReference": "http://iec.ch/TC57/2013/CIM-schema-cim16#StreetDetail.addressGeneral",
                    "$ref": "#/definitions/Characters70_String"
                },
                "addressGeneral2": {
                    "description": "If applicable, second line of a free form address (unstructured address).",
                    "modelReference": "http://iec.ch/TC57/2013/CIM-schema-cim16#StreetDetail.addressGeneral2",
                    "$ref": "#/definitions/Characters70_String"
                },
                "addressGeneral3": {
                    "description": "If applicable, third line of a free form address (unstructured address).",
                    "modelReference": "http://iec.ch/TC57/2013/CIM-schema-cim16#StreetDetail.addressGeneral3",
                    "$ref": "#/definitions/Characters70_String"
                },
                "floorIdentification": {
                    "description": "The identification by name or number, expressed as text, of the floor in the building as part of this address.",
                    "modelReference": "http://iec.ch/TC57/2013/CIM-schema-cim16#StreetDetail.floorIdentification",
                    "type": "string",
                    "maxLength": 15
                }
            },
            "required": [
                "floorIdentification"
            ]
        },
        "Characters10_String": {
            "id": "#Characters10_String",
            "title": "Characters10_String",
            "description": "A string consisting of a sequence of 8 bit characters. The character encoding is UTF-8.\r\nThe string length is restricted to 10 characters.",
            "modelReference": "http://iec.ch/TC57/2013/CIM-schema-cim16#String",
            "type": "object",
            "additionalProperties": false,
            "properties": {
                "value": {
                    "description": "The string length is restricted to 10 characters.",
                    "type": "string",
                    "maxLength": 10
                }
            },
            "required": [
                "value"
            ]
        },
        "Characters35_String": {
            "id": "#Characters35_String",
            "title": "Characters35_String",
            "description": "A string consisting of a sequence of 8 bit characters. The character encoding is UTF-8.\r\nThe string length is restricted to 35 characters.",
            "modelReference": "http://iec.ch/TC57/2013/CIM-schema-cim16#String",
            "type": "object",
            "additionalProperties": false,
            "properties": {
                "value": {
                    "description": "The string length is restricted to 35 characters.",
                    "type": "string",
                    "maxLength": 35
                }
            },
            "required": [
                "value"
            ]
        },
        "Characters2_String": {
            "id": "#Characters2_String",
            "title": "Characters2_String",
            "description": "A string consisting of a sequence of 8 bit characters. The character encoding is UTF-8. \r\nThe string length is restricted to 2 alphabetic characters.",
            "modelReference": "http://iec.ch/TC57/2013/CIM-schema-cim16#String",
            "type": "object",
            "additionalProperties": false,
            "properties": {
                "value": {
                    "description": "The string length is restricted to 2 alphabetic characters for the ISO country code (ISO 3166-1).",
                    "type": "string",
                    "minimum": 2,
                    "maximum": 2,
                    "pattern": "^[A-Z]*$"
                }
            },
            "required": [
                "value"
            ]
        },
        "TownDetail": {
            "id": "#TownDetail",
            "title": "TownDetail",
            "description": "Town details, in the context of address.",
            "modelReference": "http://iec.ch/TC57/2013/CIM-schema-cim16#TownDetail",
            "type": "object",
            "additionalProperties": false,
            "properties": {
                "name": {
                    "description": "Town name.",
                    "modelReference": "http://iec.ch/TC57/2013/CIM-schema-cim16#TownDetail.name",
                    "$ref": "#/definitions/Characters35_String"
                },
                "country": {
                    "description": "Name of the country (ISO 3166 2 character code identification).",
                    "modelReference": "http://iec.ch/TC57/2013/CIM-schema-cim16#TownDetail.country",
                    "$ref": "#/definitions/Characters2_String"
                }
            },
            "required": [
                "name",
                "country"
            ]
        },
        "StreetAddress": {
            "id": "#StreetAddress",
            "title": "StreetAddress",
            "description": "General purpose street address information.",
            "modelReference": "http://iec.ch/TC57/2013/CIM-schema-cim16#StreetAddress",
            "type": "object",
            "additionalProperties": false,
            "properties": {
                "streetDetail": {
                    "description": "Street detail.",
                    "modelReference": "http://iec.ch/TC57/2013/CIM-schema-cim16#StreetAddress.streetDetail",
                    "$ref": "#/definitions/StreetDetail"
                },
                "postalCode": {
                    "description": "Postal code for the address.",
                    "modelReference": "http://iec.ch/TC57/2013/CIM-schema-cim16#StreetAddress.postalCode",
                    "$ref": "#/definitions/Characters10_String"
                },
                "townDetail": {
                    "description": "Town detail.",
                    "modelReference": "http://iec.ch/TC57/2013/CIM-schema-cim16#StreetAddress.townDetail",
                    "$ref": "#/definitions/TownDetail"
                },
                "language": {
                    "description": "The language in which the address is specified using ISO60039-1 two digit code.",
                    "modelReference": "http://iec.ch/TC57/2013/CIM-schema-cim16#StreetAddress.language",
                    "type": "string",
                    "minimum": 2,
                    "maximum": 2,
                    "pattern": "^[A-Z]*$"
                }
            },
            "required": [
                "streetDetail",
                "postalCode",
                "townDetail"
            ]
        },
        "ID_String": {
            "id": "#ID_String",
            "title": "ID_String",
            "description": "A code to uniquely distinguish one occurrence of an entity from another.\r\n\r\nIn the ESMP context, the code is defined either by:\r\n- an emitting company that provides an agreed identification unique within a business context such as capacity auction identification, market agreement identification, etc.\r\n- a party (originator of the exchange) that provides a unique identification in the framework of a business exchange such as document identification, time series identification, bid identification, ...",
            "modelReference": "http://iec.ch/TC57/2013/CIM-schema-cim16#String",
            "type": "object",
            "additionalProperties": false,
            "properties": {
                "value": {
                    "description": "Main Core value Space.",
                    "type": "string",
                    "maxLength": 60
                }
            },
            "required": [
                "value"
            ]
        },
        "ESMPVersion_String": {
            "id": "#ESMPVersion_String",
            "title": "ESMPVersion_String",
            "description": "In ESMP, the coded value is restricted to digits.\r\n\r\nA code that distinguishes one evolution of an identified object from another. Information about a specific object may be sent several times, each transmission being identified by a different version number.",
            "modelReference": "http://iec.ch/TC57/2013/CIM-schema-cim16#String",
            "type": "object",
            "additionalProperties": false,
            "properties": {
                "value": {
                    "description": "Main Core value Space.",
                    "type": "string",
                    "pattern": "^[1-9]([0-9]){0,2}$"
                }
            },
            "required": [
                "value"
            ]
        },
        "MessageKind_String": {
            "id": "#MessageKind_String",
            "title": "MessageKind_String",
            "description": "The coded type of a document.",
            "modelReference": "http://iec.ch/TC57/2013/CIM-schema-cim16#String",
            "type": "object",
            "additionalProperties": false,
            "properties": {
                "value": {
                    "description": "Main Core value Space.",
                    "$ref": "urn-entsoe-eu-wgedi-codelists.schema.json#/definitions/MessageTypeList"
                }
            },
            "required": [
                "value"
            ]
        },
        "PartyID_String": {
            "id": "#PartyID_String",
            "title": "PartyID_String",
            "description": "The identification of an actor in the energy market.\r\n\r\nIn the ESMP context, it is an authorized issuing office that provides an agreed identification coding scheme for market participant identification.",
            "modelReference": "http://iec.ch/TC57/2013/CIM-schema-cim16#String",
            "type": "object",
            "additionalProperties": false,
            "properties": {
                "codingScheme": {
                    "description": "DomainQualification.",
                    "$ref": "urn-entsoe-eu-wgedi-codelists.schema.json#/definitions/CodingSchemeTypeList",
                    "modelReference": "http://iec.ch/TC57/2013/CIM-schema-cim16#String.codingScheme"
                },
                "value": {
                    "description": "Main Core value Space.",
                    "type": "string",
                    "maxLength": 16,
                    "modelReference": "http://iec.ch/TC57/2013/CIM-schema-cim16#String.value"
                }
            },
            "required": [
                "codingScheme",
                "value"
            ]
        },
        "MarketRoleKind_String": {
            "id": "#MarketRoleKind_String",
            "title": "MarketRoleKind_String",
            "description": "The identification of the role played by a party.",
            "modelReference": "http://iec.ch/TC57/2013/CIM-schema-cim16#String",
            "type": "object",
            "additionalProperties": false,
            "properties": {
                "value": {
                    "description": "Main Core value Space.",
                    "$ref": "urn-entsoe-eu-wgedi-codelists.schema.json#/definitions/RoleTypeList"
                }
            },
            "required": [
                "value"
            ]
        },
        "ESMP_DateTime": {
            "id": "#ESMP_DateTime",
            "title": "ESMP_DateTime",
            "description": "In ESMP, the dateTime shall be expressed in UTC as YYYY-MM-DDThh:mm:ssZ.",
            "modelReference": "http://iec.ch/TC57/2013/CIM-schema-cim16#DateTime",
            "type": "object",
            "additionalProperties": false,
            "properties": {
                "value": {
                    "description": "Main Core value Space.",
                    "type": "string",
                    "pattern": "^((([0-9]{4})[\\-](0[13578]|1[02])[\\-](0[1-9]|[12][0-9]|3[01])|([0-9]{4})[\\-]((0[469])|(11))[\\-](0[1-9]|[12][0-9]|30))T(([01][0-9]|2[0-3]):[0-5][0-9]:[0-5][0-9])Z)|(([13579][26][02468][048]|[13579][01345789](0)[48]|[13579][01345789][2468][048]|[02468][048][02468][048]|[02468][1235679](0)[48]|[02468][1235679][2468][048]|[0-9][0-9][13579][26])[\\-](02)[\\-](0[1-9]|1[0-9]|2[0-9])T(([01][0-9]|2[0-3]):[0-5][0-9]:[0-5][0-9])Z)|(([13579][26][02468][1235679]|[13579][01345789](0)[01235679]|[13579][01345789][2468][1235679]|[02468][048][02468][1235679]|[02468][1235679](0)[01235679]|[02468][1235679][2468][1235679]|[0-9][0-9][13579][01345789])[\\-](02)[\\-](0[1-9]|1[0-9]|2[0-8])T(([01][0-9]|2[0-3]):[0-5][0-9]:[0-5][0-9])Z)$"
                }
            },
            "required": [
                "value"
            ]
        }
    }
}