{
    "$id": "Configuration-assembly-model",
    "$schema": "http://json-schema.org/draft-07/schema#",
    "title": "Configuration-assembly-model  profile generated 2021-02-04 17:25:33.898497",
    "description": " Description du profile ",
    "namespace": "urn:iec62325.351:tc57wg16:451-6:configurationdocument:3:2",
    "type": "object",
    "additionalProperties": false,
    "properties": {
        "Configuration_MarketDocument": {
            "$ref": "#/definitions/Configuration_MarketDocument"
        }
    },
    "definitions": {
        "Configuration-assembly-model": {
            "$ref": "#"
        },
        "Analog": {
            "id": "#Analog",
            "title": "Analog",
            "description": "Analog represents an analog Measurement.",
            "modelReference": "http://iec.ch/TC57/2013/CIM-schema-cim16#Analog",
            "type": "object",
            "additionalProperties": false,
            "properties": {
                "analogValues.value": {
                    "description": "The value to supervise.\r\n\r\n--- Measurement to which this value is connected.",
                    "modelReference": "http://iec.ch/TC57/2013/CIM-schema-cim16#analogValues.value",
                    "$ref": "#/definitions/ESMP_Float"
                },
                "measurementType": {
                    "description": "Specifies the type of measurement.  For example, this specifies if the measurement represents an indoor temperature, outdoor temperature, bus voltage, line flow, etc.",
                    "modelReference": "http://iec.ch/TC57/2013/CIM-schema-cim16#Analog.measurementType",
                    "$ref": "#/definitions/AnalogType_String"
                },
                "unitSymbol": {
                    "description": "The unit of measure of the measured quantity.",
                    "modelReference": "http://iec.ch/TC57/2013/CIM-schema-cim16#Analog.unitSymbol",
                    "$ref": "#/definitions/UnitSymbol"
                }
            },
            "required": [
                "measurementType",
                "unitSymbol"
            ]
        },
        "Configuration_MarketDocument": {
            "id": "#Configuration_MarketDocument",
            "title": "Configuration_MarketDocument",
            "description": "An electronic document containing the information necessary to satisfy the requirements of the configuration management business process.\r\nThe Configuration_MarketDocument is used to transmit the information necessary to permit the validation of production units, transmission assets and consumption units when market information is provided by the data providers to the market information aggregator for publication.\r\nThe Configuration_MarketDocument is also used to transmit modifications or deactivations that evolve the initial configuration information over time.",
            "modelReference": "http://iec.ch/TC57/2013/CIM-schema-cim16#MarketDocument",
            "type": "object",
            "additionalProperties": false,
            "properties": {
                "mRID": {
                    "description": "Unique identification of the configuration document being exchanged within a given business process flow.",
                    "modelReference": "http://iec.ch/TC57/2013/CIM-schema-cim16#MarketDocument.mRID",
                    "$ref": "#/definitions/ID_String"
                },
                "createdDateTime": {
                    "description": "The date and time of the creation of the document.",
                    "modelReference": "http://iec.ch/TC57/2013/CIM-schema-cim16#MarketDocument.createdDateTime",
                    "$ref": "#/definitions/ESMP_DateTime"
                },
                "process.processType": {
                    "description": "The identification of the nature of process that the document addresses.",
                    "modelReference": "http://iec.ch/TC57/2013/CIM-schema-cim16#process.processType",
                    "$ref": "#/definitions/ProcessKind_String"
                },
                "receiver_MarketParticipant.mRID": {
                    "description": "The identification of a party in the energy market.\r\n\r\n--- Document recipient.",
                    "modelReference": "http://iec.ch/TC57/2013/CIM-schema-cim16#MarketParticipant.mRID",
                    "$ref": "#/definitions/PartyID_String"
                },
                "receiver_MarketParticipant.marketRole.type": {
                    "description": "The identification of the role played by a market player.\r\n\r\n\r\n--- Document recipient.\r\n\r\n--- The role associated with a MarketParticipant.",
                    "modelReference": "http://iec.ch/TC57/2013/CIM-schema-cim16#marketRole.type",
                    "$ref": "#/definitions/MarketRoleKind_String"
                },
                "sender_MarketParticipant.mRID": {
                    "description": "The identification of a party in the energy market.\r\n\r\n--- Document owner.",
                    "modelReference": "http://iec.ch/TC57/2013/CIM-schema-cim16#MarketParticipant.mRID",
                    "$ref": "#/definitions/PartyID_String"
                },
                "sender_MarketParticipant.marketRole.type": {
                    "description": "The identification of the role played by a market player.\r\n\r\n\r\n--- Document owner.\r\n\r\n--- The role associated with a MarketParticipant.",
                    "modelReference": "http://iec.ch/TC57/2013/CIM-schema-cim16#marketRole.type",
                    "$ref": "#/definitions/MarketRoleKind_String"
                },
                "type": {
                    "description": "The coded type of a document. The document type describes the principal characteristic of the document.",
                    "modelReference": "http://iec.ch/TC57/2013/CIM-schema-cim16#MarketDocument.type",
                    "$ref": "#/definitions/MessageKind_String"
                },
                "TimeSeries": {
                    "description": "",
                    "modelReference": "http://iec.ch/TC57/2013/CIM-schema-cim16#MarketDocument.TimeSeries",
                    "type": "array",
                    "items": {
                        "$ref": "#/definitions/TimeSeries"
                    },
                    "minItems": 0
                }
            },
            "required": [
                "mRID",
                "type",
                "process.processType",
                "sender_MarketParticipant.mRID",
                "sender_MarketParticipant.marketRole.type",
                "receiver_MarketParticipant.mRID",
                "receiver_MarketParticipant.marketRole.type",
                "createdDateTime"
            ]
        },
        "ControlArea_Domain": {
            "id": "#ControlArea_Domain",
            "title": "ControlArea_Domain",
            "description": "A domain covering a number of related objects, such as market balance area, grid area, borders etc.",
            "modelReference": "http://iec.ch/TC57/2013/CIM-schema-cim16#Domain",
            "type": "object",
            "additionalProperties": false,
            "properties": {
                "mRID": {
                    "description": "The unique identification of the domain.",
                    "modelReference": "http://iec.ch/TC57/2013/CIM-schema-cim16#Domain.mRID",
                    "$ref": "#/definitions/AreaID_String"
                }
            },
            "required": [
                "mRID"
            ]
        },
        "MktGeneratingUnit": {
            "id": "#MktGeneratingUnit",
            "title": "MktGeneratingUnit",
            "description": "The information about a generating unit.",
            "modelReference": "http://iec.ch/TC57/2013/CIM-schema-cim16#MktGeneratingUnit",
            "type": "object",
            "additionalProperties": false,
            "properties": {
                "mRID": {
                    "description": "The unique identification of the generation unit.",
                    "modelReference": "http://iec.ch/TC57/2013/CIM-schema-cim16#MktGeneratingUnit.mRID",
                    "$ref": "#/definitions/ResourceID_String"
                },
                "generatingUnit_Location.name": {
                    "description": "The name is any free human readable and possibly non unique text naming the object.\r\n\r\n--- Location of the MktGeneratingUnit.",
                    "modelReference": "http://iec.ch/TC57/2013/CIM-schema-cim16#Location.name",
                    "type": "string"
                },
                "generatingUnit_PSRType.psrType": {
                    "description": "The coded type of a power system resource.\r\n\r\n\r\n--- The coded type of the generating unit.",
                    "modelReference": "http://iec.ch/TC57/2013/CIM-schema-cim16#PSRType.psrType",
                    "$ref": "#/definitions/PsrType_String"
                },
                "name": {
                    "description": "The name is any free human readable and possibly non unique text naming the object.",
                    "modelReference": "http://iec.ch/TC57/2013/CIM-schema-cim16#MktGeneratingUnit.name",
                    "type": "string"
                },
                "nominalP": {
                    "description": "The nominal power of the generating unit.",
                    "modelReference": "http://iec.ch/TC57/2013/CIM-schema-cim16#MktGeneratingUnit.nominalP",
                    "$ref": "#/definitions/ESMP_ActivePower"
                }
            },
            "required": [
                "mRID",
                "name",
                "nominalP",
                "generatingUnit_Location.name",
                "generatingUnit_PSRType.psrType"
            ]
        },
        "MktPSRType": {
            "id": "#MktPSRType",
            "title": "MktPSRType",
            "description": "The type of a power system resource",
            "modelReference": "http://iec.ch/TC57/2013/CIM-schema-cim16#MktPSRType",
            "type": "object",
            "additionalProperties": false,
            "properties": {
                "nominalIP_PowerSystemResources.nominalP": {
                    "description": "The nominal power of a production or consumption unit.\r\n\r\n--- The installed capacity of a production unit or a consumption unit.",
                    "modelReference": "http://iec.ch/TC57/2013/CIM-schema-cim16#PowerSystemResources.nominalP",
                    "$ref": "#/definitions/ESMP_ActivePower"
                },
                "production_PowerSystemResources.highVoltageLimit": {
                    "description": "The bus bar's high voltage limit\r\n\r\n--- The voltage level of the RegisteredResource having the MktPSRType.",
                    "modelReference": "http://iec.ch/TC57/2013/CIM-schema-cim16#PowerSystemResources.highVoltageLimit",
                    "$ref": "#/definitions/ESMP_Voltage"
                },
                "psrType": {
                    "description": "The coded type of a power system resource.",
                    "modelReference": "http://iec.ch/TC57/2013/CIM-schema-cim16#MktPSRType.psrType",
                    "$ref": "#/definitions/PsrType_String"
                },
                "GeneratingUnit_PowerSystemResources": {
                    "description": "The generating unit(s) associated with the RegisteredResource of the MktPSRType.",
                    "modelReference": "http://iec.ch/TC57/2013/CIM-schema-cim16#PowerSystemResources",
                    "type": "array",
                    "items": {
                        "$ref": "#/definitions/MktGeneratingUnit"
                    },
                    "minItems": 0
                }
            },
            "required": [
                "psrType"
            ]
        },
        "Provider_MarketParticipant": {
            "id": "#Provider_MarketParticipant",
            "title": "Provider_MarketParticipant",
            "description": "The identification of the party that provides the information concerning the resource object defined in the time series.",
            "modelReference": "http://iec.ch/TC57/2013/CIM-schema-cim16#MarketParticipant",
            "type": "object",
            "additionalProperties": false,
            "properties": {
                "mRID": {
                    "description": "The identification of a party in the energy market.",
                    "modelReference": "http://iec.ch/TC57/2013/CIM-schema-cim16#MarketParticipant.mRID",
                    "$ref": "#/definitions/PartyID_String"
                }
            },
            "required": [
                "mRID"
            ]
        },
        "RegisteredResource": {
            "id": "#RegisteredResource",
            "title": "RegisteredResource",
            "description": "A resource that is registered through the market participant registration system. Examples include generating unit, load, and non-physical generator or load.",
            "modelReference": "http://iec.ch/TC57/2013/CIM-schema-cim16#RegisteredResource",
            "type": "object",
            "additionalProperties": false,
            "properties": {
                "mRID": {
                    "description": "The unique identification of a resource.",
                    "modelReference": "http://iec.ch/TC57/2013/CIM-schema-cim16#RegisteredResource.mRID",
                    "$ref": "#/definitions/ResourceID_String"
                },
                "location.name": {
                    "description": "The name is any free human readable and possibly non unique text naming the object.\r\n\r\n--- Location of this RegisteredResource.",
                    "modelReference": "http://iec.ch/TC57/2013/CIM-schema-cim16#location.name",
                    "type": "string"
                },
                "name": {
                    "description": "The name is any free human readable and possibly non unique text naming the object.",
                    "modelReference": "http://iec.ch/TC57/2013/CIM-schema-cim16#RegisteredResource.name",
                    "type": "string"
                },
                "Measurements": {
                    "description": "The power system resource that contains the measurement.",
                    "modelReference": "http://iec.ch/TC57/2013/CIM-schema-cim16#RegisteredResource.Measurements",
                    "type": "array",
                    "items": {
                        "$ref": "#/definitions/Analog"
                    },
                    "minItems": 0
                }
            },
            "required": [
                "mRID",
                "name",
                "location.name"
            ]
        },
        "TimeSeries": {
            "id": "#TimeSeries",
            "title": "TimeSeries",
            "description": "A time series shall exist to describe a specific production unit, generating unit, transmission asset or consumption unit. It conveys the data related to the configuration of the defined information. ",
            "modelReference": "http://iec.ch/TC57/2013/CIM-schema-cim16#TimeSeries",
            "type": "object",
            "additionalProperties": false,
            "properties": {
                "mRID": {
                    "description": "A unique identification of the time series.",
                    "modelReference": "http://iec.ch/TC57/2013/CIM-schema-cim16#TimeSeries.mRID",
                    "$ref": "#/definitions/ID_String"
                },
                "biddingZone_Domain.mRID": {
                    "description": "The unique identification of the domain.\r\n\r\n--- The domain associated with a TimeSeries.",
                    "modelReference": "http://iec.ch/TC57/2013/CIM-schema-cim16#Domain.mRID",
                    "$ref": "#/definitions/AreaID_String"
                },
                "businessType": {
                    "description": "The identification of the nature of the time series.",
                    "modelReference": "http://iec.ch/TC57/2013/CIM-schema-cim16#TimeSeries.businessType",
                    "$ref": "#/definitions/BusinessKind_String"
                },
                "implementation_DateAndOrTime.date": {
                    "description": "The date as \"YYYY-MM-DD\", which conforms with ISO 8601.\r\n\r\n--- The date of application of the information provided.\r\nThis identifies the date of the effective implementation of the information provided in the time series.\r\nIn the case of a creation this signifies that the object will be operational at this date.\r\nIn the case of modification this signifies that the changes will be operational at this date.\r\nIn the case of a deactivation this signifies that the deactivation will be effective at this date.",
                    "modelReference": "http://iec.ch/TC57/2013/CIM-schema-cim16#DateAndOrTime.date",
                    "type": "string",
                    "pattern": "^(-?([1-9][0-9]{3,}|0[0-9]{3})-(0[1-9]|1[0-2])-(0[1-9]|[12][0-9]|3[01])(Z|(\\+|-)((0[0-9]|1[0-3]):[0-5][0-9]|14:00))?)$"
                },
                "RegisteredResource": {
                    "description": "The identification of a resource associated with a TimeSeries.",
                    "modelReference": "http://iec.ch/TC57/2013/CIM-schema-cim16#TimeSeries.RegisteredResource",
                    "$ref": "#/definitions/RegisteredResource"
                },
                "Provider_MarketParticipant": {
                    "description": "The identification of the party that provides the information concerning the resource object defined in the time series.",
                    "modelReference": "http://iec.ch/TC57/2013/CIM-schema-cim16#MarketParticipant",
                    "type": "array",
                    "items": {
                        "$ref": "#/definitions/Provider_MarketParticipant"
                    },
                    "minItems": 1
                },
                "MktPSRType": {
                    "description": "The identification of the type of resource associated with a TimeSeries.",
                    "modelReference": "http://iec.ch/TC57/2013/CIM-schema-cim16#TimeSeries.MktPSRType",
                    "$ref": "#/definitions/MktPSRType"
                },
                "ControlArea_Domain": {
                    "description": "The domain where the resource object associated with a TimeSeries resides.",
                    "modelReference": "http://iec.ch/TC57/2013/CIM-schema-cim16#Domain",
                    "type": "array",
                    "items": {
                        "$ref": "#/definitions/ControlArea_Domain"
                    },
                    "minItems": 1
                }
            },
            "required": [
                "mRID",
                "businessType",
                "implementation_DateAndOrTime.date",
                "RegisteredResource",
                "Provider_MarketParticipant",
                "MktPSRType",
                "ControlArea_Domain"
            ]
        },
        "AnalogType_String": {
            "id": "#AnalogType_String",
            "title": "AnalogType_String",
            "description": "A code to identify the type of analog measurement.",
            "modelReference": "http://iec.ch/TC57/2013/CIM-schema-cim16#String",
            "type": "object",
            "additionalProperties": false,
            "properties": {
                "value": {
                    "description": "Main Core value Space.",
                    "$ref": "urn-entsoe-eu-wgedi-codelists.schema.json#/definitions/AnalogTypeList"
                }
            },
            "required": [
                "value"
            ]
        },
        "ESMP_Float": {
            "id": "#ESMP_Float",
            "title": "ESMP_Float",
            "description": "A floating point number. The range is unspecified and not limited.\r\nThe float value is expressed as a simple precision and no mantisse, i.e. as a decimal for XML.",
            "modelReference": "http://iec.ch/TC57/2013/CIM-schema-cim16#Float",
            "type": "object",
            "additionalProperties": false,
            "properties": {
                "value": {
                    "description": "The precision is simple and mantisse is not used.",
                    "type": "number",
                    "pattern": "^([0-9]*\\.?[0-9]*)$"
                }
            },
            "required": [
                "value"
            ]
        },
        "ID_String": {
            "id": "#ID_String",
            "title": "ID_String",
            "description": "A code to uniquely distinguish one occurrence of an entity from another.\r\n\r\nIn the ESMP context, the code is defined either by:\r\n- an emitting company that provides an agreed identification unique within a business context such as capacity auction identification, market agreement identification, etc.\r\n- a party (originator of the exchange) that provides a unique identification in the framework of a business exchange such as document identification, time series identification, bid identification, ...",
            "modelReference": "http://iec.ch/TC57/2013/CIM-schema-cim16#String",
            "type": "object",
            "additionalProperties": false,
            "properties": {
                "value": {
                    "description": "Main Core value Space.",
                    "type": "string",
                    "maxLength": 60
                }
            },
            "required": [
                "value"
            ]
        },
        "MessageKind_String": {
            "id": "#MessageKind_String",
            "title": "MessageKind_String",
            "description": "The coded type of a document.",
            "modelReference": "http://iec.ch/TC57/2013/CIM-schema-cim16#String",
            "type": "object",
            "additionalProperties": false,
            "properties": {
                "value": {
                    "description": "Main Core value Space.",
                    "$ref": "urn-entsoe-eu-wgedi-codelists.schema.json#/definitions/MessageTypeList"
                }
            },
            "required": [
                "value"
            ]
        },
        "ProcessKind_String": {
            "id": "#ProcessKind_String",
            "title": "ProcessKind_String",
            "description": "The coded identification of the nature of process.",
            "modelReference": "http://iec.ch/TC57/2013/CIM-schema-cim16#String",
            "type": "object",
            "additionalProperties": false,
            "properties": {
                "value": {
                    "description": "Main Core value Space.",
                    "$ref": "urn-entsoe-eu-wgedi-codelists.schema.json#/definitions/ProcessTypeList"
                }
            },
            "required": [
                "value"
            ]
        },
        "PartyID_String": {
            "id": "#PartyID_String",
            "title": "PartyID_String",
            "description": "The identification of an actor in the energy market.\r\n\r\nIn the ESMP context, it is an authorized issuing office that provides an agreed identification coding scheme for market participant identification.",
            "modelReference": "http://iec.ch/TC57/2013/CIM-schema-cim16#String",
            "type": "object",
            "additionalProperties": false,
            "properties": {
                "codingScheme": {
                    "description": "DomainQualification.",
                    "$ref": "urn-entsoe-eu-wgedi-codelists.schema.json#/definitions/CodingSchemeTypeList",
                    "modelReference": "http://iec.ch/TC57/2013/CIM-schema-cim16#String.codingScheme"
                },
                "value": {
                    "description": "Main Core value Space.",
                    "type": "string",
                    "maxLength": 16,
                    "modelReference": "http://iec.ch/TC57/2013/CIM-schema-cim16#String.value"
                }
            },
            "required": [
                "codingScheme",
                "value"
            ]
        },
        "MarketRoleKind_String": {
            "id": "#MarketRoleKind_String",
            "title": "MarketRoleKind_String",
            "description": "The identification of the role played by a party.",
            "modelReference": "http://iec.ch/TC57/2013/CIM-schema-cim16#String",
            "type": "object",
            "additionalProperties": false,
            "properties": {
                "value": {
                    "description": "Main Core value Space.",
                    "$ref": "urn-entsoe-eu-wgedi-codelists.schema.json#/definitions/RoleTypeList"
                }
            },
            "required": [
                "value"
            ]
        },
        "ESMP_DateTime": {
            "id": "#ESMP_DateTime",
            "title": "ESMP_DateTime",
            "description": "In ESMP, the dateTime shall be expressed in UTC as YYYY-MM-DDThh:mm:ssZ.",
            "modelReference": "http://iec.ch/TC57/2013/CIM-schema-cim16#DateTime",
            "type": "object",
            "additionalProperties": false,
            "properties": {
                "value": {
                    "description": "Main Core value Space.",
                    "type": "string",
                    "pattern": "^((([0-9]{4})[\\-](0[13578]|1[02])[\\-](0[1-9]|[12][0-9]|3[01])|([0-9]{4})[\\-]((0[469])|(11))[\\-](0[1-9]|[12][0-9]|30))T(([01][0-9]|2[0-3]):[0-5][0-9]:[0-5][0-9])Z)|(([13579][26][02468][048]|[13579][01345789](0)[48]|[13579][01345789][2468][048]|[02468][048][02468][048]|[02468][1235679](0)[48]|[02468][1235679][2468][048]|[0-9][0-9][13579][26])[\\-](02)[\\-](0[1-9]|1[0-9]|2[0-9])T(([01][0-9]|2[0-3]):[0-5][0-9]:[0-5][0-9])Z)|(([13579][26][02468][1235679]|[13579][01345789](0)[01235679]|[13579][01345789][2468][1235679]|[02468][048][02468][1235679]|[02468][1235679](0)[01235679]|[02468][1235679][2468][1235679]|[0-9][0-9][13579][01345789])[\\-](02)[\\-](0[1-9]|1[0-9]|2[0-8])T(([01][0-9]|2[0-3]):[0-5][0-9]:[0-5][0-9])Z)$"
                }
            },
            "required": [
                "value"
            ]
        },
        "AreaID_String": {
            "id": "#AreaID_String",
            "title": "AreaID_String",
            "description": "The coded identification of a domain, i.e. balance area, grid area, etc.\r\n\r\nIn the ESMP context, it is an authorized issuing office that provides an agreed identification coding scheme for domain identification.",
            "modelReference": "http://iec.ch/TC57/2013/CIM-schema-cim16#String",
            "type": "object",
            "additionalProperties": false,
            "properties": {
                "codingScheme": {
                    "description": "DomainQualification.",
                    "$ref": "urn-entsoe-eu-wgedi-codelists.schema.json#/definitions/CodingSchemeTypeList",
                    "modelReference": "http://iec.ch/TC57/2013/CIM-schema-cim16#String.codingScheme"
                },
                "value": {
                    "description": "Main Core value Space.",
                    "type": "string",
                    "maxLength": 18,
                    "modelReference": "http://iec.ch/TC57/2013/CIM-schema-cim16#String.value"
                }
            },
            "required": [
                "codingScheme",
                "value"
            ]
        },
        "ResourceID_String": {
            "id": "#ResourceID_String",
            "title": "ResourceID_String",
            "description": "The identification of a resource object in the energy market.\r\n\r\nIn the ESMP context, it is an authorized issuing office that provides an agreed identification coding scheme for resources (generator, lines, substations, etc.) identification.",
            "modelReference": "http://iec.ch/TC57/2013/CIM-schema-cim16#String",
            "type": "object",
            "additionalProperties": false,
            "properties": {
                "codingScheme": {
                    "description": "DomainQualification.",
                    "$ref": "urn-entsoe-eu-wgedi-codelists.schema.json#/definitions/CodingSchemeTypeList",
                    "modelReference": "http://iec.ch/TC57/2013/CIM-schema-cim16#String.codingScheme"
                },
                "value": {
                    "description": "Main Core value Space.",
                    "type": "string",
                    "maxLength": 60,
                    "modelReference": "http://iec.ch/TC57/2013/CIM-schema-cim16#String.value"
                }
            },
            "required": [
                "codingScheme",
                "value"
            ]
        },
        "ESMP_ActivePower": {
            "id": "#ESMP_ActivePower",
            "title": "ESMP_ActivePower",
            "description": "The coded identification of the nominal power value.",
            "modelReference": "http://iec.ch/TC57/2013/CIM-schema-cim16#ActivePower",
            "type": "object",
            "additionalProperties": false,
            "properties": {
                "value": {
                    "description": "Main core space value.\r\nThe value is given in decimal format.",
                    "type": "number",
                    "pattern": "^([0-9]*\\.?[0-9]*)$",
                    "modelReference": "http://iec.ch/TC57/2013/CIM-schema-cim16#ActivePower.value"
                },
                "unit": {
                    "description": "The unit of the value expressed using the UN/CEFACT recommendations 20.",
                    "$ref": "urn-entsoe-eu-wgedi-codelists.schema.json#/definitions/UnitSymbol",
                    "const": "MAW",
                    "modelReference": "http://iec.ch/TC57/2013/CIM-schema-cim16#ActivePower.unit"
                }
            },
            "required": [
                "value",
                "unit"
            ]
        },
        "PsrType_String": {
            "id": "#PsrType_String",
            "title": "PsrType_String",
            "description": "The coded type of a power system resource.",
            "modelReference": "http://iec.ch/TC57/2013/CIM-schema-cim16#String",
            "type": "object",
            "additionalProperties": false,
            "properties": {
                "value": {
                    "description": "Main Core value Space.",
                    "$ref": "urn-entsoe-eu-wgedi-codelists.schema.json#/definitions/AssetTypeList"
                }
            },
            "required": [
                "value"
            ]
        },
        "ESMP_Voltage": {
            "id": "#ESMP_Voltage",
            "title": "ESMP_Voltage",
            "description": "The coded identification of a voltage value.",
            "modelReference": "http://iec.ch/TC57/2013/CIM-schema-cim16#Voltage",
            "type": "object",
            "additionalProperties": false,
            "properties": {
                "value": {
                    "description": "Main Core value Space.\r\nThe value is expressed as a simple precision and no mantisse.",
                    "type": "number",
                    "pattern": "^([0-9]*\\.?[0-9]*)$",
                    "modelReference": "http://iec.ch/TC57/2013/CIM-schema-cim16#Voltage.value"
                },
                "unit": {
                    "description": "The unit of the value, the UN/CEFACT recommendation 20 is used as coding scheme of the unit.",
                    "$ref": "urn-entsoe-eu-wgedi-codelists.schema.json#/definitions/UnitSymbol",
                    "const": "KVT",
                    "modelReference": "http://iec.ch/TC57/2013/CIM-schema-cim16#Voltage.unit"
                }
            },
            "required": [
                "value",
                "unit"
            ]
        },
        "BusinessKind_String": {
            "id": "#BusinessKind_String",
            "title": "BusinessKind_String",
            "description": "The coded identification of the business type.",
            "modelReference": "http://iec.ch/TC57/2013/CIM-schema-cim16#String",
            "type": "object",
            "additionalProperties": false,
            "properties": {
                "value": {
                    "description": "Main Core value Space.",
                    "$ref": "urn-entsoe-eu-wgedi-codelists.schema.json#/definitions/BusinessTypeList"
                }
            },
            "required": [
                "value"
            ]
        }
    }
}