{
    "$schema": "https://json-schema.org/draft-04/schema#",
    "id": "urn:iec62325.351:tc57wg16:451-n:eicdocument:1:0",
    "definitions": {
        "ID_String": {
            "allOf": [
                {
                    "type": "string",
                    "maxLength": 35
                }
            ]
        },
        "ESMPVersion_String": {
            "allOf": [
                {
                    "type": "string",
                    "pattern": "[1-9]([0-9]){0,2}"
                }
            ]
        },
        "MessageTypeList": {
            "allOf": [
                {
                    "type": "string"
                },
                {
                    "enum": [
                        "A01",
                        "A02",
                        "A03",
                        "A04",
                        "A05",
                        "A06",
                        "A07",
                        "A08",
                        "A09",
                        "A10",
                        "A11",
                        "A12",
                        "A13",
                        "A14",
                        "A15",
                        "A16",
                        "A17",
                        "A18",
                        "A19",
                        "A20",
                        "A21",
                        "A22",
                        "A23",
                        "A24",
                        "A25",
                        "A26",
                        "A27",
                        "A28",
                        "A30",
                        "A31",
                        "A32",
                        "A33",
                        "A34",
                        "A35",
                        "A36",
                        "A37",
                        "A38",
                        "A39",
                        "A40",
                        "A41",
                        "A42",
                        "A43",
                        "A44",
                        "A45",
                        "A46",
                        "A47",
                        "A48",
                        "A49",
                        "A50",
                        "A51",
                        "A52",
                        "A53",
                        "A54",
                        "A55",
                        "A56",
                        "A57",
                        "A58",
                        "A59",
                        "A60",
                        "A61",
                        "A62",
                        "A63",
                        "A64",
                        "A65",
                        "A66",
                        "A67",
                        "A68",
                        "A69",
                        "A70",
                        "A71",
                        "A72",
                        "A73",
                        "A74",
                        "A75",
                        "A76",
                        "A77",
                        "A78",
                        "A79",
                        "A80",
                        "A81",
                        "A82",
                        "A83",
                        "A84",
                        "A85",
                        "A86",
                        "A87",
                        "A88",
                        "A89",
                        "A90",
                        "A91",
                        "A92",
                        "A93",
                        "A94",
                        "A95",
                        "A96",
                        "A97",
                        "A98",
                        "A99",
                        "B01",
                        "B02",
                        "B03",
                        "B04",
                        "B05",
                        "B06",
                        "B07",
                        "B08",
                        "B09",
                        "B10",
                        "B11",
                        "B12",
                        "B13",
                        "B14",
                        "B15",
                        "B16",
                        "B17",
                        "B18",
                        "B19",
                        "B20",
                        "B21",
                        "B22",
                        "B23",
                        "B24",
                        "B25",
                        "B26",
                        "B27",
                        "B28",
                        "B29",
                        "B30",
                        "B31",
                        "B32",
                        "B33",
                        "B34",
                        "B35",
                        "B36",
                        "B37",
                        "B38",
                        "B39",
                        "B40",
                        "B41",
                        "B42",
                        "B43",
                        "B44",
                        "B45",
                        "B46",
                        "B47",
                        "B48",
                        "A01"
                    ]
                }
            ]
        },
        "MessageKind_String": {
            "allOf": [
                {
                    "$ref": "#/definitions/MessageTypeList"
                }
            ]
        },
        "PartyID_String-base": {
            "allOf": [
                {
                    "type": "string",
                    "maxLength": 16
                }
            ]
        },
        "RoleTypeList": {
            "allOf": [
                {
                    "type": "string"
                },
                {
                    "enum": [
                        "A01",
                        "A02",
                        "A03",
                        "A04",
                        "A05",
                        "A06",
                        "A07",
                        "A08",
                        "A09",
                        "A10",
                        "A11",
                        "A12",
                        "A13",
                        "A14",
                        "A15",
                        "A16",
                        "A17",
                        "A18",
                        "A19",
                        "A20",
                        "A21",
                        "A22",
                        "A23",
                        "A24",
                        "A25",
                        "A26",
                        "A27",
                        "A28",
                        "A29",
                        "A30",
                        "A31",
                        "A32",
                        "A33",
                        "A34",
                        "A35",
                        "A36",
                        "A37",
                        "A38",
                        "A39",
                        "A40",
                        "A41",
                        "A42",
                        "A43",
                        "A44",
                        "A45",
                        "A46",
                        "A47",
                        "A48",
                        "A49",
                        "A50",
                        "A51",
                        "A52",
                        "A01"
                    ]
                }
            ]
        },
        "MarketRoleKind_String": {
            "allOf": [
                {
                    "$ref": "#/definitions/RoleTypeList"
                }
            ]
        },
        "ESMP_DateTime": {
            "allOf": [
                {
                    "type": "string",
                    "format": "date-time"
                }
            ]
        },
        "EICCode_String": {
            "allOf": [
                {
                    "type": "string",
                    "pattern": "([A-Z0-9]{2}(([A-Z0-9]|[-]){13})[A-Z0-9])"
                }
            ]
        },
        "Characters70_String": {
            "allOf": [
                {
                    "type": "string",
                    "maxLength": 70
                }
            ]
        },
        "Characters16_String": {
            "allOf": [
                {
                    "type": "string",
                    "maxLength": 16,
                    "pattern": "([A-Z\\-\\+_0-9]+)"
                }
            ]
        },
        "ACERCode_String": {
            "allOf": [
                {
                    "type": "string",
                    "pattern": "([A-Za-z0-9_]+\\.[A-Z][A-Z])"
                }
            ]
        },
        "VATCode_String": {
            "allOf": [
                {
                    "type": "string",
                    "maxLength": 14,
                    "pattern": "([A-Z0-9]+)"
                }
            ]
        },
        "Characters700_String": {
            "allOf": [
                {
                    "type": "string",
                    "maxLength": 700
                }
            ]
        },
        "StatusTypeList": {
            "allOf": [
                {
                    "type": "string"
                },
                {
                    "enum": [
                        "A01",
                        "A02",
                        "A03",
                        "A04",
                        "A05",
                        "A06",
                        "A07",
                        "A08",
                        "A09",
                        "A10",
                        "A11",
                        "A12",
                        "A13",
                        "A14",
                        "A15",
                        "A16",
                        "A17",
                        "A18",
                        "A19",
                        "A20",
                        "A21",
                        "A22",
                        "A23",
                        "A24",
                        "A25",
                        "A26",
                        "A27",
                        "A28",
                        "A29",
                        "A30",
                        "A31",
                        "A32",
                        "A33",
                        "A34",
                        "A35",
                        "A36",
                        "A37",
                        "A38",
                        "A39",
                        "A40",
                        "A41",
                        "A42",
                        "A43",
                        "A44",
                        "A45",
                        "A46",
                        "A47",
                        "A48",
                        "A49",
                        "A50",
                        "A51",
                        "A52",
                        "A53",
                        "A54",
                        "A55",
                        "A56",
                        "A57",
                        "A58",
                        "A59",
                        "A60",
                        "A61",
                        "A62",
                        "A63",
                        "A64",
                        "A65",
                        "A66",
                        "A67",
                        "A68",
                        "A69",
                        "A70",
                        "A71",
                        "A72",
                        "A01"
                    ]
                }
            ]
        },
        "Status_String": {
            "allOf": [
                {
                    "$ref": "#/definitions/StatusTypeList"
                }
            ]
        },
        "Characters10_String": {
            "allOf": [
                {
                    "type": "string",
                    "maxLength": 10
                }
            ]
        },
        "Characters35_String": {
            "allOf": [
                {
                    "type": "string",
                    "maxLength": 35
                }
            ]
        },
        "Characters2_String": {
            "allOf": [
                {
                    "type": "string",
                    "pattern": "[A-Z]*"
                }
            ]
        },
        "Characters15_String": {
            "allOf": [
                {
                    "type": "string",
                    "maxLength": 15
                }
            ]
        },
        "CodingSchemeTypeList": {
            "allOf": [
                {
                    "type": "string"
                },
                {
                    "enum": [
                        "A01",
                        "A02",
                        "A10",
                        "NAD",
                        "NAL",
                        "NAM",
                        "NAT",
                        "NAZ",
                        "NBA",
                        "NBE",
                        "NBG",
                        "NCH",
                        "NCS",
                        "NCY",
                        "NCZ",
                        "NDE",
                        "NDK",
                        "NEE",
                        "NES",
                        "NFI",
                        "NFR",
                        "NGB",
                        "NGE",
                        "NGI",
                        "NGR",
                        "NHR",
                        "NHU",
                        "NIE",
                        "NIT",
                        "NKG",
                        "NKZ",
                        "NLI",
                        "NLT",
                        "NLU",
                        "NLV",
                        "NMA",
                        "NMD",
                        "NMK",
                        "NNL",
                        "NNN",
                        "NNO",
                        "NPL",
                        "NPT",
                        "NRO",
                        "NRU",
                        "NSE",
                        "NSI",
                        "NSK",
                        "NTR",
                        "NUA",
                        "A01"
                    ]
                }
            ]
        },
        "PartyID_String": {
            "type": "object",
            "required": [
                "codingScheme"
            ],
            "properties": {
                "value": {
                    "$ref": "#/definitions/PartyID_String-base"
                },
                "codingScheme": {
                    "$ref": "#/definitions/CodingSchemeTypeList"
                }
            }
        },
        "EIC_MarketDocument": {
            "type": "object",
            "properties": {
                "mRID": {
                    "$ref": "#/definitions/ID_String"
                },
                "revisionNumber": {
                    "$ref": "#/definitions/ESMPVersion_String"
                },
                "type": {
                    "$ref": "#/definitions/MessageKind_String"
                },
                "sender_MarketParticipant.mRID": {
                    "$ref": "#/definitions/PartyID_String"
                },
                "sender_MarketParticipant.marketRole.type": {
                    "$ref": "#/definitions/MarketRoleKind_String"
                },
                "receiver_MarketParticipant.mRID": {
                    "$ref": "#/definitions/PartyID_String"
                },
                "receiver_MarketParticipant.marketRole.type": {
                    "$ref": "#/definitions/MarketRoleKind_String"
                },
                "createdDateTime": {
                    "$ref": "#/definitions/ESMP_DateTime"
                },
                "EICCode_MarketDocument": {
                    "type": "array",
                    "items": {
                        "$ref": "#/definitions/EICCode_MarketDocument"
                    }
                }
            },
            "required": [
                "mRID",
                "revisionNumber",
                "type",
                "createdDateTime"
            ]
        },
        "Action_Status": {
            "type": "object",
            "properties": {
                "value": {
                    "$ref": "#/definitions/Status_String"
                }
            },
            "required": [
                "value"
            ]
        },
        "StreetDetail": {
            "type": "object",
            "properties": {
                "addressGeneral": {
                    "$ref": "#/definitions/Characters70_String"
                },
                "addressGeneral2": {
                    "$ref": "#/definitions/Characters70_String"
                },
                "addressGeneral3": {
                    "$ref": "#/definitions/Characters70_String"
                }
            }
        },
        "TownDetail": {
            "type": "object",
            "properties": {
                "name": {
                    "$ref": "#/definitions/Characters35_String"
                },
                "country": {
                    "$ref": "#/definitions/Characters2_String"
                }
            }
        },
        "StreetAddress": {
            "type": "object",
            "properties": {
                "streetDetail": {
                    "$ref": "#/definitions/StreetDetail"
                },
                "postalCode": {
                    "$ref": "#/definitions/Characters10_String"
                },
                "townDetail": {
                    "$ref": "#/definitions/TownDetail"
                }
            }
        },
        "ElectronicAddress": {
            "type": "object",
            "properties": {
                "email1": {
                    "$ref": "#/definitions/Characters70_String"
                }
            },
            "required": [
                "email1"
            ]
        },
        "TelephoneNumber": {
            "type": "object",
            "properties": {
                "ituPhone": {
                    "$ref": "#/definitions/Characters15_String"
                }
            },
            "required": [
                "ituPhone"
            ]
        },
        "EICCode_MarketDocument": {
            "type": "object",
            "properties": {
                "mRID": {
                    "$ref": "#/definitions/EICCode_String"
                },
                "status": {
                    "$ref": "#/definitions/Action_Status"
                },
                "docStatus": {
                    "$ref": "#/definitions/Action_Status"
                },
                "attributeInstanceComponent.attribute": {
                    "type": "string"
                },
                "long_Names.name": {
                    "$ref": "#/definitions/Characters70_String"
                },
                "display_Names.name": {
                    "$ref": "#/definitions/Characters16_String"
                },
                "lastRequest_DateAndOrTime.date": {
                    "type": "string",
                    "format": "date"
                },
                "deactivationRequested_DateAndOrTime.date": {
                    "type": "string",
                    "format": "date"
                },
                "eICContact_MarketParticipant.name": {
                    "$ref": "#/definitions/Characters70_String"
                },
                "eICContact_MarketParticipant.phone1": {
                    "$ref": "#/definitions/TelephoneNumber"
                },
                "eICContact_MarketParticipant.electronicAddress": {
                    "$ref": "#/definitions/ElectronicAddress"
                },
                "eICCode_MarketParticipant.streetAddress": {
                    "$ref": "#/definitions/StreetAddress"
                },
                "eICCode_MarketParticipant.aCERCode_Names.name": {
                    "$ref": "#/definitions/ACERCode_String"
                },
                "eICCode_MarketParticipant.vATCode_Names.name": {
                    "$ref": "#/definitions/VATCode_String"
                },
                "eICParent_MarketDocument.mRID": {
                    "$ref": "#/definitions/EICCode_String"
                },
                "eICResponsible_MarketParticipant.mRID": {
                    "$ref": "#/definitions/EICCode_String"
                },
                "description": {
                    "$ref": "#/definitions/Characters700_String"
                },
                "Function_Names": {
                    "type": "array",
                    "items": {
                        "$ref": "#/definitions/Function_Name"
                    }
                }
            },
            "required": [
                "long_Names.name",
                "display_Names.name",
                "lastRequest_DateAndOrTime.date"
            ]
        },
        "Function_Name": {
            "type": "object",
            "properties": {
                "name": {
                    "$ref": "#/definitions/Characters70_String"
                }
            },
            "required": [
                "name"
            ]
        }
    },
    "anyOf": [
        {
            "type": "object",
            "properties": {
                "EIC_MarketDocument": {
                    "$ref": "#/definitions/EIC_MarketDocument"
                }
            }
        }
    ],
    "required": [
        "EIC_MarketDocument"
    ]
}