<!--
    Copyright © 2016-2017, RWTH Aachen University
    Authors: Richard Marston
    SPDX-License-Identifier: MPL-2.0
-->
<svg xmlns="http://www.w3.org/2000/svg">
    <circle
       r="7"
       cy="10"
       cx="13"
       id="leftcircle"
       style="fill-opacity:0;stroke:#000000;stroke-width:1" />
    <circle
       r="7"
       cy="14"
       cx="13"
       id="rightcircle"
       style="fill-opacity:0;stroke:#000000;stroke-width:1" />
</svg>
