<?xml version="1.0" encoding="UTF-8" standalone="no"?>
<!--
    Copyright © 2016-2017, RWTH Aachen University
    Authors: Richard Marston
    SPDX-License-Identifier: MPL-2.0
-->

<svg xmlns="http://www.w3.org/2000/svg" >
    <rect
     class="fillwhenstill"
     x="10.5"
     y="10.5"
     width="3"
     height="3"
     style="fill:#000000;fill-opacity:1;stroke:none;stroke-width:1"
     ry="1.4984024" />
</svg>
