# busID, UUID 
1,"d14fb540-33d5-11ea-b540-000000000000"
2,"d14fb808-33d5-11ea-b808-000000000000"
3,"d14fb8b3-33d5-11ea-b8b3-000000000000"
4,"d14fb951-33d5-11ea-b951-000000000000"
5,"d14fb9e8-33d5-11ea-b9e8-000000000000"
6,"d14fba53-33d5-11ea-ba53-000000000000"
7,"d14fbab7-33d5-11ea-bab7-000000000000"
8,"d14fbb46-33d5-11ea-bb46-000000000000"
9,"d14fbbd6-33d5-11ea-bbd6-000000000000"
10,"d14fbc92-33d5-11ea-bc92-000000000000"
11,"d14fbd09-33d5-11ea-bd09-000000000000"
12,"d14fbd74-33d5-11ea-bd74-000000000000"
13,"d14fbe04-33d5-11ea-be04-000000000000"
14,"d14fbe72-33d5-11ea-be72-000000000000"
15,"d14fbeda-33d5-11ea-beda-000000000000"
16,"d14fbf6a-33d5-11ea-bf6a-000000000000"
17,"d14fc005-33d5-11ea-8005-000000000000"
18,"d14fc071-33d5-11ea-8071-000000000000"
19,"d14fc0ff-33d5-11ea-80ff-000000000000"
20,"d14fc167-33d5-11ea-8167-000000000000"
21,"d14fc1f2-33d5-11ea-81f2-000000000000"
22,"d14fc29a-33d5-11ea-829a-000000000000"
23,"d14fc306-33d5-11ea-8306-000000000000"
24,"d14fc40d-33d5-11ea-840d-000000000000"
25,"d14fc4b2-33d5-11ea-84b2-000000000000"
26,"d14fc550-33d5-11ea-8550-000000000000"
27,"d14fc5e0-33d5-11ea-85e0-000000000000"
28,"d14fc66e-33d5-11ea-866e-000000000000"
29,"d14fc701-33d5-11ea-8701-000000000000"
30,"d14fc798-33d5-11ea-8798-000000000000"
31,"d14fc805-33d5-11ea-8805-000000000000"
32,"d14fc8d7-33d5-11ea-88d7-000000000000"
33,"d14fc94f-33d5-11ea-894f-000000000000"
34,"d14fc9b6-33d5-11ea-89b6-000000000000"
35,"d14fca20-33d5-11ea-8a20-000000000000"
36,"d14fca8a-33d5-11ea-8a8a-000000000000"
37,"d14fcaf1-33d5-11ea-8af1-000000000000"
38,"d14fcb56-33d5-11ea-8b56-000000000000"
39,"d14fcbbc-33d5-11ea-8bbc-000000000000"
