          time, 28e228b9-2709-11ea-a8b9-000000000000.V.im, 28e228b9-2709-11ea-a8b9-000000000000.V.re, 28e2333c-2709-11ea-b33c-000000000000.V.im, 28e2333c-2709-11ea-b33c-000000000000.V.re, 28e23772-2709-11ea-b772-000000000000.V.im, 28e23772-2709-11ea-b772-000000000000.V.re, 28e23ae0-2709-11ea-bae0-000000000000.V.im, 28e23ae0-2709-11ea-bae0-000000000000.V.re, 28e23de8-2709-11ea-bde8-000000000000.V.im, 28e23de8-2709-11ea-bde8-000000000000.V.re, 28e240d6-2709-11ea-80d6-000000000000.V.im, 28e240d6-2709-11ea-80d6-000000000000.V.re, 28e243b9-2709-11ea-83b9-000000000000.V.im, 28e243b9-2709-11ea-83b9-000000000000.V.re, 28e245ef-2709-11ea-85ef-000000000000.V.im, 28e245ef-2709-11ea-85ef-000000000000.V.re, 28e247ed-2709-11ea-87ed-000000000000.V.im, 28e247ed-2709-11ea-87ed-000000000000.V.re, 28e24d85-2709-11ea-8d85-000000000000.V.im, 28e24d85-2709-11ea-8d85-000000000000.V.re, 28e25119-2709-11ea-9119-000000000000.V.im, 28e25119-2709-11ea-9119-000000000000.V.re, 28e25493-2709-11ea-9493-000000000000.V.im, 28e25493-2709-11ea-9493-000000000000.V.re, 28e257f3-2709-11ea-97f3-000000000000.V.im, 28e257f3-2709-11ea-97f3-000000000000.V.re, 28e25b1a-2709-11ea-9b1a-000000000000.V.im, 28e25b1a-2709-11ea-9b1a-000000000000.V.re
  0.000000e+00,      0.000000,  73140.000000,  -6264.737980,  71832.333131, -15360.321851,  67976.147380, -12596.433495,  69094.843722, -10732.955743,  69569.732355,  -3778.204199,  14274.450218,  -3461.207902,  14242.857021,  -3552.031222,  14616.594617,  -3849.917051,  14066.323057,  -3880.422318,  13985.706652,  -3849.372702,  14074.477434,  -3931.401738,  14021.237203,  -3929.717316,  13954.905582,  -4058.284078,  13710.287449

