/home/achim/acs/dataprocessing/examples/sampledata/case118results.mat
/home/achim/acs/dataprocessing/examples/sampledata/case118.csv
/home/achim/acs/dataprocessing/examples/sampledata/case118mapping_busID_uuid.csv
************************ reading mpc power flow data start ****************
6a1768c3-33d5-11ea-a8c3-000000000000.V.V is [ 131.79]
6a176b92-33d5-11ea-ab92-000000000000.V.V is [ 134.05220564]
6a176c5b-33d5-11ea-ac5b-000000000000.V.V is [ 133.54148833]
6a176cf6-33d5-11ea-acf6-000000000000.V.V is [ 137.724]
6a176d93-33d5-11ea-ad93-000000000000.V.V is [ 138.27387989]
6a176f0c-33d5-11ea-af0c-000000000000.V.V is [ 136.62]
6a176fad-33d5-11ea-afad-000000000000.V.V is [ 136.52724851]
6a17704b-33d5-11ea-b04b-000000000000.V.V is [ 350.175]
6a1770df-33d5-11ea-b0df-000000000000.V.V is [ 359.80678076]
6a17715e-33d5-11ea-b15e-000000000000.V.V is [ 362.25]
6a1771cb-33d5-11ea-b1cb-000000000000.V.V is [ 135.9422196]
6a17725c-33d5-11ea-b25c-000000000000.V.V is [ 136.62]
6a1772ee-33d5-11ea-b2ee-000000000000.V.V is [ 133.62568088]
6a177381-33d5-11ea-b381-000000000000.V.V is [ 135.73556128]
6a177417-33d5-11ea-b417-000000000000.V.V is [ 133.86]
6a1774b2-33d5-11ea-b4b2-000000000000.V.V is [ 135.77783628]
6a177548-33d5-11ea-b548-000000000000.V.V is [ 137.32221741]
6a1775e4-33d5-11ea-b5e4-000000000000.V.V is [ 134.274]
6a177856-33d5-11ea-b856-000000000000.V.V is [ 132.756]
6a17790f-33d5-11ea-b90f-000000000000.V.V is [ 132.05693521]
6a1779a8-33d5-11ea-b9a8-000000000000.V.V is [ 132.16603549]
6a177a3c-33d5-11ea-ba3c-000000000000.V.V is [ 133.72463263]
6a177ad4-33d5-11ea-bad4-000000000000.V.V is [ 137.92676652]
6a177b68-33d5-11ea-bb68-000000000000.V.V is [ 136.896]
6a177bf6-33d5-11ea-bbf6-000000000000.V.V is [ 144.9]
6a177c61-33d5-11ea-bc61-000000000000.V.V is [ 350.175]
6a177cc6-33d5-11ea-bcc6-000000000000.V.V is [ 133.584]
6a177d59-33d5-11ea-bd59-000000000000.V.V is [ 132.69639824]
6a177df0-33d5-11ea-bdf0-000000000000.V.V is [ 132.92385401]
6a177e84-33d5-11ea-be84-000000000000.V.V is [ 339.93975101]
6a177ef3-33d5-11ea-bef3-000000000000.V.V is [ 133.446]
6a177f85-33d5-11ea-bf85-000000000000.V.V is [ 132.894]
6a17801a-33d5-11ea-801a-000000000000.V.V is [ 133.98891145]
6a1780ab-33d5-11ea-80ab-000000000000.V.V is [ 135.792]
6a17815e-33d5-11ea-815e-000000000000.V.V is [ 135.30243945]
6a1781fb-33d5-11ea-81fb-000000000000.V.V is [ 135.24]
6a17828f-33d5-11ea-828f-000000000000.V.V is [ 136.71126664]
6a17831f-33d5-11ea-831f-000000000000.V.V is [ 331.64357806]
6a17838a-33d5-11ea-838a-000000000000.V.V is [ 133.85462948]
6a17841c-33d5-11ea-841c-000000000000.V.V is [ 133.86]
6a1784ad-33d5-11ea-84ad-000000000000.V.V is [ 133.42288076]
6a17853e-33d5-11ea-853e-000000000000.V.V is [ 135.93]
6a1785cf-33d5-11ea-85cf-000000000000.V.V is [ 134.84276257]
6a17865d-33d5-11ea-865d-000000000000.V.V is [ 135.85217104]
6a17870e-33d5-11ea-870e-000000000000.V.V is [ 136.12079359]
6a1787c8-33d5-11ea-87c8-000000000000.V.V is [ 138.69]
6a17887c-33d5-11ea-887c-000000000000.V.V is [ 140.35315008]
6a178910-33d5-11ea-8910-000000000000.V.V is [ 140.84740583]
6a1789bd-33d5-11ea-89bd-000000000000.V.V is [ 141.45]
6a178a4c-33d5-11ea-8a4c-000000000000.V.V is [ 138.14942089]
6a178adc-33d5-11ea-8adc-000000000000.V.V is [ 133.42898363]
6a178b6b-33d5-11ea-8b6b-000000000000.V.V is [ 132.04088253]
6a178c02-33d5-11ea-8c02-000000000000.V.V is [ 130.54564021]
6a178c93-33d5-11ea-8c93-000000000000.V.V is [ 131.79]
6a178d24-33d5-11ea-8d24-000000000000.V.V is [ 131.376]
6a178db6-33d5-11ea-8db6-000000000000.V.V is [ 131.652]
6a178e4a-33d5-11ea-8e4a-000000000000.V.V is [ 133.94038905]
6a178ed8-33d5-11ea-8ed8-000000000000.V.V is [ 132.34733668]
6a178f72-33d5-11ea-8f72-000000000000.V.V is [ 135.93]
6a179010-33d5-11ea-9010-000000000000.V.V is [ 137.05556262]
6a1790a4-33d5-11ea-90a4-000000000000.V.V is [ 137.31]
6a179115-33d5-11ea-9115-000000000000.V.V is [ 137.724]
6a1791a0-33d5-11ea-91a0-000000000000.V.V is [ 334.2142696]
6a179208-33d5-11ea-9208-000000000000.V.V is [ 339.38981631]
6a17926b-33d5-11ea-926b-000000000000.V.V is [ 346.725]
6a1792d1-33d5-11ea-92d1-000000000000.V.V is [ 144.9]
6a179360-33d5-11ea-9360-000000000000.V.V is [ 140.71608285]
6a1793fa-33d5-11ea-93fa-000000000000.V.V is [ 346.12105004]
6a17946a-33d5-11ea-946a-000000000000.V.V is [ 142.83]
6a179519-33d5-11ea-9519-000000000000.V.V is [ 135.792]
6a1795a9-33d5-11ea-95a9-000000000000.V.V is [ 136.18454468]
6a179616-33d5-11ea-9616-000000000000.V.V is [ 135.24]
6a1796a1-33d5-11ea-96a1-000000000000.V.V is [ 136.758]
6a17972e-33d5-11ea-972e-000000000000.V.V is [ 132.204]
6a1797e5-33d5-11ea-97e5-000000000000.V.V is [ 133.49180014]
6a179875-33d5-11ea-9875-000000000000.V.V is [ 130.134]
6a179903-33d5-11ea-9903-000000000000.V.V is [ 138.828]
6a179991-33d5-11ea-9991-000000000000.V.V is [ 138.47247306]
6a179a1f-33d5-11ea-9a1f-000000000000.V.V is [ 139.27278356]
6a179ace-33d5-11ea-9ace-000000000000.V.V is [ 143.52]
6a179b5e-33d5-11ea-9b5e-000000000000.V.V is [ 343.89829083]
6a179bc6-33d5-11ea-9bc6-000000000000.V.V is [ 136.41924442]
6a179c71-33d5-11ea-9c71-000000000000.V.V is [ 135.84403571]
6a179d29-33d5-11ea-9d29-000000000000.V.V is [ 135.19913287]
6a179dbf-33d5-11ea-9dbf-000000000000.V.V is [ 135.93]
6a179e4c-33d5-11ea-9e4c-000000000000.V.V is [ 136.163323]
6a179eda-33d5-11ea-9eda-000000000000.V.V is [ 163.415]
6a179f43-33d5-11ea-9f43-000000000000.V.V is [ 136.26855563]
6a179fcf-33d5-11ea-9fcf-000000000000.V.V is [ 138.69]
6a17a037-33d5-11ea-a037-000000000000.V.V is [ 135.93]
6a17a0c8-33d5-11ea-a0c8-000000000000.V.V is [ 135.24]
6a17a15d-33d5-11ea-a15d-000000000000.V.V is [ 136.62]
6a17a1f3-33d5-11ea-a1f3-000000000000.V.V is [ 135.98977699]
6a17a28a-33d5-11ea-a28a-000000000000.V.V is [ 136.59660594]
6a17a321-33d5-11ea-a321-000000000000.V.V is [ 135.28579848]
6a17a3b6-33d5-11ea-a3b6-000000000000.V.V is [ 136.93500604]
6a17a448-33d5-11ea-a448-000000000000.V.V is [ 139.54093132]
6a17a581-33d5-11ea-a581-000000000000.V.V is [ 141.24418683]
6a17a62e-33d5-11ea-a62e-000000000000.V.V is [ 139.38]
6a17a6ca-33d5-11ea-a6ca-000000000000.V.V is [ 140.346]
6a17a75b-33d5-11ea-a75b-000000000000.V.V is [ 136.81590663]
6a17a7ef-33d5-11ea-a7ef-000000000000.V.V is [ 136.50005253]
6a17a87e-33d5-11ea-a87e-000000000000.V.V is [ 139.38]
6a17a90a-33d5-11ea-a90a-000000000000.V.V is [ 133.998]
6a17a999-33d5-11ea-a999-000000000000.V.V is [ 133.17]
6a17aa4c-33d5-11ea-aa4c-000000000000.V.V is [ 132.63819182]
6a17aae6-33d5-11ea-aae6-000000000000.V.V is [ 131.376]
6a17ab9d-33d5-11ea-ab9d-000000000000.V.V is [ 133.337222]
6a17ac2f-33d5-11ea-ac2f-000000000000.V.V is [ 133.44952279]
6a17acc0-33d5-11ea-acc0-000000000000.V.V is [ 134.274]
6a17ad72-33d5-11ea-ad72-000000000000.V.V is [ 135.24]
6a17adde-33d5-11ea-adde-000000000000.V.V is [ 134.55]
6a17ae6a-33d5-11ea-ae6a-000000000000.V.V is [ 137.034]
6a17aefd-33d5-11ea-aefd-000000000000.V.V is [ 132.49284379]
6a17af8b-33d5-11ea-af8b-000000000000.V.V is [ 132.4831552]
6a17b01f-33d5-11ea-b01f-000000000000.V.V is [ 138.69]
6a17b0b0-33d5-11ea-b0b0-000000000000.V.V is [ 134.38777366]
6a17b140-33d5-11ea-b140-000000000000.V.V is [ 131.02237942]
************************ reading mpc power flow data end ****************


************************ reading dpsim power flow data start ****************
column number: 118
results length: 1
real column names: []
complex column names: ['6a1768c3-33d5-11ea-a8c3-000000000000.V', '6a176b92-33d5-11ea-ab92-000000000000.V', '6a176c5b-33d5-11ea-ac5b-000000000000.V', '6a176cf6-33d5-11ea-acf6-000000000000.V', '6a176d93-33d5-11ea-ad93-000000000000.V', '6a176f0c-33d5-11ea-af0c-000000000000.V', '6a176fad-33d5-11ea-afad-000000000000.V', '6a17704b-33d5-11ea-b04b-000000000000.V', '6a1770df-33d5-11ea-b0df-000000000000.V', '6a17715e-33d5-11ea-b15e-000000000000.V', '6a1771cb-33d5-11ea-b1cb-000000000000.V', '6a17725c-33d5-11ea-b25c-000000000000.V', '6a1772ee-33d5-11ea-b2ee-000000000000.V', '6a177381-33d5-11ea-b381-000000000000.V', '6a177417-33d5-11ea-b417-000000000000.V', '6a1774b2-33d5-11ea-b4b2-000000000000.V', '6a177548-33d5-11ea-b548-000000000000.V', '6a1775e4-33d5-11ea-b5e4-000000000000.V', '6a177856-33d5-11ea-b856-000000000000.V', '6a17790f-33d5-11ea-b90f-000000000000.V', '6a1779a8-33d5-11ea-b9a8-000000000000.V', '6a177a3c-33d5-11ea-ba3c-000000000000.V', '6a177ad4-33d5-11ea-bad4-000000000000.V', '6a177b68-33d5-11ea-bb68-000000000000.V', '6a177bf6-33d5-11ea-bbf6-000000000000.V', '6a177c61-33d5-11ea-bc61-000000000000.V', '6a177cc6-33d5-11ea-bcc6-000000000000.V', '6a177d59-33d5-11ea-bd59-000000000000.V', '6a177df0-33d5-11ea-bdf0-000000000000.V', '6a177e84-33d5-11ea-be84-000000000000.V', '6a177ef3-33d5-11ea-bef3-000000000000.V', '6a177f85-33d5-11ea-bf85-000000000000.V', '6a17801a-33d5-11ea-801a-000000000000.V', '6a1780ab-33d5-11ea-80ab-000000000000.V', '6a17815e-33d5-11ea-815e-000000000000.V', '6a1781fb-33d5-11ea-81fb-000000000000.V', '6a17828f-33d5-11ea-828f-000000000000.V', '6a17831f-33d5-11ea-831f-000000000000.V', '6a17838a-33d5-11ea-838a-000000000000.V', '6a17841c-33d5-11ea-841c-000000000000.V', '6a1784ad-33d5-11ea-84ad-000000000000.V', '6a17853e-33d5-11ea-853e-000000000000.V', '6a1785cf-33d5-11ea-85cf-000000000000.V', '6a17865d-33d5-11ea-865d-000000000000.V', '6a17870e-33d5-11ea-870e-000000000000.V', '6a1787c8-33d5-11ea-87c8-000000000000.V', '6a17887c-33d5-11ea-887c-000000000000.V', '6a178910-33d5-11ea-8910-000000000000.V', '6a1789bd-33d5-11ea-89bd-000000000000.V', '6a178a4c-33d5-11ea-8a4c-000000000000.V', '6a178adc-33d5-11ea-8adc-000000000000.V', '6a178b6b-33d5-11ea-8b6b-000000000000.V', '6a178c02-33d5-11ea-8c02-000000000000.V', '6a178c93-33d5-11ea-8c93-000000000000.V', '6a178d24-33d5-11ea-8d24-000000000000.V', '6a178db6-33d5-11ea-8db6-000000000000.V', '6a178e4a-33d5-11ea-8e4a-000000000000.V', '6a178ed8-33d5-11ea-8ed8-000000000000.V', '6a178f72-33d5-11ea-8f72-000000000000.V', '6a179010-33d5-11ea-9010-000000000000.V', '6a1790a4-33d5-11ea-90a4-000000000000.V', '6a179115-33d5-11ea-9115-000000000000.V', '6a1791a0-33d5-11ea-91a0-000000000000.V', '6a179208-33d5-11ea-9208-000000000000.V', '6a17926b-33d5-11ea-926b-000000000000.V', '6a1792d1-33d5-11ea-92d1-000000000000.V', '6a179360-33d5-11ea-9360-000000000000.V', '6a1793fa-33d5-11ea-93fa-000000000000.V', '6a17946a-33d5-11ea-946a-000000000000.V', '6a179519-33d5-11ea-9519-000000000000.V', '6a1795a9-33d5-11ea-95a9-000000000000.V', '6a179616-33d5-11ea-9616-000000000000.V', '6a1796a1-33d5-11ea-96a1-000000000000.V', '6a17972e-33d5-11ea-972e-000000000000.V', '6a1797e5-33d5-11ea-97e5-000000000000.V', '6a179875-33d5-11ea-9875-000000000000.V', '6a179903-33d5-11ea-9903-000000000000.V', '6a179991-33d5-11ea-9991-000000000000.V', '6a179a1f-33d5-11ea-9a1f-000000000000.V', '6a179ace-33d5-11ea-9ace-000000000000.V', '6a179b5e-33d5-11ea-9b5e-000000000000.V', '6a179bc6-33d5-11ea-9bc6-000000000000.V', '6a179c71-33d5-11ea-9c71-000000000000.V', '6a179d29-33d5-11ea-9d29-000000000000.V', '6a179dbf-33d5-11ea-9dbf-000000000000.V', '6a179e4c-33d5-11ea-9e4c-000000000000.V', '6a179eda-33d5-11ea-9eda-000000000000.V', '6a179f43-33d5-11ea-9f43-000000000000.V', '6a179fcf-33d5-11ea-9fcf-000000000000.V', '6a17a037-33d5-11ea-a037-000000000000.V', '6a17a0c8-33d5-11ea-a0c8-000000000000.V', '6a17a15d-33d5-11ea-a15d-000000000000.V', '6a17a1f3-33d5-11ea-a1f3-000000000000.V', '6a17a28a-33d5-11ea-a28a-000000000000.V', '6a17a321-33d5-11ea-a321-000000000000.V', '6a17a3b6-33d5-11ea-a3b6-000000000000.V', '6a17a448-33d5-11ea-a448-000000000000.V', '6a17a581-33d5-11ea-a581-000000000000.V', '6a17a62e-33d5-11ea-a62e-000000000000.V', '6a17a6ca-33d5-11ea-a6ca-000000000000.V', '6a17a75b-33d5-11ea-a75b-000000000000.V', '6a17a7ef-33d5-11ea-a7ef-000000000000.V', '6a17a87e-33d5-11ea-a87e-000000000000.V', '6a17a90a-33d5-11ea-a90a-000000000000.V', '6a17a999-33d5-11ea-a999-000000000000.V', '6a17aa4c-33d5-11ea-aa4c-000000000000.V', '6a17aae6-33d5-11ea-aae6-000000000000.V', '6a17ab9d-33d5-11ea-ab9d-000000000000.V', '6a17ac2f-33d5-11ea-ac2f-000000000000.V', '6a17acc0-33d5-11ea-acc0-000000000000.V', '6a17ad72-33d5-11ea-ad72-000000000000.V', '6a17adde-33d5-11ea-adde-000000000000.V', '6a17ae6a-33d5-11ea-ae6a-000000000000.V', '6a17aefd-33d5-11ea-aefd-000000000000.V', '6a17af8b-33d5-11ea-af8b-000000000000.V', '6a17b01f-33d5-11ea-b01f-000000000000.V', '6a17b0b0-33d5-11ea-b0b0-000000000000.V', '6a17b140-33d5-11ea-b140-000000000000.V']
6a1768c3-33d5-11ea-a8c3-000000000000.V_abs: [ 131789.99999972]
6a1768c3-33d5-11ea-a8c3-000000000000.V_phase :[-19.31253762]
6a176b92-33d5-11ea-ab92-000000000000.V_abs: [ 134052.38784895]
6a176b92-33d5-11ea-ab92-000000000000.V_phase :[-18.78048265]
6a176c5b-33d5-11ea-ac5b-000000000000.V_abs: [ 133535.73896816]
6a176c5b-33d5-11ea-ac5b-000000000000.V_phase :[-18.42499446]
6a176cf6-33d5-11ea-acf6-000000000000.V_abs: [ 137724.00000044]
6a176cf6-33d5-11ea-acf6-000000000000.V_phase :[-14.69135871]
6a176d93-33d5-11ea-ad93-000000000000.V_abs: [ 138250.12586892]
6a176d93-33d5-11ea-ad93-000000000000.V_phase :[-14.24125269]
6a176f0c-33d5-11ea-af0c-000000000000.V_abs: [ 136619.99999994]
6a176f0c-33d5-11ea-af0c-000000000000.V_phase :[-16.98831859]
6a176fad-33d5-11ea-afad-000000000000.V_abs: [ 136527.41438941]
6a176fad-33d5-11ea-afad-000000000000.V_phase :[-17.43944618]
6a17704b-33d5-11ea-b04b-000000000000.V_abs: [ 350175.00000012]
6a17704b-33d5-11ea-b04b-000000000000.V_phase :[-9.0335936]
6a1770df-33d5-11ea-b0df-000000000000.V_abs: [ 359806.78076232]
6a1770df-33d5-11ea-b0df-000000000000.V_phase :[-1.77948853]
6a17715e-33d5-11ea-b15e-000000000000.V_abs: [ 362249.99999983]
6a17715e-33d5-11ea-b15e-000000000000.V_phase :[ 5.80142062]
6a1771cb-33d5-11ea-b1cb-000000000000.V_abs: [ 135936.34533759]
6a1771cb-33d5-11ea-b1cb-000000000000.V_phase :[-17.28391547]
6a17725c-33d5-11ea-b25c-000000000000.V_abs: [ 136619.99999998]
6a17725c-33d5-11ea-b25c-000000000000.V_phase :[-17.80873105]
6a1772ee-33d5-11ea-b2ee-000000000000.V_abs: [ 133619.61901411]
6a1772ee-33d5-11ea-b2ee-000000000000.V_phase :[-18.68820995]
6a177381-33d5-11ea-b381-000000000000.V_abs: [ 135734.61255188]
6a177381-33d5-11ea-b381-000000000000.V_phase :[-18.5565318]
6a177417-33d5-11ea-b417-000000000000.V_abs: [ 133860.0000001]
6a177417-33d5-11ea-b417-000000000000.V_phase :[-18.9392801]
6a1774b2-33d5-11ea-b4b2-000000000000.V_abs: [ 135764.35779124]
6a1774b2-33d5-11ea-b4b2-000000000000.V_phase :[-18.14407576]
6a177548-33d5-11ea-b548-000000000000.V_abs: [ 137276.11010143]
6a177548-33d5-11ea-b548-000000000000.V_phase :[-16.40795801]
6a1775e4-33d5-11ea-b5e4-000000000000.V_abs: [ 134274.00000031]
6a1775e4-33d5-11ea-b5e4-000000000000.V_phase :[-18.63410513]
6a177856-33d5-11ea-b856-000000000000.V_abs: [ 132756.0000001]
6a177856-33d5-11ea-b856-000000000000.V_phase :[-19.10642182]
6a17790f-33d5-11ea-b90f-000000000000.V_abs: [ 132042.26907052]
6a17790f-33d5-11ea-b90f-000000000000.V_phase :[-18.18667285]
6a1779a8-33d5-11ea-b9a8-000000000000.V_abs: [ 132144.06367774]
6a1779a8-33d5-11ea-b9a8-000000000000.V_phase :[-16.56768347]
6a177a3c-33d5-11ea-ba3c-000000000000.V_abs: [ 133700.76311867]
6a177a3c-33d5-11ea-ba3c-000000000000.V_phase :[-13.97752189]
6a177ad4-33d5-11ea-bad4-000000000000.V_abs: [ 137918.16238055]
6a177ad4-33d5-11ea-bad4-000000000000.V_phase :[-9.00318138]
6a177b68-33d5-11ea-bb68-000000000000.V_abs: [ 136896.00000034]
6a177b68-33d5-11ea-bb68-000000000000.V_phase :[-9.1024152]
6a177bf6-33d5-11ea-bbf6-000000000000.V_abs: [ 144899.99999963]
6a177bf6-33d5-11ea-bbf6-000000000000.V_phase :[-2.06263131]
6a177c61-33d5-11ea-bc61-000000000000.V_abs: [ 350174.99999954]
6a177c61-33d5-11ea-bc61-000000000000.V_phase :[-0.11226972]
6a177cc6-33d5-11ea-bcc6-000000000000.V_abs: [ 133584.0000005]
6a177cc6-33d5-11ea-bcc6-000000000000.V_phase :[-14.69730769]
6a177d59-33d5-11ea-bd59-000000000000.V_abs: [ 132696.2398731]
6a177d59-33d5-11ea-bd59-000000000000.V_phase :[-16.43792485]
6a177df0-33d5-11ea-bdf0-000000000000.V_abs: [ 132924.36406622]
6a177df0-33d5-11ea-bdf0-000000000000.V_phase :[-17.44815706]
6a177e84-33d5-11ea-be84-000000000000.V_abs: [ 340473.68721524]
6a177e84-33d5-11ea-be84-000000000000.V_phase :[-10.98625427]
6a177ef3-33d5-11ea-bef3-000000000000.V_abs: [ 133446.00000024]
6a177ef3-33d5-11ea-bef3-000000000000.V_phase :[-17.33765385]
6a177f85-33d5-11ea-bf85-000000000000.V_abs: [ 132893.99999963]
6a177f85-33d5-11ea-bf85-000000000000.V_phase :[-15.25115599]
6a17801a-33d5-11ea-801a-000000000000.V_abs: [ 133951.68993796]
6a17801a-33d5-11ea-801a-000000000000.V_phase :[-19.6438996]
6a1780ab-33d5-11ea-80ab-000000000000.V_abs: [ 135791.99999976]
6a1780ab-33d5-11ea-80ab-000000000000.V_phase :[-19.07820587]
6a17815e-33d5-11ea-815e-000000000000.V_abs: [ 135289.24649557]
6a17815e-33d5-11ea-815e-000000000000.V_phase :[-19.53721979]
6a1781fb-33d5-11ea-81fb-000000000000.V_abs: [ 135240.00000008]
6a1781fb-33d5-11ea-81fb-000000000000.V_phase :[-19.53695688]
6a17828f-33d5-11ea-828f-000000000000.V_abs: [ 136633.93862107]
6a17828f-33d5-11ea-828f-000000000000.V_phase :[-18.62398358]
6a17831f-33d5-11ea-831f-000000000000.V_abs: [ 332764.54262603]
6a17831f-33d5-11ea-831f-000000000000.V_phase :[-12.87330337]
6a17838a-33d5-11ea-838a-000000000000.V_abs: [ 133829.31298079]
6a17838a-33d5-11ea-838a-000000000000.V_phase :[-21.96975555]
6a17841c-33d5-11ea-841c-000000000000.V_abs: [ 133860.00000011]
6a17841c-33d5-11ea-841c-000000000000.V_phase :[-23.02377792]
6a1784ad-33d5-11ea-84ad-000000000000.V_abs: [ 133421.77117908]
6a1784ad-33d5-11ea-84ad-000000000000.V_phase :[-23.44355377]
6a17853e-33d5-11ea-853e-000000000000.V_abs: [ 135929.99999997]
6a17853e-33d5-11ea-853e-000000000000.V_phase :[-21.77604407]
6a1785cf-33d5-11ea-85cf-000000000000.V_abs: [ 134824.6440318]
6a1785cf-33d5-11ea-85cf-000000000000.V_phase :[-19.03866593]
6a17865d-33d5-11ea-865d-000000000000.V_abs: [ 135822.95942677]
6a17865d-33d5-11ea-865d-000000000000.V_phase :[-16.42247171]
6a17870e-33d5-11ea-870e-000000000000.V_abs: [ 136097.15123417]
6a17870e-33d5-11ea-870e-000000000000.V_phase :[-14.54438826]
6a1787c8-33d5-11ea-87c8-000000000000.V_abs: [ 138689.99999958]
6a1787c8-33d5-11ea-87c8-000000000000.V_phase :[-11.70129341]
6a17887c-33d5-11ea-887c-000000000000.V_abs: [ 140339.56621048]
6a17887c-33d5-11ea-887c-000000000000.V_phase :[-9.4388665]
6a178910-33d5-11ea-8910-000000000000.V_abs: [ 140847.26204689]
6a178910-33d5-11ea-8910-000000000000.V_phase :[-10.25487391]
6a1789bd-33d5-11ea-89bd-000000000000.V_abs: [ 141450.00000049]
6a1789bd-33d5-11ea-89bd-000000000000.V_phase :[-9.25079789]
6a178a4c-33d5-11ea-8a4c-000000000000.V_abs: [ 138147.23913297]
6a178a4c-33d5-11ea-8a4c-000000000000.V_phase :[-11.30019929]
6a178adc-33d5-11ea-8adc-000000000000.V_abs: [ 133425.07590182]
6a178adc-33d5-11ea-8adc-000000000000.V_phase :[-13.93235235]
6a178b6b-33d5-11ea-8b6b-000000000000.V_abs: [ 132036.70107521]
6a178b6b-33d5-11ea-8b6b-000000000000.V_phase :[-14.88921495]
6a178c02-33d5-11ea-8c02-000000000000.V_abs: [ 130543.52926924]
6a178c02-33d5-11ea-8c02-000000000000.V_phase :[-15.87355081]
6a178c93-33d5-11ea-8c93-000000000000.V_abs: [ 131789.99999969]
6a178c93-33d5-11ea-8c93-000000000000.V_phase :[-14.96872243]
6a178d24-33d5-11ea-8d24-000000000000.V_abs: [ 131375.99999948]
6a178d24-33d5-11ea-8d24-000000000000.V_phase :[-15.2619119]
6a178db6-33d5-11ea-8db6-000000000000.V_abs: [ 131651.99999972]
6a178db6-33d5-11ea-8db6-000000000000.V_phase :[-15.07336099]
6a178e4a-33d5-11ea-8e4a-000000000000.V_abs: [ 133938.16046557]
6a178e4a-33d5-11ea-8e4a-000000000000.V_phase :[-13.85387612]
6a178ed8-33d5-11ea-8ed8-000000000000.V_abs: [ 132344.84859421]
6a178ed8-33d5-11ea-8ed8-000000000000.V_phase :[-14.71325544]
6a178f72-33d5-11ea-8f72-000000000000.V_abs: [ 135929.99999989]
6a178f72-33d5-11ea-8f72-000000000000.V_phase :[-10.90708884]
6a179010-33d5-11ea-9010-000000000000.V_abs: [ 137054.50809703]
6a179010-33d5-11ea-9010-000000000000.V_phase :[-7.02231894]
6a1790a4-33d5-11ea-90a4-000000000000.V_abs: [ 137310.00000035]
6a1790a4-33d5-11ea-90a4-000000000000.V_phase :[-6.12263614]
6a179115-33d5-11ea-9115-000000000000.V_abs: [ 137723.99999994]
6a179115-33d5-11ea-9115-000000000000.V_phase :[-6.74287441]
6a1791a0-33d5-11ea-91a0-000000000000.V_abs: [ 334557.8763791]
6a1791a0-33d5-11ea-91a0-000000000000.V_phase :[-7.32384703]
6a179208-33d5-11ea-9208-000000000000.V_abs: [ 339542.29712238]
6a179208-33d5-11ea-9208-000000000000.V_phase :[-5.5976788]
6a17926b-33d5-11ea-926b-000000000000.V_abs: [ 346724.99999994]
6a17926b-33d5-11ea-926b-000000000000.V_phase :[-2.48636638]
6a1792d1-33d5-11ea-92d1-000000000000.V_abs: [ 144900.00000024]
6a1792d1-33d5-11ea-92d1-000000000000.V_phase :[-2.69000125]
6a179360-33d5-11ea-9360-000000000000.V_abs: [ 140716.12538534]
6a179360-33d5-11ea-9360-000000000000.V_phase :[-5.32927421]
6a1793fa-33d5-11ea-93fa-000000000000.V_abs: [ 346275.77889366]
6a1793fa-33d5-11ea-93fa-000000000000.V_phase :[-2.64110891]
6a17946a-33d5-11ea-946a-000000000000.V_abs: [ 142830.]
6a17946a-33d5-11ea-946a-000000000000.V_phase :[ 0.]
6a179519-33d5-11ea-9519-000000000000.V_abs: [ 135791.99999948]
6a179519-33d5-11ea-9519-000000000000.V_phase :[-7.4488299]
6a1795a9-33d5-11ea-95a9-000000000000.V_abs: [ 136184.11611781]
6a1795a9-33d5-11ea-95a9-000000000000.V_phase :[-7.87279715]
6a179616-33d5-11ea-9616-000000000000.V_abs: [ 135239.99999969]
6a179616-33d5-11ea-9616-000000000000.V_phase :[-9.03688671]
6a1796a1-33d5-11ea-96a1-000000000000.V_abs: [ 136758.00000038]
6a1796a1-33d5-11ea-96a1-000000000000.V_phase :[-8.08432555]
6a17972e-33d5-11ea-972e-000000000000.V_abs: [ 132203.9999996]
6a17972e-33d5-11ea-972e-000000000000.V_phase :[-8.38436936]
6a1797e5-33d5-11ea-97e5-000000000000.V_abs: [ 133489.12938102]
6a1797e5-33d5-11ea-97e5-000000000000.V_phase :[-7.11802473]
6a179875-33d5-11ea-9875-000000000000.V_abs: [ 130133.99999977]
6a179875-33d5-11ea-9875-000000000000.V_phase :[-8.25713981]
6a179903-33d5-11ea-9903-000000000000.V_abs: [ 138827.99999953]
6a179903-33d5-11ea-9903-000000000000.V_phase :[-3.31562814]
6a179991-33d5-11ea-9991-000000000000.V_abs: [ 138472.2717089]
6a179991-33d5-11ea-9991-000000000000.V_phase :[-3.62182633]
6a179a1f-33d5-11ea-9a1f-000000000000.V_abs: [ 139272.95246074]
6a179a1f-33d5-11ea-9a1f-000000000000.V_phase :[-3.32718164]
6a179ace-33d5-11ea-9ace-000000000000.V_abs: [ 143519.99999985]
6a179ace-33d5-11ea-9ace-000000000000.V_phase :[-1.09418922]
6a179b5e-33d5-11ea-9b5e-000000000000.V_abs: [ 344557.87927516]
6a179b5e-33d5-11ea-9b5e-000000000000.V_phase :[-2.08717685]
6a179bc6-33d5-11ea-9bc6-000000000000.V_abs: [ 136419.04166356]
6a179bc6-33d5-11ea-9bc6-000000000000.V_phase :[-2.80283325]
6a179c71-33d5-11ea-9c71-000000000000.V_abs: [ 135844.05858473]
6a179c71-33d5-11ea-9c71-000000000000.V_phase :[-1.61131209]
6a179d29-33d5-11ea-9d29-000000000000.V_abs: [ 135199.20040683]
6a179d29-33d5-11ea-9d29-000000000000.V_phase :[ 0.92394189]
6a179dbf-33d5-11ea-9dbf-000000000000.V_abs: [ 135929.99999986]
6a179dbf-33d5-11ea-9dbf-000000000000.V_phase :[ 2.47871688]
6a179e4c-33d5-11ea-9e4c-000000000000.V_abs: [ 158581.60212222]
6a179e4c-33d5-11ea-9e4c-000000000000.V_phase :[ 1.134858]
6a179eda-33d5-11ea-9eda-000000000000.V_abs: [ 140070.00000026]
6a179eda-33d5-11ea-9eda-000000000000.V_phase :[ 1.38086719]
6a179f43-33d5-11ea-9f43-000000000000.V_abs: [ 136268.66106173]
6a179f43-33d5-11ea-9f43-000000000000.V_phase :[ 5.61258876]
6a179fcf-33d5-11ea-9fcf-000000000000.V_abs: [ 138689.99999972]
6a179fcf-33d5-11ea-9fcf-000000000000.V_phase :[ 9.66999238]
6a17a037-33d5-11ea-a037-000000000000.V_abs: [ 135930.00000031]
6a17a037-33d5-11ea-a037-000000000000.V_phase :[ 3.25988689]
6a17a0c8-33d5-11ea-a0c8-000000000000.V_abs: [ 135240.00000015]
6a17a0c8-33d5-11ea-a0c8-000000000000.V_phase :[ 3.27197955]
6a17a15d-33d5-11ea-a15d-000000000000.V_abs: [ 136619.99999996]
6a17a15d-33d5-11ea-a15d-000000000000.V_phase :[ 3.80188169]
6a17a1f3-33d5-11ea-a1f3-000000000000.V_abs: [ 135989.65818465]
6a17a1f3-33d5-11ea-a1f3-000000000000.V_phase :[ 0.76993601]
6a17a28a-33d5-11ea-a28a-000000000000.V_abs: [ 136596.43067572]
6a17a28a-33d5-11ea-a28a-000000000000.V_phase :[-1.3971649]
6a17a321-33d5-11ea-a321-000000000000.V_abs: [ 135285.54065456]
6a17a321-33d5-11ea-a321-000000000000.V_phase :[-2.36953915]
6a17a3b6-33d5-11ea-a3b6-000000000000.V_abs: [ 136934.64050044]
6a17a3b6-33d5-11ea-a3b6-000000000000.V_phase :[-2.53616044]
6a17a448-33d5-11ea-a448-000000000000.V_abs: [ 139540.82942339]
6a17a448-33d5-11ea-a448-000000000000.V_phase :[-2.16564926]
6a17a581-33d5-11ea-a581-000000000000.V_abs: [ 141244.22006003]
6a17a581-33d5-11ea-a581-000000000000.V_phase :[-2.6494971]
6a17a62e-33d5-11ea-a62e-000000000000.V_abs: [ 139380.00000016]
6a17a62e-33d5-11ea-a62e-000000000000.V_phase :[-3.01477816]
6a17a6ca-33d5-11ea-a6ca-000000000000.V_abs: [ 140345.99999976]
6a17a6ca-33d5-11ea-a6ca-000000000000.V_phase :[-2.02161218]
6a17a75b-33d5-11ea-a75b-000000000000.V_abs: [ 136815.81417727]
6a17a75b-33d5-11ea-a75b-000000000000.V_phase :[-0.43292436]
6a17a7ef-33d5-11ea-a7ef-000000000000.V_abs: [ 136499.98663319]
6a17a7ef-33d5-11ea-a7ef-000000000000.V_phase :[ 2.28577285]
6a17a87e-33d5-11ea-a87e-000000000000.V_abs: [ 139380.00000022]
6a17a87e-33d5-11ea-a87e-000000000000.V_phase :[-5.76270208]
6a17a90a-33d5-11ea-a90a-000000000000.V_abs: [ 133997.99999952]
6a17a90a-33d5-11ea-a90a-000000000000.V_phase :[-8.33268716]
6a17a999-33d5-11ea-a999-000000000000.V_abs: [ 133169.99999962]
6a17a999-33d5-11ea-a999-000000000000.V_phase :[-9.43688889]
6a17aa4c-33d5-11ea-aa4c-000000000000.V_abs: [ 132638.1918191]
6a17aa4c-33d5-11ea-aa4c-000000000000.V_phase :[-9.69704982]
6a17aae6-33d5-11ea-aae6-000000000000.V_abs: [ 131376.00000014]
6a17aae6-33d5-11ea-aae6-000000000000.V_phase :[-12.49778639]
6a17ab9d-33d5-11ea-ab9d-000000000000.V_abs: [ 133337.22199479]
6a17ab9d-33d5-11ea-ab9d-000000000000.V_phase :[-10.63696962]
6a17ac2f-33d5-11ea-ac2f-000000000000.V_abs: [ 133449.52279297]
6a17ac2f-33d5-11ea-ac2f-000000000000.V_phase :[-11.08956781]
6a17acc0-33d5-11ea-acc0-000000000000.V_abs: [ 134274.00000045]
6a17acc0-33d5-11ea-acc0-000000000000.V_phase :[-11.93642731]
6a17ad72-33d5-11ea-ad72-000000000000.V_abs: [ 135240.00000021]
6a17ad72-33d5-11ea-ad72-000000000000.V_phase :[-10.29134641]
6a17adde-33d5-11ea-adde-000000000000.V_abs: [ 134549.99999965]
6a17adde-33d5-11ea-adde-000000000000.V_phase :[-15.03564488]
6a17ae6a-33d5-11ea-ae6a-000000000000.V_abs: [ 137033.9999998]
6a17ae6a-33d5-11ea-ae6a-000000000000.V_phase :[-16.40429428]
6a17aefd-33d5-11ea-aefd-000000000000.V_abs: [ 132492.79655614]
6a17aefd-33d5-11ea-aefd-000000000000.V_phase :[-15.58115946]
6a17af8b-33d5-11ea-af8b-000000000000.V_abs: [ 132483.09097239]
6a17af8b-33d5-11ea-af8b-000000000000.V_phase :[-15.5887184]
6a17b01f-33d5-11ea-b01f-000000000000.V_abs: [ 138690.00000043]
6a17b01f-33d5-11ea-b01f-000000000000.V_phase :[-3.07378515]
6a17b0b0-33d5-11ea-b0b0-000000000000.V_abs: [ 134387.773659]
6a17b0b0-33d5-11ea-b0b0-000000000000.V_phase :[-19.34973141]
6a17b140-33d5-11ea-b140-000000000000.V_abs: [ 131020.86349434]
6a17b140-33d5-11ea-b140-000000000000.V_phase :[-8.10994571]
************************ reading dpsim power flow data end ****************
************************ convert mpc to standard start  ****************
6a1768c3-33d5-11ea-a8c3-000000000000.V.V
[ 131790.]
6a176b92-33d5-11ea-ab92-000000000000.V.V
[ 134052.20564334]
6a176c5b-33d5-11ea-ac5b-000000000000.V.V
[ 133541.48833388]
6a176cf6-33d5-11ea-acf6-000000000000.V.V
[ 137724.]
6a176d93-33d5-11ea-ad93-000000000000.V.V
[ 138273.87989265]
6a176f0c-33d5-11ea-af0c-000000000000.V.V
[ 136620.]
6a176fad-33d5-11ea-afad-000000000000.V.V
[ 136527.24850782]
6a17704b-33d5-11ea-b04b-000000000000.V.V
[ 350175.]
6a1770df-33d5-11ea-b0df-000000000000.V.V
[ 359806.78076402]
6a17715e-33d5-11ea-b15e-000000000000.V.V
[ 362250.]
6a1771cb-33d5-11ea-b1cb-000000000000.V.V
[ 135942.21960173]
6a17725c-33d5-11ea-b25c-000000000000.V.V
[ 136620.]
6a1772ee-33d5-11ea-b2ee-000000000000.V.V
[ 133625.68087503]
6a177381-33d5-11ea-b381-000000000000.V.V
[ 135735.56127923]
6a177417-33d5-11ea-b417-000000000000.V.V
[ 133860.]
6a1774b2-33d5-11ea-b4b2-000000000000.V.V
[ 135777.83628148]
6a177548-33d5-11ea-b548-000000000000.V.V
[ 137322.2174106]
6a1775e4-33d5-11ea-b5e4-000000000000.V.V
[ 134274.]
6a177856-33d5-11ea-b856-000000000000.V.V
[ 132756.]
6a17790f-33d5-11ea-b90f-000000000000.V.V
[ 132056.93520778]
6a1779a8-33d5-11ea-b9a8-000000000000.V.V
[ 132166.03549311]
6a177a3c-33d5-11ea-ba3c-000000000000.V.V
[ 133724.63262578]
6a177ad4-33d5-11ea-bad4-000000000000.V.V
[ 137926.76652403]
6a177b68-33d5-11ea-bb68-000000000000.V.V
[ 136896.]
6a177bf6-33d5-11ea-bbf6-000000000000.V.V
[ 144900.]
6a177c61-33d5-11ea-bc61-000000000000.V.V
[ 350175.]
6a177cc6-33d5-11ea-bcc6-000000000000.V.V
[ 133584.]
6a177d59-33d5-11ea-bd59-000000000000.V.V
[ 132696.39824253]
6a177df0-33d5-11ea-bdf0-000000000000.V.V
[ 132923.85401466]
6a177e84-33d5-11ea-be84-000000000000.V.V
[ 339939.75100732]
6a177ef3-33d5-11ea-bef3-000000000000.V.V
[ 133446.]
6a177f85-33d5-11ea-bf85-000000000000.V.V
[ 132894.]
6a17801a-33d5-11ea-801a-000000000000.V.V
[ 133988.91145307]
6a1780ab-33d5-11ea-80ab-000000000000.V.V
[ 135792.]
6a17815e-33d5-11ea-815e-000000000000.V.V
[ 135302.4394461]
6a1781fb-33d5-11ea-81fb-000000000000.V.V
[ 135240.]
6a17828f-33d5-11ea-828f-000000000000.V.V
[ 136711.26663559]
6a17831f-33d5-11ea-831f-000000000000.V.V
[ 331643.57805952]
6a17838a-33d5-11ea-838a-000000000000.V.V
[ 133854.62948489]
6a17841c-33d5-11ea-841c-000000000000.V.V
[ 133860.]
6a1784ad-33d5-11ea-84ad-000000000000.V.V
[ 133422.88075975]
6a17853e-33d5-11ea-853e-000000000000.V.V
[ 135930.]
6a1785cf-33d5-11ea-85cf-000000000000.V.V
[ 134842.76257107]
6a17865d-33d5-11ea-865d-000000000000.V.V
[ 135852.17104356]
6a17870e-33d5-11ea-870e-000000000000.V.V
[ 136120.79358527]
6a1787c8-33d5-11ea-87c8-000000000000.V.V
[ 138690.]
6a17887c-33d5-11ea-887c-000000000000.V.V
[ 140353.15007644]
6a178910-33d5-11ea-8910-000000000000.V.V
[ 140847.40583294]
6a1789bd-33d5-11ea-89bd-000000000000.V.V
[ 141450.]
6a178a4c-33d5-11ea-8a4c-000000000000.V.V
[ 138149.42089388]
6a178adc-33d5-11ea-8adc-000000000000.V.V
[ 133428.983629]
6a178b6b-33d5-11ea-8b6b-000000000000.V.V
[ 132040.88253051]
6a178c02-33d5-11ea-8c02-000000000000.V.V
[ 130545.64021452]
6a178c93-33d5-11ea-8c93-000000000000.V.V
[ 131790.]
6a178d24-33d5-11ea-8d24-000000000000.V.V
[ 131376.]
6a178db6-33d5-11ea-8db6-000000000000.V.V
[ 131652.]
6a178e4a-33d5-11ea-8e4a-000000000000.V.V
[ 133940.38905482]
6a178ed8-33d5-11ea-8ed8-000000000000.V.V
[ 132347.33667698]
6a178f72-33d5-11ea-8f72-000000000000.V.V
[ 135930.]
6a179010-33d5-11ea-9010-000000000000.V.V
[ 137055.5626172]
6a1790a4-33d5-11ea-90a4-000000000000.V.V
[ 137310.]
6a179115-33d5-11ea-9115-000000000000.V.V
[ 137724.]
6a1791a0-33d5-11ea-91a0-000000000000.V.V
[ 334214.26959857]
6a179208-33d5-11ea-9208-000000000000.V.V
[ 339389.81630821]
6a17926b-33d5-11ea-926b-000000000000.V.V
[ 346725.]
6a1792d1-33d5-11ea-92d1-000000000000.V.V
[ 144900.]
6a179360-33d5-11ea-9360-000000000000.V.V
[ 140716.0828533]
6a1793fa-33d5-11ea-93fa-000000000000.V.V
[ 346121.05003557]
6a17946a-33d5-11ea-946a-000000000000.V.V
[ 142830.]
6a179519-33d5-11ea-9519-000000000000.V.V
[ 135792.]
6a1795a9-33d5-11ea-95a9-000000000000.V.V
[ 136184.54467827]
6a179616-33d5-11ea-9616-000000000000.V.V
[ 135240.]
6a1796a1-33d5-11ea-96a1-000000000000.V.V
[ 136758.]
6a17972e-33d5-11ea-972e-000000000000.V.V
[ 132204.]
6a1797e5-33d5-11ea-97e5-000000000000.V.V
[ 133491.80013639]
6a179875-33d5-11ea-9875-000000000000.V.V
[ 130134.]
6a179903-33d5-11ea-9903-000000000000.V.V
[ 138828.]
6a179991-33d5-11ea-9991-000000000000.V.V
[ 138472.4730581]
6a179a1f-33d5-11ea-9a1f-000000000000.V.V
[ 139272.78356434]
6a179ace-33d5-11ea-9ace-000000000000.V.V
[ 143520.]
6a179b5e-33d5-11ea-9b5e-000000000000.V.V
[ 343898.29083367]
6a179bc6-33d5-11ea-9bc6-000000000000.V.V
[ 136419.24442069]
6a179c71-33d5-11ea-9c71-000000000000.V.V
[ 135844.03570645]
6a179d29-33d5-11ea-9d29-000000000000.V.V
[ 135199.13286604]
6a179dbf-33d5-11ea-9dbf-000000000000.V.V
[ 135930.]
6a179e4c-33d5-11ea-9e4c-000000000000.V.V
[ 136163.32300112]
6a179eda-33d5-11ea-9eda-000000000000.V.V
[ 163415.]
6a179f43-33d5-11ea-9f43-000000000000.V.V
[ 136268.55563431]
6a179fcf-33d5-11ea-9fcf-000000000000.V.V
[ 138690.]
6a17a037-33d5-11ea-a037-000000000000.V.V
[ 135930.]
6a17a0c8-33d5-11ea-a0c8-000000000000.V.V
[ 135240.]
6a17a15d-33d5-11ea-a15d-000000000000.V.V
[ 136620.]
6a17a1f3-33d5-11ea-a1f3-000000000000.V.V
[ 135989.77699458]
6a17a28a-33d5-11ea-a28a-000000000000.V.V
[ 136596.60594275]
6a17a321-33d5-11ea-a321-000000000000.V.V
[ 135285.79847936]
6a17a3b6-33d5-11ea-a3b6-000000000000.V.V
[ 136935.00603724]
6a17a448-33d5-11ea-a448-000000000000.V.V
[ 139540.93131894]
6a17a581-33d5-11ea-a581-000000000000.V.V
[ 141244.18683416]
6a17a62e-33d5-11ea-a62e-000000000000.V.V
[ 139380.]
6a17a6ca-33d5-11ea-a6ca-000000000000.V.V
[ 140346.]
6a17a75b-33d5-11ea-a75b-000000000000.V.V
[ 136815.90662602]
6a17a7ef-33d5-11ea-a7ef-000000000000.V.V
[ 136500.05252516]
6a17a87e-33d5-11ea-a87e-000000000000.V.V
[ 139380.]
6a17a90a-33d5-11ea-a90a-000000000000.V.V
[ 133998.]
6a17a999-33d5-11ea-a999-000000000000.V.V
[ 133170.]
6a17aa4c-33d5-11ea-aa4c-000000000000.V.V
[ 132638.19181967]
6a17aae6-33d5-11ea-aae6-000000000000.V.V
[ 131376.]
6a17ab9d-33d5-11ea-ab9d-000000000000.V.V
[ 133337.22199667]
6a17ac2f-33d5-11ea-ac2f-000000000000.V.V
[ 133449.52279435]
6a17acc0-33d5-11ea-acc0-000000000000.V.V
[ 134274.]
6a17ad72-33d5-11ea-ad72-000000000000.V.V
[ 135240.]
6a17adde-33d5-11ea-adde-000000000000.V.V
[ 134550.]
6a17ae6a-33d5-11ea-ae6a-000000000000.V.V
[ 137034.]
6a17aefd-33d5-11ea-aefd-000000000000.V.V
[ 132492.84378963]
6a17af8b-33d5-11ea-af8b-000000000000.V.V
[ 132483.15520165]
6a17b01f-33d5-11ea-b01f-000000000000.V.V
[ 138690.]
6a17b0b0-33d5-11ea-b0b0-000000000000.V.V
[ 134387.77365967]
6a17b140-33d5-11ea-b140-000000000000.V.V
[ 131022.37942323]
************************ convert mpc to standard end  ****************
************************ convert dpsim to standard start  ****************
6a1768c3-33d5-11ea-a8c3-000000000000.V.V
[ 131789.99999972]
6a1768c3-33d5-11ea-a8c3-000000000000.V.Vangle
[-0.33706737]
6a176b92-33d5-11ea-ab92-000000000000.V.V
[ 134052.38784895]
6a176b92-33d5-11ea-ab92-000000000000.V.Vangle
[-0.32778126]
6a176c5b-33d5-11ea-ac5b-000000000000.V.V
[ 133535.73896816]
6a176c5b-33d5-11ea-ac5b-000000000000.V.Vangle
[-0.32157682]
6a176cf6-33d5-11ea-acf6-000000000000.V.V
[ 137724.00000044]
6a176cf6-33d5-11ea-acf6-000000000000.V.Vangle
[-0.25641258]
6a176d93-33d5-11ea-ad93-000000000000.V.V
[ 138250.12586892]
6a176d93-33d5-11ea-ad93-000000000000.V.Vangle
[-0.24855675]
6a176f0c-33d5-11ea-af0c-000000000000.V.V
[ 136619.99999994]
6a176f0c-33d5-11ea-af0c-000000000000.V.Vangle
[-0.29650209]
6a176fad-33d5-11ea-afad-000000000000.V.V
[ 136527.41438941]
6a176fad-33d5-11ea-afad-000000000000.V.Vangle
[-0.30437576]
6a17704b-33d5-11ea-b04b-000000000000.V.V
[ 350175.00000012]
6a17704b-33d5-11ea-b04b-000000000000.V.Vangle
[-0.15766595]
6a1770df-33d5-11ea-b0df-000000000000.V.V
[ 359806.78076232]
6a1770df-33d5-11ea-b0df-000000000000.V.Vangle
[-0.03105793]
6a17715e-33d5-11ea-b15e-000000000000.V.V
[ 362249.99999983]
6a17715e-33d5-11ea-b15e-000000000000.V.Vangle
[ 0.10125389]
6a1771cb-33d5-11ea-b1cb-000000000000.V.V
[ 135936.34533759]
6a1771cb-33d5-11ea-b1cb-000000000000.V.Vangle
[-0.30166123]
6a17725c-33d5-11ea-b25c-000000000000.V.V
[ 136619.99999998]
6a17725c-33d5-11ea-b25c-000000000000.V.Vangle
[-0.31082099]
6a1772ee-33d5-11ea-b2ee-000000000000.V.V
[ 133619.61901411]
6a1772ee-33d5-11ea-b2ee-000000000000.V.Vangle
[-0.32617079]
6a177381-33d5-11ea-b381-000000000000.V.V
[ 135734.61255188]
6a177381-33d5-11ea-b381-000000000000.V.Vangle
[-0.32387258]
6a177417-33d5-11ea-b417-000000000000.V.V
[ 133860.0000001]
6a177417-33d5-11ea-b417-000000000000.V.Vangle
[-0.3305528]
6a1774b2-33d5-11ea-b4b2-000000000000.V.V
[ 135764.35779124]
6a1774b2-33d5-11ea-b4b2-000000000000.V.Vangle
[-0.31667386]
6a177548-33d5-11ea-b548-000000000000.V.V
[ 137276.11010143]
6a177548-33d5-11ea-b548-000000000000.V.Vangle
[-0.28637289]
6a1775e4-33d5-11ea-b5e4-000000000000.V.V
[ 134274.00000031]
6a1775e4-33d5-11ea-b5e4-000000000000.V.Vangle
[-0.32522649]
6a177856-33d5-11ea-b856-000000000000.V.V
[ 132756.0000001]
6a177856-33d5-11ea-b856-000000000000.V.Vangle
[-0.33346997]
6a17790f-33d5-11ea-b90f-000000000000.V.V
[ 132042.26907052]
6a17790f-33d5-11ea-b90f-000000000000.V.Vangle
[-0.31741732]
6a1779a8-33d5-11ea-b9a8-000000000000.V.V
[ 132144.06367774]
6a1779a8-33d5-11ea-b9a8-000000000000.V.Vangle
[-0.28916063]
6a177a3c-33d5-11ea-ba3c-000000000000.V.V
[ 133700.76311867]
6a177a3c-33d5-11ea-ba3c-000000000000.V.Vangle
[-0.24395378]
6a177ad4-33d5-11ea-bad4-000000000000.V.V
[ 137918.16238055]
6a177ad4-33d5-11ea-bad4-000000000000.V.Vangle
[-0.15713516]
6a177b68-33d5-11ea-bb68-000000000000.V.V
[ 136896.00000034]
6a177b68-33d5-11ea-bb68-000000000000.V.Vangle
[-0.15886712]
6a177bf6-33d5-11ea-bbf6-000000000000.V.V
[ 144899.99999963]
6a177bf6-33d5-11ea-bbf6-000000000000.V.Vangle
[-0.03599971]
6a177c61-33d5-11ea-bc61-000000000000.V.V
[ 350174.99999954]
6a177c61-33d5-11ea-bc61-000000000000.V.Vangle
[-0.00195948]
6a177cc6-33d5-11ea-bcc6-000000000000.V.V
[ 133584.0000005]
6a177cc6-33d5-11ea-bcc6-000000000000.V.Vangle
[-0.25651641]
6a177d59-33d5-11ea-bd59-000000000000.V.V
[ 132696.2398731]
6a177d59-33d5-11ea-bd59-000000000000.V.Vangle
[-0.28689591]
6a177df0-33d5-11ea-bdf0-000000000000.V.V
[ 132924.36406622]
6a177df0-33d5-11ea-bdf0-000000000000.V.Vangle
[-0.30452779]
6a177e84-33d5-11ea-be84-000000000000.V.V
[ 340473.68721524]
6a177e84-33d5-11ea-be84-000000000000.V.Vangle
[-0.19174631]
6a177ef3-33d5-11ea-bef3-000000000000.V.V
[ 133446.00000024]
6a177ef3-33d5-11ea-bef3-000000000000.V.Vangle
[-0.30259914]
6a177f85-33d5-11ea-bf85-000000000000.V.V
[ 132893.99999963]
6a177f85-33d5-11ea-bf85-000000000000.V.Vangle
[-0.26618289]
6a17801a-33d5-11ea-801a-000000000000.V.V
[ 133951.68993796]
6a17801a-33d5-11ea-801a-000000000000.V.Vangle
[-0.34285073]
6a1780ab-33d5-11ea-80ab-000000000000.V.V
[ 135791.99999976]
6a1780ab-33d5-11ea-80ab-000000000000.V.Vangle
[-0.33297751]
6a17815e-33d5-11ea-815e-000000000000.V.V
[ 135289.24649557]
6a17815e-33d5-11ea-815e-000000000000.V.Vangle
[-0.34098881]
6a1781fb-33d5-11ea-81fb-000000000000.V.V
[ 135240.00000008]
6a1781fb-33d5-11ea-81fb-000000000000.V.Vangle
[-0.34098422]
6a17828f-33d5-11ea-828f-000000000000.V.V
[ 136633.93862107]
6a17828f-33d5-11ea-828f-000000000000.V.Vangle
[-0.32504983]
6a17831f-33d5-11ea-831f-000000000000.V.V
[ 332764.54262603]
6a17831f-33d5-11ea-831f-000000000000.V.Vangle
[-0.22468153]
6a17838a-33d5-11ea-838a-000000000000.V.V
[ 133829.31298079]
6a17838a-33d5-11ea-838a-000000000000.V.Vangle
[-0.38344457]
6a17841c-33d5-11ea-841c-000000000000.V.V
[ 133860.00000011]
6a17841c-33d5-11ea-841c-000000000000.V.Vangle
[-0.40184073]
6a1784ad-33d5-11ea-84ad-000000000000.V.V
[ 133421.77117908]
6a1784ad-33d5-11ea-84ad-000000000000.V.Vangle
[-0.4091672]
6a17853e-33d5-11ea-853e-000000000000.V.V
[ 135929.99999997]
6a17853e-33d5-11ea-853e-000000000000.V.Vangle
[-0.38006367]
6a1785cf-33d5-11ea-85cf-000000000000.V.V
[ 134824.6440318]
6a1785cf-33d5-11ea-85cf-000000000000.V.Vangle
[-0.33228741]
6a17865d-33d5-11ea-865d-000000000000.V.V
[ 135822.95942677]
6a17865d-33d5-11ea-865d-000000000000.V.Vangle
[-0.2866262]
6a17870e-33d5-11ea-870e-000000000000.V.V
[ 136097.15123417]
6a17870e-33d5-11ea-870e-000000000000.V.Vangle
[-0.25384746]
6a1787c8-33d5-11ea-87c8-000000000000.V.V
[ 138689.99999958]
6a1787c8-33d5-11ea-87c8-000000000000.V.Vangle
[-0.2042261]
6a17887c-33d5-11ea-887c-000000000000.V.V
[ 140339.56621048]
6a17887c-33d5-11ea-887c-000000000000.V.Vangle
[-0.1647393]
6a178910-33d5-11ea-8910-000000000000.V.V
[ 140847.26204689]
6a178910-33d5-11ea-8910-000000000000.V.Vangle
[-0.17898131]
6a1789bd-33d5-11ea-89bd-000000000000.V.V
[ 141450.00000049]
6a1789bd-33d5-11ea-89bd-000000000000.V.Vangle
[-0.16145688]
6a178a4c-33d5-11ea-8a4c-000000000000.V.V
[ 138147.23913297]
6a178a4c-33d5-11ea-8a4c-000000000000.V.Vangle
[-0.19722568]
6a178adc-33d5-11ea-8adc-000000000000.V.V
[ 133425.07590182]
6a178adc-33d5-11ea-8adc-000000000000.V.Vangle
[-0.24316542]
6a178b6b-33d5-11ea-8b6b-000000000000.V.V
[ 132036.70107521]
6a178b6b-33d5-11ea-8b6b-000000000000.V.Vangle
[-0.25986582]
6a178c02-33d5-11ea-8c02-000000000000.V.V
[ 130543.52926924]
6a178c02-33d5-11ea-8c02-000000000000.V.Vangle
[-0.27704573]
6a178c93-33d5-11ea-8c93-000000000000.V.V
[ 131789.99999969]
6a178c93-33d5-11ea-8c93-000000000000.V.Vangle
[-0.26125349]
6a178d24-33d5-11ea-8d24-000000000000.V.V
[ 131375.99999948]
6a178d24-33d5-11ea-8d24-000000000000.V.Vangle
[-0.26637061]
6a178db6-33d5-11ea-8db6-000000000000.V.V
[ 131651.99999972]
6a178db6-33d5-11ea-8db6-000000000000.V.Vangle
[-0.26307978]
6a178e4a-33d5-11ea-8e4a-000000000000.V.V
[ 133938.16046557]
6a178e4a-33d5-11ea-8e4a-000000000000.V.Vangle
[-0.24179575]
6a178ed8-33d5-11ea-8ed8-000000000000.V.V
[ 132344.84859421]
6a178ed8-33d5-11ea-8ed8-000000000000.V.Vangle
[-0.25679475]
6a178f72-33d5-11ea-8f72-000000000000.V.V
[ 135929.99999989]
6a178f72-33d5-11ea-8f72-000000000000.V.Vangle
[-0.19036461]
6a179010-33d5-11ea-9010-000000000000.V.V
[ 137054.50809703]
6a179010-33d5-11ea-9010-000000000000.V.Vangle
[-0.12256259]
6a1790a4-33d5-11ea-90a4-000000000000.V.V
[ 137310.00000035]
6a1790a4-33d5-11ea-90a4-000000000000.V.Vangle
[-0.10686016]
6a179115-33d5-11ea-9115-000000000000.V.V
[ 137723.99999994]
6a179115-33d5-11ea-9115-000000000000.V.Vangle
[-0.11768536]
6a1791a0-33d5-11ea-91a0-000000000000.V.V
[ 334557.8763791]
6a1791a0-33d5-11ea-91a0-000000000000.V.Vangle
[-0.12782524]
6a179208-33d5-11ea-9208-000000000000.V.V
[ 339542.29712238]
6a179208-33d5-11ea-9208-000000000000.V.Vangle
[-0.09769793]
6a17926b-33d5-11ea-926b-000000000000.V.V
[ 346724.99999994]
6a17926b-33d5-11ea-926b-000000000000.V.Vangle
[-0.04339528]
6a1792d1-33d5-11ea-92d1-000000000000.V.V
[ 144900.00000024]
6a1792d1-33d5-11ea-92d1-000000000000.V.Vangle
[-0.04694938]
6a179360-33d5-11ea-9360-000000000000.V.V
[ 140716.12538534]
6a179360-33d5-11ea-9360-000000000000.V.Vangle
[-0.09301338]
6a1793fa-33d5-11ea-93fa-000000000000.V.V
[ 346275.77889366]
6a1793fa-33d5-11ea-93fa-000000000000.V.Vangle
[-0.04609605]
6a17946a-33d5-11ea-946a-000000000000.V.V
[ 142830.]
6a17946a-33d5-11ea-946a-000000000000.V.Vangle
[ 0.]
6a179519-33d5-11ea-9519-000000000000.V.V
[ 135791.99999948]
6a179519-33d5-11ea-9519-000000000000.V.Vangle
[-0.13000661]
6a1795a9-33d5-11ea-95a9-000000000000.V.V
[ 136184.11611781]
6a1795a9-33d5-11ea-95a9-000000000000.V.Vangle
[-0.13740623]
6a179616-33d5-11ea-9616-000000000000.V.V
[ 135239.99999969]
6a179616-33d5-11ea-9616-000000000000.V.Vangle
[-0.15772343]
6a1796a1-33d5-11ea-96a1-000000000000.V.V
[ 136758.00000038]
6a1796a1-33d5-11ea-96a1-000000000000.V.Vangle
[-0.1410981]
6a17972e-33d5-11ea-972e-000000000000.V.V
[ 132203.9999996]
6a17972e-33d5-11ea-972e-000000000000.V.Vangle
[-0.14633485]
6a1797e5-33d5-11ea-97e5-000000000000.V.V
[ 133489.12938102]
6a1797e5-33d5-11ea-97e5-000000000000.V.Vangle
[-0.12423297]
6a179875-33d5-11ea-9875-000000000000.V.V
[ 130133.99999977]
6a179875-33d5-11ea-9875-000000000000.V.Vangle
[-0.14411428]
6a179903-33d5-11ea-9903-000000000000.V.V
[ 138827.99999953]
6a179903-33d5-11ea-9903-000000000000.V.Vangle
[-0.05786863]
6a179991-33d5-11ea-9991-000000000000.V.V
[ 138472.2717089]
6a179991-33d5-11ea-9991-000000000000.V.Vangle
[-0.06321279]
6a179a1f-33d5-11ea-9a1f-000000000000.V.V
[ 139272.95246074]
6a179a1f-33d5-11ea-9a1f-000000000000.V.Vangle
[-0.05807027]
6a179ace-33d5-11ea-9ace-000000000000.V.V
[ 143519.99999985]
6a179ace-33d5-11ea-9ace-000000000000.V.Vangle
[-0.0190972]
6a179b5e-33d5-11ea-9b5e-000000000000.V.V
[ 344557.87927516]
6a179b5e-33d5-11ea-9b5e-000000000000.V.Vangle
[-0.03642811]
6a179bc6-33d5-11ea-9bc6-000000000000.V.V
[ 136419.04166356]
6a179bc6-33d5-11ea-9bc6-000000000000.V.Vangle
[-0.04891867]
6a179c71-33d5-11ea-9c71-000000000000.V.V
[ 135844.05858473]
6a179c71-33d5-11ea-9c71-000000000000.V.Vangle
[-0.0281227]
6a179d29-33d5-11ea-9d29-000000000000.V.V
[ 135199.20040683]
6a179d29-33d5-11ea-9d29-000000000000.V.Vangle
[ 0.01612583]
6a179dbf-33d5-11ea-9dbf-000000000000.V.V
[ 135929.99999986]
6a179dbf-33d5-11ea-9dbf-000000000000.V.Vangle
[ 0.04326177]
6a179e4c-33d5-11ea-9e4c-000000000000.V.V
[ 158581.60212222]
6a179e4c-33d5-11ea-9e4c-000000000000.V.Vangle
[ 0.01980701]
6a179eda-33d5-11ea-9eda-000000000000.V.V
[ 140070.00000026]
6a179eda-33d5-11ea-9eda-000000000000.V.Vangle
[ 0.02410068]
6a179f43-33d5-11ea-9f43-000000000000.V.V
[ 136268.66106173]
6a179f43-33d5-11ea-9f43-000000000000.V.Vangle
[ 0.09795815]
6a179fcf-33d5-11ea-9fcf-000000000000.V.V
[ 138689.99999972]
6a179fcf-33d5-11ea-9fcf-000000000000.V.Vangle
[ 0.16877321]
6a17a037-33d5-11ea-a037-000000000000.V.V
[ 135930.00000031]
6a17a037-33d5-11ea-a037-000000000000.V.Vangle
[ 0.05689576]
6a17a0c8-33d5-11ea-a0c8-000000000000.V.V
[ 135240.00000015]
6a17a0c8-33d5-11ea-a0c8-000000000000.V.Vangle
[ 0.05710682]
6a17a15d-33d5-11ea-a15d-000000000000.V.V
[ 136619.99999996]
6a17a15d-33d5-11ea-a15d-000000000000.V.Vangle
[ 0.06635535]
6a17a1f3-33d5-11ea-a1f3-000000000000.V.V
[ 135989.65818465]
6a17a1f3-33d5-11ea-a1f3-000000000000.V.Vangle
[ 0.01343792]
6a17a28a-33d5-11ea-a28a-000000000000.V.V
[ 136596.43067572]
6a17a28a-33d5-11ea-a28a-000000000000.V.Vangle
[-0.02438513]
6a17a321-33d5-11ea-a321-000000000000.V.V
[ 135285.54065456]
6a17a321-33d5-11ea-a321-000000000000.V.Vangle
[-0.04135626]
6a17a3b6-33d5-11ea-a3b6-000000000000.V.V
[ 136934.64050044]
6a17a3b6-33d5-11ea-a3b6-000000000000.V.Vangle
[-0.04426435]
6a17a448-33d5-11ea-a448-000000000000.V.V
[ 139540.82942339]
6a17a448-33d5-11ea-a448-000000000000.V.Vangle
[-0.03779771]
6a17a581-33d5-11ea-a581-000000000000.V.V
[ 141244.22006003]
6a17a581-33d5-11ea-a581-000000000000.V.Vangle
[-0.04624245]
6a17a62e-33d5-11ea-a62e-000000000000.V.V
[ 139380.00000016]
6a17a62e-33d5-11ea-a62e-000000000000.V.Vangle
[-0.05261781]
6a17a6ca-33d5-11ea-a6ca-000000000000.V.V
[ 140345.99999976]
6a17a6ca-33d5-11ea-a6ca-000000000000.V.Vangle
[-0.03528379]
6a17a75b-33d5-11ea-a75b-000000000000.V.V
[ 136815.81417727]
6a17a75b-33d5-11ea-a75b-000000000000.V.Vangle
[-0.00755596]
6a17a7ef-33d5-11ea-a7ef-000000000000.V.V
[ 136499.98663319]
6a17a7ef-33d5-11ea-a7ef-000000000000.V.Vangle
[ 0.03989426]
6a17a87e-33d5-11ea-a87e-000000000000.V.V
[ 139380.00000022]
6a17a87e-33d5-11ea-a87e-000000000000.V.Vangle
[-0.10057813]
6a17a90a-33d5-11ea-a90a-000000000000.V.V
[ 133997.99999952]
6a17a90a-33d5-11ea-a90a-000000000000.V.Vangle
[-0.14543283]
6a17a999-33d5-11ea-a999-000000000000.V.V
[ 133169.99999962]
6a17a999-33d5-11ea-a999-000000000000.V.Vangle
[-0.16470478]
6a17aa4c-33d5-11ea-aa4c-000000000000.V.V
[ 132638.1918191]
6a17aa4c-33d5-11ea-aa4c-000000000000.V.Vangle
[-0.16924545]
6a17aae6-33d5-11ea-aae6-000000000000.V.V
[ 131376.00000014]
6a17aae6-33d5-11ea-aae6-000000000000.V.Vangle
[-0.21812752]
6a17ab9d-33d5-11ea-ab9d-000000000000.V.V
[ 133337.22199479]
6a17ab9d-33d5-11ea-ab9d-000000000000.V.Vangle
[-0.18565014]
6a17ac2f-33d5-11ea-ac2f-000000000000.V.V
[ 133449.52279297]
6a17ac2f-33d5-11ea-ac2f-000000000000.V.Vangle
[-0.19354947]
6a17acc0-33d5-11ea-acc0-000000000000.V.V
[ 134274.00000045]
6a17acc0-33d5-11ea-acc0-000000000000.V.Vangle
[-0.20832996]
6a17ad72-33d5-11ea-ad72-000000000000.V.V
[ 135240.00000021]
6a17ad72-33d5-11ea-ad72-000000000000.V.Vangle
[-0.17961788]
6a17adde-33d5-11ea-adde-000000000000.V.V
[ 134549.99999965]
6a17adde-33d5-11ea-adde-000000000000.V.Vangle
[-0.26242151]
6a17ae6a-33d5-11ea-ae6a-000000000000.V.V
[ 137033.9999998]
6a17ae6a-33d5-11ea-ae6a-000000000000.V.Vangle
[-0.28630895]
6a17aefd-33d5-11ea-aefd-000000000000.V.V
[ 132492.79655614]
6a17aefd-33d5-11ea-aefd-000000000000.V.Vangle
[-0.27194253]
6a17af8b-33d5-11ea-af8b-000000000000.V.V
[ 132483.09097239]
6a17af8b-33d5-11ea-af8b-000000000000.V.Vangle
[-0.27207446]
6a17b01f-33d5-11ea-b01f-000000000000.V.V
[ 138690.00000043]
6a17b01f-33d5-11ea-b01f-000000000000.V.Vangle
[-0.05364767]
6a17b0b0-33d5-11ea-b0b0-000000000000.V.V
[ 134387.773659]
6a17b0b0-33d5-11ea-b0b0-000000000000.V.Vangle
[-0.33771652]
6a17b140-33d5-11ea-b140-000000000000.V.V
[ 131020.86349434]
6a17b140-33d5-11ea-b140-000000000000.V.Vangle
[-0.14154525]
************************ convert dpsim to standard end  ****************
************************ comparison and assertion start  ****************
[ 131789.99999972] [ 131790.]
6A1768C3-33D5-11EA-A8C3-000000000000.V.V
2.15976524673e-12
[ 134052.38784895] [ 134052.20564334]
6A176B92-33D5-11EA-AB92-000000000000.V.V
1.35921379647e-06
[ 133535.73896816] [ 133541.48833388]
6A176C5B-33D5-11EA-AC5B-000000000000.V.V
4.30530301901e-05
[ 137724.00000044] [ 137724.]
6A176CF6-33D5-11EA-ACF6-000000000000.V.V
3.2272784608e-12
[ 138250.12586892] [ 138273.87989265]
6A176D93-33D5-11EA-AD93-000000000000.V.V
0.000171789666616
[ 136619.99999994] [ 136620.]
6A176F0C-33D5-11EA-AF0C-000000000000.V.V
4.1497776116e-13
[ 136527.41438941] [ 136527.24850782]
6A176FAD-33D5-11EA-AFAD-000000000000.V.V
1.21500720146e-06
[ 350175.00000012] [ 350175.]
6A17704B-33D5-11EA-B04B-000000000000.V.V
3.36937041969e-13
[ 359806.78076232] [ 359806.78076402]
6A1770DF-33D5-11EA-B0DF-000000000000.V.V
4.710072567e-12
[ 362249.99999983] [ 362250.]
6A17715E-33D5-11EA-B15E-000000000000.V.V
4.61162144435e-13
[ 135936.34533759] [ 135942.21960173]
6A1771CB-33D5-11EA-B1CB-000000000000.V.V
4.32114773096e-05
[ 136619.99999998] [ 136620.]
6A17725C-33D5-11EA-B25C-000000000000.V.V
1.82777679197e-13
[ 133619.61901411] [ 133625.68087503]
6A1772EE-33D5-11EA-B2EE-000000000000.V.V
4.53644903552e-05
[ 135734.61255188] [ 135735.56127923]
6A177381-33D5-11EA-B381-000000000000.V.V
6.98952683163e-06
[ 133860.0000001] [ 133860.]
6A177417-33D5-11EA-B417-000000000000.V.V
7.74667174043e-13
[ 135764.35779124] [ 135777.83628148]
6A1774B2-33D5-11EA-B4B2-000000000000.V.V
9.92687069259e-05
[ 137276.11010143] [ 137322.2174106]
6A177548-33D5-11EA-B548-000000000000.V.V
0.000335760010587
[ 134274.00000031] [ 134274.]
6A1775E4-33D5-11EA-B5E4-000000000000.V.V
2.33807750672e-12
[ 132756.0000001] [ 132756.]
6A177856-33D5-11EA-B856-000000000000.V.V
7.72120965294e-13
[ 132042.26907052] [ 132056.93520778]
6A17790F-33D5-11EA-B90F-000000000000.V.V
0.000111059197591
[ 132144.06367774] [ 132166.03549311]
6A1779A8-33D5-11EA-B9A8-000000000000.V.V
0.000166244037632
[ 133700.76311867] [ 133724.63262578]
6A177A3C-33D5-11EA-BA3C-000000000000.V.V
0.000178497458854
[ 137918.16238055] [ 137926.76652403]
6A177AD4-33D5-11EA-BAD4-000000000000.V.V
6.238197049e-05
[ 136896.00000034] [ 136896.]
6A177B68-33D5-11EA-BB68-000000000000.V.V
2.50568128918e-12
[ 144899.99999963] [ 144900.]
6A177BF6-33D5-11EA-BBF6-000000000000.V.V
2.58098151393e-12
[ 350174.99999954] [ 350175.]
6A177C61-33D5-11EA-BC61-000000000000.V.V
1.31782775961e-12
[ 133584.0000005] [ 133584.]
6A177CC6-33D5-11EA-BCC6-000000000000.V.V
3.71684743376e-12
[ 132696.2398731] [ 132696.39824253]
6A177D59-33D5-11EA-BD59-000000000000.V.V
1.19347196081e-06
[ 132924.36406622] [ 132923.85401466]
6A177DF0-33D5-11EA-BDF0-000000000000.V.V
3.83717105291e-06
[ 340473.68721524] [ 339939.75100732]
6A177E84-33D5-11EA-BE84-000000000000.V.V
0.00157067894043
[ 133446.00000024] [ 133446.]
6A177EF3-33D5-11EA-BEF3-000000000000.V.V
1.782049658e-12
[ 132893.99999963] [ 132894.]
6A177F85-33D5-11EA-BF85-000000000000.V.V
2.81152629467e-12
[ 133951.68993796] [ 133988.91145307]
6A17801A-33D5-11EA-801A-000000000000.V.V
0.00027779548847
[ 135791.99999976] [ 135792.]
6A1780AB-33D5-11EA-80AB-000000000000.V.V
1.75040490854e-12
[ 135289.24649557] [ 135302.4394461]
6A17815E-33D5-11EA-815E-000000000000.V.V
9.75071150574e-05
[ 135240.00000008] [ 135240.]
6A1781FB-33D5-11EA-81FB-000000000000.V.V
5.7092917925e-13
[ 136633.93862107] [ 136711.26663559]
6A17828F-33D5-11EA-828F-000000000000.V.V
0.00056563015194
[ 332764.54262603] [ 331643.57805952]
6A17831F-33D5-11EA-831F-000000000000.V.V
0.00338002795974
[ 133829.31298079] [ 133854.62948489]
6A17838A-33D5-11EA-838A-000000000000.V.V
0.000189134318295
[ 133860.00000011] [ 133860.]
6A17841C-33D5-11EA-841C-000000000000.V.V
8.40110569885e-13
[ 133421.77117908] [ 133422.88075975]
6A1784AD-33D5-11EA-84AD-000000000000.V.V
8.31626980696e-06
[ 135929.99999997] [ 135930.]
6A17853E-33D5-11EA-853E-000000000000.V.V
1.84561920501e-13
[ 134824.6440318] [ 134842.76257107]
6A1785CF-33D5-11EA-85CF-000000000000.V.V
0.000134367903205
[ 135822.95942677] [ 135852.17104356]
6A17865D-33D5-11EA-865D-000000000000.V.V
0.000215025027293
[ 136097.15123417] [ 136120.79358527]
6A17870E-33D5-11EA-870E-000000000000.V.V
0.000173686550641
[ 138689.99999958] [ 138690.]
6A1787C8-33D5-11EA-87C8-000000000000.V.V
3.0123692134e-12
[ 140339.56621048] [ 140353.15007644]
6A17887C-33D5-11EA-887C-000000000000.V.V
9.67834776301e-05
[ 140847.26204689] [ 140847.40583294]
6A178910-33D5-11EA-8910-000000000000.V.V
1.0208639704e-06
[ 141450.00000049] [ 141450.]
6A1789BD-33D5-11EA-89BD-000000000000.V.V
3.48937335253e-12
[ 138147.23913297] [ 138149.42089388]
6A178A4C-33D5-11EA-8A4C-000000000000.V.V
1.57927618641e-05
[ 133425.07590182] [ 133428.983629]
6A178ADC-33D5-11EA-8ADC-000000000000.V.V
2.92869440288e-05
[ 132036.70107521] [ 132040.88253051]
6A178B6B-33D5-11EA-8B6B-000000000000.V.V
3.1667883559e-05
[ 130543.52926924] [ 130545.64021452]
6A178C02-33D5-11EA-8C02-000000000000.V.V
1.61701705987e-05
[ 131789.99999969] [ 131790.]
6A178C93-33D5-11EA-8C93-000000000000.V.V
2.34084985842e-12
[ 131375.99999948] [ 131376.]
6A178D24-33D5-11EA-8D24-000000000000.V.V
3.92286741664e-12
[ 131651.99999972] [ 131652.]
6A178DB6-33D5-11EA-8DB6-000000000000.V.V
2.11118388526e-12
[ 133938.16046557] [ 133940.38905482]
6A178E4A-33D5-11EA-8E4A-000000000000.V.V
1.66386649246e-05
[ 132344.84859421] [ 132347.33667698]
6A178ED8-33D5-11EA-8ED8-000000000000.V.V
1.87996436258e-05
[ 135929.99999989] [ 135930.]
6A178F72-33D5-11EA-8F72-000000000000.V.V
7.9776997191e-13
[ 137054.50809703] [ 137055.5626172]
6A179010-33D5-11EA-9010-000000000000.V.V
7.69410708892e-06
[ 137310.00000035] [ 137310.]
6A1790A4-33D5-11EA-90A4-000000000000.V.V
2.55429510476e-12
[ 137723.99999994] [ 137724.]
6A179115-33D5-11EA-9115-000000000000.V.V
4.10383366348e-13
[ 334557.8763791] [ 334214.26959857]
6A1791A0-33D5-11EA-91A0-000000000000.V.V
0.00102810326126
[ 339542.29712238] [ 339389.81630821]
6A179208-33D5-11EA-9208-000000000000.V.V
0.000449279285476
[ 346724.99999994] [ 346725.]
6A17926B-33D5-11EA-926B-000000000000.V.V
1.83155405744e-13
[ 144900.00000024] [ 144900.]
6A1792D1-33D5-11EA-92D1-000000000000.V.V
1.67010593684e-12
[ 140716.12538534] [ 140716.0828533]
6A179360-33D5-11EA-9360-000000000000.V.V
3.02254284655e-07
[ 346275.77889366] [ 346121.05003557]
6A1793FA-33D5-11EA-93FA-000000000000.V.V
0.000447036833143
[ 142830.] [ 142830.]
6A17946A-33D5-11EA-946A-000000000000.V.V
2.03765528648e-16
[ 135791.99999948] [ 135792.]
6A179519-33D5-11EA-9519-000000000000.V.V
3.82165665779e-12
[ 136184.11611781] [ 136184.54467827]
6A1795A9-33D5-11EA-95A9-000000000000.V.V
3.146909712e-06
[ 135239.99999969] [ 135240.]
6A179616-33D5-11EA-9616-000000000000.V.V
2.30351524112e-12
[ 136758.00000038] [ 136758.]
6A1796A1-33D5-11EA-96A1-000000000000.V.V
2.78912240575e-12
[ 132203.9999996] [ 132204.]
6A17972E-33D5-11EA-972E-000000000000.V.V
2.9939494585e-12
[ 133489.12938102] [ 133491.80013639]
6A1797E5-33D5-11EA-97E5-000000000000.V.V
2.00068870703e-05
[ 130133.99999977] [ 130134.]
6A179875-33D5-11EA-9875-000000000000.V.V
1.76411248899e-12
[ 138827.99999953] [ 138828.]
6A179903-33D5-11EA-9903-000000000000.V.V
3.41628505145e-12
[ 138472.2717089] [ 138472.4730581]
6A179991-33D5-11EA-9991-000000000000.V.V
1.4540737962e-06
[ 139272.95246074] [ 139272.78356434]
6A179A1F-33D5-11EA-9A1F-000000000000.V.V
1.21270210633e-06
[ 143519.99999985] [ 143520.]
6A179ACE-33D5-11EA-9ACE-000000000000.V.V
1.07314291233e-12
[ 344557.87927516] [ 343898.29083367]
6A179B5E-33D5-11EA-9B5E-000000000000.V.V
0.0019179753406
[ 136419.04166356] [ 136419.24442069]
6A179BC6-33D5-11EA-9BC6-000000000000.V.V
1.48627957938e-06
[ 135844.05858473] [ 135844.03570645]
6A179C71-33D5-11EA-9C71-000000000000.V.V
1.68415801271e-07
[ 135199.20040683] [ 135199.13286604]
6A179D29-33D5-11EA-9D29-000000000000.V.V
4.99565269846e-07
[ 135929.99999986] [ 135930.]
6A179DBF-33D5-11EA-9DBF-000000000000.V.V
1.01402001797e-12
[ 158581.60212222] [ 136163.32300112]
6A179E4C-33D5-11EA-9E4C-000000000000.V.V
0.164642567668
[ 140070.00000026] [ 163415.]
6A179EDA-33D5-11EA-9EDA-000000000000.V.V
0.142857142856
[ 136268.66106173] [ 136268.55563431]
6A179F43-33D5-11EA-9F43-000000000000.V.V
7.73673825278e-07
[ 138689.99999972] [ 138690.]
6A179FCF-33D5-11EA-9FCF-000000000000.V.V
2.0044688768e-12
[ 135930.00000031] [ 135930.]
6A17A037-33D5-11EA-A037-000000000000.V.V
2.30081484652e-12
[ 135240.00000015] [ 135240.]
6A17A0C8-33D5-11EA-A0C8-000000000000.V.V
1.13195909644e-12
[ 136619.99999996] [ 136620.]
6A17A15D-33D5-11EA-A15D-000000000000.V.V
2.98451664982e-13
[ 135989.65818465] [ 135989.77699458]
6A17A1F3-33D5-11EA-A1F3-000000000000.V.V
8.7366805414e-07
[ 136596.43067572] [ 136596.60594275]
6A17A28A-33D5-11EA-A28A-000000000000.V.V
1.28309949009e-06
[ 135285.54065456] [ 135285.79847936]
6A17A321-33D5-11EA-A321-000000000000.V.V
1.9057787756e-06
[ 136934.64050044] [ 136935.00603724]
6A17A3B6-33D5-11EA-A3B6-000000000000.V.V
2.66941821695e-06
[ 139540.82942339] [ 139540.93131894]
6A17A448-33D5-11EA-A448-000000000000.V.V
7.30219831737e-07
[ 141244.22006003] [ 141244.18683416]
6A17A581-33D5-11EA-A581-000000000000.V.V
2.35237054877e-07
[ 139380.00000016] [ 139380.]
6A17A62E-33D5-11EA-A62E-000000000000.V.V
1.11859104432e-12
[ 140345.99999976] [ 140346.]
6A17A6CA-33D5-11EA-A6CA-000000000000.V.V
1.70667154503e-12
[ 136815.81417727] [ 136815.90662602]
6A17A75B-33D5-11EA-A75B-000000000000.V.V
6.75716419076e-07
[ 136499.98663319] [ 136500.05252516]
6A17A7EF-33D5-11EA-A7EF-000000000000.V.V
4.82724915513e-07
[ 139380.00000022] [ 139380.]
6A17A87E-33D5-11EA-A87E-000000000000.V.V
1.61138082677e-12
[ 133997.99999952] [ 133998.]
6A17A90A-33D5-11EA-A90A-000000000000.V.V
3.57243991218e-12
[ 133169.99999962] [ 133170.]
6A17A999-33D5-11EA-A999-000000000000.V.V
2.87869381074e-12
[ 132638.1918191] [ 132638.19181967]
6A17AA4C-33D5-11EA-AA4C-000000000000.V.V
4.36036793703e-12
[ 131376.00000014] [ 131376.]
6A17AAE6-33D5-11EA-AAE6-000000000000.V.V
1.06201865797e-12
[ 133337.22199479] [ 133337.22199667]
6A17AB9D-33D5-11EA-AB9D-000000000000.V.V
1.40790039271e-11
[ 133449.52279297] [ 133449.52279435]
6A17AC2F-33D5-11EA-AC2F-000000000000.V.V
1.03234458217e-11
[ 134274.00000045] [ 134274.]
6A17ACC0-33D5-11EA-ACC0-000000000000.V.V
3.31930276609e-12
[ 135240.00000021] [ 135240.]
6A17AD72-33D5-11EA-AD72-000000000000.V.V
1.51759991409e-12
[ 134549.99999965] [ 134550.]
6A17ADDE-33D5-11EA-ADDE-000000000000.V.V
2.62875400625e-12
[ 137033.9999998] [ 137034.]
6A17AE6A-33D5-11EA-AE6A-000000000000.V.V
1.46460013449e-12
[ 132492.79655614] [ 132492.84378963]
6A17AEFD-33D5-11EA-AEFD-000000000000.V.V
3.56498438786e-07
[ 132483.09097239] [ 132483.15520165]
6A17AF8B-33D5-11EA-AF8B-000000000000.V.V
4.84810836157e-07
[ 138690.00000043] [ 138690.]
6A17B01F-33D5-11EA-B01F-000000000000.V.V
3.10931902716e-12
[ 134387.773659] [ 134387.77365967]
6A17B0B0-33D5-11EA-B0B0-000000000000.V.V
5.00852323573e-12
[ 131020.86349434] [ 131022.37942323]
6A17B140-33D5-11EA-B140-000000000000.V.V
1.1569999747e-05
118 error values available. Comparing with threshold...
Test on 6A1768C3-33D5-11EA-A8C3-000000000000.V.V Passed
Test on 6A176B92-33D5-11EA-AB92-000000000000.V.V Passed
Test on 6A176C5B-33D5-11EA-AC5B-000000000000.V.V Passed
Test on 6A176CF6-33D5-11EA-ACF6-000000000000.V.V Passed
Test on 6A176D93-33D5-11EA-AD93-000000000000.V.V Passed
Test on 6A176F0C-33D5-11EA-AF0C-000000000000.V.V Passed
Test on 6A176FAD-33D5-11EA-AFAD-000000000000.V.V Passed
Test on 6A17704B-33D5-11EA-B04B-000000000000.V.V Passed
Test on 6A1770DF-33D5-11EA-B0DF-000000000000.V.V Passed
Test on 6A17715E-33D5-11EA-B15E-000000000000.V.V Passed
Test on 6A1771CB-33D5-11EA-B1CB-000000000000.V.V Passed
Test on 6A17725C-33D5-11EA-B25C-000000000000.V.V Passed
Test on 6A1772EE-33D5-11EA-B2EE-000000000000.V.V Passed
Test on 6A177381-33D5-11EA-B381-000000000000.V.V Passed
Test on 6A177417-33D5-11EA-B417-000000000000.V.V Passed
Test on 6A1774B2-33D5-11EA-B4B2-000000000000.V.V Passed
Test on 6A177548-33D5-11EA-B548-000000000000.V.V Passed
Test on 6A1775E4-33D5-11EA-B5E4-000000000000.V.V Passed
Test on 6A177856-33D5-11EA-B856-000000000000.V.V Passed
Test on 6A17790F-33D5-11EA-B90F-000000000000.V.V Passed
Test on 6A1779A8-33D5-11EA-B9A8-000000000000.V.V Passed
Test on 6A177A3C-33D5-11EA-BA3C-000000000000.V.V Passed
Test on 6A177AD4-33D5-11EA-BAD4-000000000000.V.V Passed
Test on 6A177B68-33D5-11EA-BB68-000000000000.V.V Passed
Test on 6A177BF6-33D5-11EA-BBF6-000000000000.V.V Passed
Test on 6A177C61-33D5-11EA-BC61-000000000000.V.V Passed
Test on 6A177CC6-33D5-11EA-BCC6-000000000000.V.V Passed
Test on 6A177D59-33D5-11EA-BD59-000000000000.V.V Passed
Test on 6A177DF0-33D5-11EA-BDF0-000000000000.V.V Passed
Test on 6A177E84-33D5-11EA-BE84-000000000000.V.V Passed
Test on 6A177EF3-33D5-11EA-BEF3-000000000000.V.V Passed
Test on 6A177F85-33D5-11EA-BF85-000000000000.V.V Passed
Test on 6A17801A-33D5-11EA-801A-000000000000.V.V Passed
Test on 6A1780AB-33D5-11EA-80AB-000000000000.V.V Passed
Test on 6A17815E-33D5-11EA-815E-000000000000.V.V Passed
Test on 6A1781FB-33D5-11EA-81FB-000000000000.V.V Passed
Test on 6A17828F-33D5-11EA-828F-000000000000.V.V Passed
Test on 6A17831F-33D5-11EA-831F-000000000000.V.V Passed
Test on 6A17838A-33D5-11EA-838A-000000000000.V.V Passed
Test on 6A17841C-33D5-11EA-841C-000000000000.V.V Passed
Test on 6A1784AD-33D5-11EA-84AD-000000000000.V.V Passed
Test on 6A17853E-33D5-11EA-853E-000000000000.V.V Passed
Test on 6A1785CF-33D5-11EA-85CF-000000000000.V.V Passed
Test on 6A17865D-33D5-11EA-865D-000000000000.V.V Passed
Test on 6A17870E-33D5-11EA-870E-000000000000.V.V Passed
Test on 6A1787C8-33D5-11EA-87C8-000000000000.V.V Passed
Test on 6A17887C-33D5-11EA-887C-000000000000.V.V Passed
Test on 6A178910-33D5-11EA-8910-000000000000.V.V Passed
Test on 6A1789BD-33D5-11EA-89BD-000000000000.V.V Passed
Test on 6A178A4C-33D5-11EA-8A4C-000000000000.V.V Passed
Test on 6A178ADC-33D5-11EA-8ADC-000000000000.V.V Passed
Test on 6A178B6B-33D5-11EA-8B6B-000000000000.V.V Passed
Test on 6A178C02-33D5-11EA-8C02-000000000000.V.V Passed
Test on 6A178C93-33D5-11EA-8C93-000000000000.V.V Passed
Test on 6A178D24-33D5-11EA-8D24-000000000000.V.V Passed
Test on 6A178DB6-33D5-11EA-8DB6-000000000000.V.V Passed
Test on 6A178E4A-33D5-11EA-8E4A-000000000000.V.V Passed
Test on 6A178ED8-33D5-11EA-8ED8-000000000000.V.V Passed
Test on 6A178F72-33D5-11EA-8F72-000000000000.V.V Passed
Test on 6A179010-33D5-11EA-9010-000000000000.V.V Passed
Test on 6A1790A4-33D5-11EA-90A4-000000000000.V.V Passed
Test on 6A179115-33D5-11EA-9115-000000000000.V.V Passed
Test on 6A1791A0-33D5-11EA-91A0-000000000000.V.V Passed
Test on 6A179208-33D5-11EA-9208-000000000000.V.V Passed
Test on 6A17926B-33D5-11EA-926B-000000000000.V.V Passed
Test on 6A1792D1-33D5-11EA-92D1-000000000000.V.V Passed
Test on 6A179360-33D5-11EA-9360-000000000000.V.V Passed
Test on 6A1793FA-33D5-11EA-93FA-000000000000.V.V Passed
Test on 6A17946A-33D5-11EA-946A-000000000000.V.V Passed
Test on 6A179519-33D5-11EA-9519-000000000000.V.V Passed
Test on 6A1795A9-33D5-11EA-95A9-000000000000.V.V Passed
Test on 6A179616-33D5-11EA-9616-000000000000.V.V Passed
Test on 6A1796A1-33D5-11EA-96A1-000000000000.V.V Passed
Test on 6A17972E-33D5-11EA-972E-000000000000.V.V Passed
Test on 6A1797E5-33D5-11EA-97E5-000000000000.V.V Passed
Test on 6A179875-33D5-11EA-9875-000000000000.V.V Passed
Test on 6A179903-33D5-11EA-9903-000000000000.V.V Passed
Test on 6A179991-33D5-11EA-9991-000000000000.V.V Passed
Test on 6A179A1F-33D5-11EA-9A1F-000000000000.V.V Passed
Test on 6A179ACE-33D5-11EA-9ACE-000000000000.V.V Passed
Test on 6A179B5E-33D5-11EA-9B5E-000000000000.V.V Passed
Test on 6A179BC6-33D5-11EA-9BC6-000000000000.V.V Passed
Test on 6A179C71-33D5-11EA-9C71-000000000000.V.V Passed
Test on 6A179D29-33D5-11EA-9D29-000000000000.V.V Passed
Test on 6A179DBF-33D5-11EA-9DBF-000000000000.V.V Passed
Test on 6A179E4C-33D5-11EA-9E4C-000000000000.V.V Passed
Test on 6A179EDA-33D5-11EA-9EDA-000000000000.V.V Passed
Test on 6A179F43-33D5-11EA-9F43-000000000000.V.V Passed
Test on 6A179FCF-33D5-11EA-9FCF-000000000000.V.V Passed
Test on 6A17A037-33D5-11EA-A037-000000000000.V.V Passed
Test on 6A17A0C8-33D5-11EA-A0C8-000000000000.V.V Passed
Test on 6A17A15D-33D5-11EA-A15D-000000000000.V.V Passed
Test on 6A17A1F3-33D5-11EA-A1F3-000000000000.V.V Passed
Test on 6A17A28A-33D5-11EA-A28A-000000000000.V.V Passed
Test on 6A17A321-33D5-11EA-A321-000000000000.V.V Passed
Test on 6A17A3B6-33D5-11EA-A3B6-000000000000.V.V Passed
Test on 6A17A448-33D5-11EA-A448-000000000000.V.V Passed
Test on 6A17A581-33D5-11EA-A581-000000000000.V.V Passed
Test on 6A17A62E-33D5-11EA-A62E-000000000000.V.V Passed
Test on 6A17A6CA-33D5-11EA-A6CA-000000000000.V.V Passed
Test on 6A17A75B-33D5-11EA-A75B-000000000000.V.V Passed
Test on 6A17A7EF-33D5-11EA-A7EF-000000000000.V.V Passed
Test on 6A17A87E-33D5-11EA-A87E-000000000000.V.V Passed
Test on 6A17A90A-33D5-11EA-A90A-000000000000.V.V Passed
Test on 6A17A999-33D5-11EA-A999-000000000000.V.V Passed
Test on 6A17AA4C-33D5-11EA-AA4C-000000000000.V.V Passed
Test on 6A17AAE6-33D5-11EA-AAE6-000000000000.V.V Passed
Test on 6A17AB9D-33D5-11EA-AB9D-000000000000.V.V Passed
Test on 6A17AC2F-33D5-11EA-AC2F-000000000000.V.V Passed
Test on 6A17ACC0-33D5-11EA-ACC0-000000000000.V.V Passed
Test on 6A17AD72-33D5-11EA-AD72-000000000000.V.V Passed
Test on 6A17ADDE-33D5-11EA-ADDE-000000000000.V.V Passed
Test on 6A17AE6A-33D5-11EA-AE6A-000000000000.V.V Passed
Test on 6A17AEFD-33D5-11EA-AEFD-000000000000.V.V Passed
Test on 6A17AF8B-33D5-11EA-AF8B-000000000000.V.V Passed
Test on 6A17B01F-33D5-11EA-B01F-000000000000.V.V Passed
Test on 6A17B0B0-33D5-11EA-B0B0-000000000000.V.V Passed
Test on 6A17B140-33D5-11EA-B140-000000000000.V.V Passed
[1;36;40mModel Case9 Passed[0m
************************ comparison and assertion end  ****************
