move examples to cimpy package folder

6 jobs for master in 39 seconds (queued for 8 seconds)
Status Name Job ID Coverage
  Prepare
passed docker #1028850
shell linux

00:00:03

 
  Test
failed test:export-against-exported-files #1028853
docker

00:00:16

failed test:export-against-imported-files #1028852
docker

00:00:19

failed test:import #1028851
docker

00:00:19

 
  Generate
skipped documentation #1028854
docker
 
  Deploy
skipped pages #1028855
 
Name Stage Failure
failed
test:export-against-imported-files Test
E       IndexError: list index out of range

../cimpy/cimimport.py:47: IndexError
=========================== short test summary info ============================
FAILED test_export_with_imported_files.py::test_export_with_imported_files - ...
============================== 1 failed in 0.08s ===============================
Running after_script
Uploading artifacts for failed job
ERROR: Job failed: exit code 1
failed
test:export-against-exported-files Test
E       IndexError: list index out of range

../cimpy/cimimport.py:47: IndexError
=========================== short test summary info ============================
FAILED test_export_with_exported_files.py::test_export_with_exported_files - ...
============================== 1 failed in 0.07s ===============================
Running after_script
Uploading artifacts for failed job
ERROR: Job failed: exit code 1
failed
test:import Test
E       IndexError: list index out of range

../cimpy/cimimport.py:47: IndexError
=========================== short test summary info ============================
FAILED test_import.py::test_import - IndexError: list index out of range
============================== 1 failed in 0.08s ===============================
Running after_script
Uploading artifacts for failed job
ERROR: Job failed: exit code 1