{
  "application": "pymfm",
  "start_forecast": "2021-04-06T00:00:00Z",
  "end_forecast": "2021-04-06T23:45:00Z",
  "household_sta": {
    "ID": "pymfm-slp",
    "metadata": {
      "households": 90,
      "avgconsumption": 3000,
      "addon": 0,
      "timezone_abbrevation": "Europe",
      "utc_timeoffset": 0
    },
    "units": {
      "time": "ISO8601",
      "householdpower": "W"
    },
    "slp_values": [
      {
        "timestamp": "2021-04-06T00:00:00.000Z",
        "value": 86.5384615385
      },
      {
        "timestamp": "2021-04-06T00:15:00.000Z",
        "value": 77.8846153846
      },
      {
        "timestamp": "2021-04-06T00:30:00.000Z",
        "value": 70.1923076923
      },
      {
        "timestamp": "2021-04-06T00:45:00.000Z",
        "value": 62.5
      },
      {
        "timestamp": "2021-04-06T01:00:00.000Z",
        "value": 56.7307692308
      },
      {
        "timestamp": "2021-04-06T01:15:00.000Z",
        "value": 52.8846153846
      },
      {
        "timestamp": "2021-04-06T01:30:00.000Z",
        "value": 50.0
      },
      {
        "timestamp": "2021-04-06T01:45:00.000Z",
        "value": 48.0769230769
      },
      {
        "timestamp": "2021-04-06T02:00:00.000Z",
        "value": 47.1153846154
      },
      {
        "timestamp": "2021-04-06T02:15:00.000Z",
        "value": 46.1538461538
      },
      {
        "timestamp": "2021-04-06T02:30:00.000Z",
        "value": 44.2307692308
      },
      {
        "timestamp": "2021-04-06T02:45:00.000Z",
        "value": 44.2307692308
      },
      {
        "timestamp": "2021-04-06T03:00:00.000Z",
        "value": 43.2692307692
      },
      {
        "timestamp": "2021-04-06T03:15:00.000Z",
        "value": 43.2692307692
      },
      {
        "timestamp": "2021-04-06T03:30:00.000Z",
        "value": 43.2692307692
      },
      {
        "timestamp": "2021-04-06T03:45:00.000Z",
        "value": 43.2692307692
      },
      {
        "timestamp": "2021-04-06T04:00:00.000Z",
        "value": 43.2692307692
      },
      {
        "timestamp": "2021-04-06T04:15:00.000Z",
        "value": 43.2692307692
      },
      {
        "timestamp": "2021-04-06T04:30:00.000Z",
        "value": 44.2307692308
      },
      {
        "timestamp": "2021-04-06T04:45:00.000Z",
        "value": 44.2307692308
      },
      {
        "timestamp": "2021-04-06T05:00:00.000Z",
        "value": 45.1923076923
      },
      {
        "timestamp": "2021-04-06T05:15:00.000Z",
        "value": 46.1538461538
      },
      {
        "timestamp": "2021-04-06T05:30:00.000Z",
        "value": 49.0384615385
      },
      {
        "timestamp": "2021-04-06T05:45:00.000Z",
        "value": 53.8461538462
      },
      {
        "timestamp": "2021-04-06T06:00:00.000Z",
        "value": 61.5384615385
      },
      {
        "timestamp": "2021-04-06T06:15:00.000Z",
        "value": 73.0769230769
      },
      {
        "timestamp": "2021-04-06T06:30:00.000Z",
        "value": 86.5384615385
      },
      {
        "timestamp": "2021-04-06T06:45:00.000Z",
        "value": 100.9615384615
      },
      {
        "timestamp": "2021-04-06T07:00:00.000Z",
        "value": 112.5
      },
      {
        "timestamp": "2021-04-06T07:15:00.000Z",
        "value": 122.1153846154
      },
      {
        "timestamp": "2021-04-06T07:30:00.000Z",
        "value": 128.8461538462
      },
      {
        "timestamp": "2021-04-06T07:45:00.000Z",
        "value": 133.6538461538
      },
      {
        "timestamp": "2021-04-06T08:00:00.000Z",
        "value": 136.5384615385
      },
      {
        "timestamp": "2021-04-06T08:15:00.000Z",
        "value": 137.5
      },
      {
        "timestamp": "2021-04-06T08:30:00.000Z",
        "value": 138.4615384615
      },
      {
        "timestamp": "2021-04-06T08:45:00.000Z",
        "value": 138.4615384615
      },
      {
        "timestamp": "2021-04-06T09:00:00.000Z",
        "value": 137.5
      },
      {
        "timestamp": "2021-04-06T09:15:00.000Z",
        "value": 137.5
      },
      {
        "timestamp": "2021-04-06T09:30:00.000Z",
        "value": 136.5384615385
      },
      {
        "timestamp": "2021-04-06T09:45:00.000Z",
        "value": 136.5384615385
      },
      {
        "timestamp": "2021-04-06T10:00:00.000Z",
        "value": 135.5769230769
      },
      {
        "timestamp": "2021-04-06T10:15:00.000Z",
        "value": 134.6153846154
      },
      {
        "timestamp": "2021-04-06T10:30:00.000Z",
        "value": 132.6923076923
      },
      {
        "timestamp": "2021-04-06T10:45:00.000Z",
        "value": 131.7307692308
      },
      {
        "timestamp": "2021-04-06T11:00:00.000Z",
        "value": 131.7307692308
      },
      {
        "timestamp": "2021-04-06T11:15:00.000Z",
        "value": 130.7692307692
      },
      {
        "timestamp": "2021-04-06T11:30:00.000Z",
        "value": 131.7307692308
      },
      {
        "timestamp": "2021-04-06T11:45:00.000Z",
        "value": 134.6153846154
      },
      {
        "timestamp": "2021-04-06T12:00:00.000Z",
        "value": 137.5
      },
      {
        "timestamp": "2021-04-06T12:15:00.000Z",
        "value": 143.2692307692
      },
      {
        "timestamp": "2021-04-06T12:30:00.000Z",
        "value": 149.0384615385
      },
      {
        "timestamp": "2021-04-06T12:45:00.000Z",
        "value": 153.8461538462
      },
      {
        "timestamp": "2021-04-06T13:00:00.000Z",
        "value": 155.7692307692
      },
      {
        "timestamp": "2021-04-06T13:15:00.000Z",
        "value": 153.8461538462
      },
      {
        "timestamp": "2021-04-06T13:30:00.000Z",
        "value": 150.0
      },
      {
        "timestamp": "2021-04-06T13:45:00.000Z",
        "value": 144.2307692308
      },
      {
        "timestamp": "2021-04-06T14:00:00.000Z",
        "value": 137.5
      },
      {
        "timestamp": "2021-04-06T14:15:00.000Z",
        "value": 132.6923076923
      },
      {
        "timestamp": "2021-04-06T14:30:00.000Z",
        "value": 128.8461538462
      },
      {
        "timestamp": "2021-04-06T14:45:00.000Z",
        "value": 125.0
      },
      {
        "timestamp": "2021-04-06T15:00:00.000Z",
        "value": 122.1153846154
      },
      {
        "timestamp": "2021-04-06T15:15:00.000Z",
        "value": 118.2692307692
      },
      {
        "timestamp": "2021-04-06T15:30:00.000Z",
        "value": 115.3846153846
      },
      {
        "timestamp": "2021-04-06T15:45:00.000Z",
        "value": 112.5
      },
      {
        "timestamp": "2021-04-06T16:00:00.000Z",
        "value": 109.6153846154
      },
      {
        "timestamp": "2021-04-06T16:15:00.000Z",
        "value": 107.6923076923
      },
      {
        "timestamp": "2021-04-06T16:30:00.000Z",
        "value": 105.7692307692
      },
      {
        "timestamp": "2021-04-06T16:45:00.000Z",
        "value": 105.7692307692
      },
      {
        "timestamp": "2021-04-06T17:00:00.000Z",
        "value": 106.7307692308
      },
      {
        "timestamp": "2021-04-06T17:15:00.000Z",
        "value": 109.6153846154
      },
      {
        "timestamp": "2021-04-06T17:30:00.000Z",
        "value": 113.4615384615
      },
      {
        "timestamp": "2021-04-06T17:45:00.000Z",
        "value": 119.2307692308
      },
      {
        "timestamp": "2021-04-06T18:00:00.000Z",
        "value": 125.0
      },
      {
        "timestamp": "2021-04-06T18:15:00.000Z",
        "value": 132.6923076923
      },
      {
        "timestamp": "2021-04-06T18:30:00.000Z",
        "value": 141.3461538462
      },
      {
        "timestamp": "2021-04-06T18:45:00.000Z",
        "value": 150.0
      },
      {
        "timestamp": "2021-04-06T19:00:00.000Z",
        "value": 157.6923076923
      },
      {
        "timestamp": "2021-04-06T19:15:00.000Z",
        "value": 165.3846153846
      },
      {
        "timestamp": "2021-04-06T19:30:00.000Z",
        "value": 172.1153846154
      },
      {
        "timestamp": "2021-04-06T19:45:00.000Z",
        "value": 175.9615384615
      },
      {
        "timestamp": "2021-04-06T20:00:00.000Z",
        "value": 176.9230769231
      },
      {
        "timestamp": "2021-04-06T20:15:00.000Z",
        "value": 175.0
      },
      {
        "timestamp": "2021-04-06T20:30:00.000Z",
        "value": 171.1538461538
      },
      {
        "timestamp": "2021-04-06T20:45:00.000Z",
        "value": 166.3461538462
      },
      {
        "timestamp": "2021-04-06T21:00:00.000Z",
        "value": 162.5
      },
      {
        "timestamp": "2021-04-06T21:15:00.000Z",
        "value": 159.6153846154
      },
      {
        "timestamp": "2021-04-06T21:30:00.000Z",
        "value": 157.6923076923
      },
      {
        "timestamp": "2021-04-06T21:45:00.000Z",
        "value": 155.7692307692
      },
      {
        "timestamp": "2021-04-06T22:00:00.000Z",
        "value": 152.8846153846
      },
      {
        "timestamp": "2021-04-06T22:15:00.000Z",
        "value": 148.0769230769
      },
      {
        "timestamp": "2021-04-06T22:30:00.000Z",
        "value": 141.3461538462
      },
      {
        "timestamp": "2021-04-06T22:45:00.000Z",
        "value": 132.6923076923
      },
      {
        "timestamp": "2021-04-06T23:00:00.000Z",
        "value": 124.0384615385
      },
      {
        "timestamp": "2021-04-06T23:15:00.000Z",
        "value": 114.4230769231
      },
      {
        "timestamp": "2021-04-06T23:30:00.000Z",
        "value": 104.8076923077
      },
      {
        "timestamp": "2021-04-06T23:45:00.000Z",
        "value": 96.1538461538
      }
    ]
  },
  "pv_forecast": {
    "ID": "pymfm-pv",
    "metadata": {
      "latitude": 52.83,
      "longitude": 8.63,
      "height": 50,
      "timezone_abbrevation": "Europe",
      "utc_timeoffset": 0,
      "modelrun_utc": "2021-04-04 14:00:00+02:00",
      "modelrun_updatetime_utc": "2021-04-04 21:20:00+02:00",
      "kwp": 302,
      "slope": 30,
      "facing": 135,
      "tracking": null
    },
    "units": {
      "time": "ISO8601",
      "pvpower": "kW"
    },
    "pv_values": [
      {
        "timestamp": "2021-04-06T00:00:00.000Z",
        "value": 0.0
      },
      {
        "timestamp": "2021-04-06T00:15:00.000Z",
        "value": 0.0
      },
      {
        "timestamp": "2021-04-06T00:30:00.000Z",
        "value": 0.0
      },
      {
        "timestamp": "2021-04-06T00:45:00.000Z",
        "value": 0.0
      },
      {
        "timestamp": "2021-04-06T01:00:00.000Z",
        "value": 0.0
      },
      {
        "timestamp": "2021-04-06T01:15:00.000Z",
        "value": 0.0
      },
      {
        "timestamp": "2021-04-06T01:30:00.000Z",
        "value": 0.0
      },
      {
        "timestamp": "2021-04-06T01:45:00.000Z",
        "value": 0.0
      },
      {
        "timestamp": "2021-04-06T02:00:00.000Z",
        "value": 0.0
      },
      {
        "timestamp": "2021-04-06T02:15:00.000Z",
        "value": 0.0
      },
      {
        "timestamp": "2021-04-06T02:30:00.000Z",
        "value": 0.0
      },
      {
        "timestamp": "2021-04-06T02:45:00.000Z",
        "value": 0.0
      },
      {
        "timestamp": "2021-04-06T03:00:00.000Z",
        "value": 0.0
      },
      {
        "timestamp": "2021-04-06T03:15:00.000Z",
        "value": 0.0
      },
      {
        "timestamp": "2021-04-06T03:30:00.000Z",
        "value": 0.0
      },
      {
        "timestamp": "2021-04-06T03:45:00.000Z",
        "value": 0.0
      },
      {
        "timestamp": "2021-04-06T04:00:00.000Z",
        "value": 0.0
      },
      {
        "timestamp": "2021-04-06T04:15:00.000Z",
        "value": 0.0
      },
      {
        "timestamp": "2021-04-06T04:30:00.000Z",
        "value": 0.0
      },
      {
        "timestamp": "2021-04-06T04:45:00.000Z",
        "value": 0.0
      },
      {
        "timestamp": "2021-04-06T05:00:00.000Z",
        "value": 0.0
      },
      {
        "timestamp": "2021-04-06T05:15:00.000Z",
        "value": 0.0
      },
      {
        "timestamp": "2021-04-06T05:30:00.000Z",
        "value": 0.0
      },
      {
        "timestamp": "2021-04-06T05:45:00.000Z",
        "value": 0.0
      },
      {
        "timestamp": "2021-04-06T06:00:00.000Z",
        "value": 0.0
      },
      {
        "timestamp": "2021-04-06T06:15:00.000Z",
        "value": 0.0275
      },
      {
        "timestamp": "2021-04-06T06:30:00.000Z",
        "value": 0.055
      },
      {
        "timestamp": "2021-04-06T06:45:00.000Z",
        "value": 0.0825
      },
      {
        "timestamp": "2021-04-06T07:00:00.000Z",
        "value": 0.11
      },
      {
        "timestamp": "2021-04-06T07:15:00.000Z",
        "value": 6.585
      },
      {
        "timestamp": "2021-04-06T07:30:00.000Z",
        "value": 13.06
      },
      {
        "timestamp": "2021-04-06T07:45:00.000Z",
        "value": 19.535
      },
      {
        "timestamp": "2021-04-06T08:00:00.000Z",
        "value": 26.01
      },
      {
        "timestamp": "2021-04-06T08:15:00.000Z",
        "value": 38.9175
      },
      {
        "timestamp": "2021-04-06T08:30:00.000Z",
        "value": 51.825
      },
      {
        "timestamp": "2021-04-06T08:45:00.000Z",
        "value": 64.7325
      },
      {
        "timestamp": "2021-04-06T09:00:00.000Z",
        "value": 77.64
      },
      {
        "timestamp": "2021-04-06T09:15:00.000Z",
        "value": 88.93
      },
      {
        "timestamp": "2021-04-06T09:30:00.000Z",
        "value": 100.22
      },
      {
        "timestamp": "2021-04-06T09:45:00.000Z",
        "value": 111.51
      },
      {
        "timestamp": "2021-04-06T10:00:00.000Z",
        "value": 122.8
      },
      {
        "timestamp": "2021-04-06T10:15:00.000Z",
        "value": 131.525
      },
      {
        "timestamp": "2021-04-06T10:30:00.000Z",
        "value": 140.25
      },
      {
        "timestamp": "2021-04-06T10:45:00.000Z",
        "value": 148.975
      },
      {
        "timestamp": "2021-04-06T11:00:00.000Z",
        "value": 157.7
      },
      {
        "timestamp": "2021-04-06T11:15:00.000Z",
        "value": 162.81
      },
      {
        "timestamp": "2021-04-06T11:30:00.000Z",
        "value": 167.92
      },
      {
        "timestamp": "2021-04-06T11:45:00.000Z",
        "value": 173.03
      },
      {
        "timestamp": "2021-04-06T12:00:00.000Z",
        "value": 178.14
      },
      {
        "timestamp": "2021-04-06T12:15:00.000Z",
        "value": 179.645
      },
      {
        "timestamp": "2021-04-06T12:30:00.000Z",
        "value": 181.15
      },
      {
        "timestamp": "2021-04-06T12:45:00.000Z",
        "value": 182.655
      },
      {
        "timestamp": "2021-04-06T13:00:00.000Z",
        "value": 184.16
      },
      {
        "timestamp": "2021-04-06T13:15:00.000Z",
        "value": 181.76
      },
      {
        "timestamp": "2021-04-06T13:30:00.000Z",
        "value": 179.36
      },
      {
        "timestamp": "2021-04-06T13:45:00.000Z",
        "value": 176.96
      },
      {
        "timestamp": "2021-04-06T14:00:00.000Z",
        "value": 174.56
      },
      {
        "timestamp": "2021-04-06T14:15:00.000Z",
        "value": 168.3525
      },
      {
        "timestamp": "2021-04-06T14:30:00.000Z",
        "value": 162.145
      },
      {
        "timestamp": "2021-04-06T14:45:00.000Z",
        "value": 155.9375
      },
      {
        "timestamp": "2021-04-06T15:00:00.000Z",
        "value": 149.73
      },
      {
        "timestamp": "2021-04-06T15:15:00.000Z",
        "value": 140.74
      },
      {
        "timestamp": "2021-04-06T15:30:00.000Z",
        "value": 131.75
      },
      {
        "timestamp": "2021-04-06T15:45:00.000Z",
        "value": 122.76
      },
      {
        "timestamp": "2021-04-06T16:00:00.000Z",
        "value": 113.77
      },
      {
        "timestamp": "2021-04-06T16:15:00.000Z",
        "value": 102.6
      },
      {
        "timestamp": "2021-04-06T16:30:00.000Z",
        "value": 91.43
      },
      {
        "timestamp": "2021-04-06T16:45:00.000Z",
        "value": 80.26
      },
      {
        "timestamp": "2021-04-06T17:00:00.000Z",
        "value": 69.09
      },
      {
        "timestamp": "2021-04-06T17:15:00.000Z",
        "value": 58.1925
      },
      {
        "timestamp": "2021-04-06T17:30:00.000Z",
        "value": 47.295
      },
      {
        "timestamp": "2021-04-06T17:45:00.000Z",
        "value": 36.3975
      },
      {
        "timestamp": "2021-04-06T18:00:00.000Z",
        "value": 25.5
      },
      {
        "timestamp": "2021-04-06T18:15:00.000Z",
        "value": 21.2075
      },
      {
        "timestamp": "2021-04-06T18:30:00.000Z",
        "value": 16.915
      },
      {
        "timestamp": "2021-04-06T18:45:00.000Z",
        "value": 12.6225
      },
      {
        "timestamp": "2021-04-06T19:00:00.000Z",
        "value": 8.33
      },
      {
        "timestamp": "2021-04-06T19:15:00.000Z",
        "value": 7.22
      },
      {
        "timestamp": "2021-04-06T19:30:00.000Z",
        "value": 6.11
      },
      {
        "timestamp": "2021-04-06T19:45:00.000Z",
        "value": 5.0
      },
      {
        "timestamp": "2021-04-06T20:00:00.000Z",
        "value": 3.89
      },
      {
        "timestamp": "2021-04-06T20:15:00.000Z",
        "value": 2.92
      },
      {
        "timestamp": "2021-04-06T20:30:00.000Z",
        "value": 1.95
      },
      {
        "timestamp": "2021-04-06T20:45:00.000Z",
        "value": 0.98
      },
      {
        "timestamp": "2021-04-06T21:00:00.000Z",
        "value": 0.01
      },
      {
        "timestamp": "2021-04-06T21:15:00.000Z",
        "value": 0.0075
      },
      {
        "timestamp": "2021-04-06T21:30:00.000Z",
        "value": 0.005
      },
      {
        "timestamp": "2021-04-06T21:45:00.000Z",
        "value": 0.0025
      },
      {
        "timestamp": "2021-04-06T22:00:00.000Z",
        "value": 0.0
      },
      {
        "timestamp": "2021-04-06T22:15:00.000Z",
        "value": 0.0
      },
      {
        "timestamp": "2021-04-06T22:30:00.000Z",
        "value": 0.0
      },
      {
        "timestamp": "2021-04-06T22:45:00.000Z",
        "value": 0.0
      },
      {
        "timestamp": "2021-04-06T23:00:00.000Z",
        "value": 0.0
      },
      {
        "timestamp": "2021-04-06T23:15:00.000Z",
        "value": 0.0
      },
      {
        "timestamp": "2021-04-06T23:30:00.000Z",
        "value": 0.0
      },
      {
        "timestamp": "2021-04-06T23:45:00.000Z",
        "value": 0.0
      }
    ]
  }
}