{
  "application": "pymfm",
  "start_forecast": "2021-04-08T00:00:00Z",
  "end_forecast": "2021-04-08T23:45:00Z",
  "household_sta": {
    "ID": "pymfm-slp",
    "metadata": {
      "households": 90,
      "avgconsumption": 3000,
      "addon": 0,
      "timezone_abbrevation": "Europe",
      "utc_timeoffset": 0
    },
    "units": {
      "time": "ISO8601",
      "householdpower": "W"
    },
    "slp_values": [
      {
        "timestamp": "2021-04-08T00:00:00.000Z",
        "value": 86.5384615385
      },
      {
        "timestamp": "2021-04-08T00:15:00.000Z",
        "value": 77.8846153846
      },
      {
        "timestamp": "2021-04-08T00:30:00.000Z",
        "value": 69.2307692308
      },
      {
        "timestamp": "2021-04-08T00:45:00.000Z",
        "value": 62.5
      },
      {
        "timestamp": "2021-04-08T01:00:00.000Z",
        "value": 56.7307692308
      },
      {
        "timestamp": "2021-04-08T01:15:00.000Z",
        "value": 51.9230769231
      },
      {
        "timestamp": "2021-04-08T01:30:00.000Z",
        "value": 50.0
      },
      {
        "timestamp": "2021-04-08T01:45:00.000Z",
        "value": 48.0769230769
      },
      {
        "timestamp": "2021-04-08T02:00:00.000Z",
        "value": 46.1538461538
      },
      {
        "timestamp": "2021-04-08T02:15:00.000Z",
        "value": 45.1923076923
      },
      {
        "timestamp": "2021-04-08T02:30:00.000Z",
        "value": 44.2307692308
      },
      {
        "timestamp": "2021-04-08T02:45:00.000Z",
        "value": 43.2692307692
      },
      {
        "timestamp": "2021-04-08T03:00:00.000Z",
        "value": 43.2692307692
      },
      {
        "timestamp": "2021-04-08T03:15:00.000Z",
        "value": 43.2692307692
      },
      {
        "timestamp": "2021-04-08T03:30:00.000Z",
        "value": 43.2692307692
      },
      {
        "timestamp": "2021-04-08T03:45:00.000Z",
        "value": 43.2692307692
      },
      {
        "timestamp": "2021-04-08T04:00:00.000Z",
        "value": 43.2692307692
      },
      {
        "timestamp": "2021-04-08T04:15:00.000Z",
        "value": 43.2692307692
      },
      {
        "timestamp": "2021-04-08T04:30:00.000Z",
        "value": 43.2692307692
      },
      {
        "timestamp": "2021-04-08T04:45:00.000Z",
        "value": 44.2307692308
      },
      {
        "timestamp": "2021-04-08T05:00:00.000Z",
        "value": 45.1923076923
      },
      {
        "timestamp": "2021-04-08T05:15:00.000Z",
        "value": 46.1538461538
      },
      {
        "timestamp": "2021-04-08T05:30:00.000Z",
        "value": 49.0384615385
      },
      {
        "timestamp": "2021-04-08T05:45:00.000Z",
        "value": 53.8461538462
      },
      {
        "timestamp": "2021-04-08T06:00:00.000Z",
        "value": 61.5384615385
      },
      {
        "timestamp": "2021-04-08T06:15:00.000Z",
        "value": 73.0769230769
      },
      {
        "timestamp": "2021-04-08T06:30:00.000Z",
        "value": 85.5769230769
      },
      {
        "timestamp": "2021-04-08T06:45:00.000Z",
        "value": 100.0
      },
      {
        "timestamp": "2021-04-08T07:00:00.000Z",
        "value": 112.5
      },
      {
        "timestamp": "2021-04-08T07:15:00.000Z",
        "value": 121.1538461538
      },
      {
        "timestamp": "2021-04-08T07:30:00.000Z",
        "value": 127.8846153846
      },
      {
        "timestamp": "2021-04-08T07:45:00.000Z",
        "value": 132.6923076923
      },
      {
        "timestamp": "2021-04-08T08:00:00.000Z",
        "value": 135.5769230769
      },
      {
        "timestamp": "2021-04-08T08:15:00.000Z",
        "value": 136.5384615385
      },
      {
        "timestamp": "2021-04-08T08:30:00.000Z",
        "value": 137.5
      },
      {
        "timestamp": "2021-04-08T08:45:00.000Z",
        "value": 137.5
      },
      {
        "timestamp": "2021-04-08T09:00:00.000Z",
        "value": 136.5384615385
      },
      {
        "timestamp": "2021-04-08T09:15:00.000Z",
        "value": 136.5384615385
      },
      {
        "timestamp": "2021-04-08T09:30:00.000Z",
        "value": 135.5769230769
      },
      {
        "timestamp": "2021-04-08T09:45:00.000Z",
        "value": 135.5769230769
      },
      {
        "timestamp": "2021-04-08T10:00:00.000Z",
        "value": 134.6153846154
      },
      {
        "timestamp": "2021-04-08T10:15:00.000Z",
        "value": 133.6538461538
      },
      {
        "timestamp": "2021-04-08T10:30:00.000Z",
        "value": 131.7307692308
      },
      {
        "timestamp": "2021-04-08T10:45:00.000Z",
        "value": 130.7692307692
      },
      {
        "timestamp": "2021-04-08T11:00:00.000Z",
        "value": 129.8076923077
      },
      {
        "timestamp": "2021-04-08T11:15:00.000Z",
        "value": 129.8076923077
      },
      {
        "timestamp": "2021-04-08T11:30:00.000Z",
        "value": 130.7692307692
      },
      {
        "timestamp": "2021-04-08T11:45:00.000Z",
        "value": 132.6923076923
      },
      {
        "timestamp": "2021-04-08T12:00:00.000Z",
        "value": 136.5384615385
      },
      {
        "timestamp": "2021-04-08T12:15:00.000Z",
        "value": 142.3076923077
      },
      {
        "timestamp": "2021-04-08T12:30:00.000Z",
        "value": 148.0769230769
      },
      {
        "timestamp": "2021-04-08T12:45:00.000Z",
        "value": 151.9230769231
      },
      {
        "timestamp": "2021-04-08T13:00:00.000Z",
        "value": 153.8461538462
      },
      {
        "timestamp": "2021-04-08T13:15:00.000Z",
        "value": 152.8846153846
      },
      {
        "timestamp": "2021-04-08T13:30:00.000Z",
        "value": 148.0769230769
      },
      {
        "timestamp": "2021-04-08T13:45:00.000Z",
        "value": 142.3076923077
      },
      {
        "timestamp": "2021-04-08T14:00:00.000Z",
        "value": 136.5384615385
      },
      {
        "timestamp": "2021-04-08T14:15:00.000Z",
        "value": 131.7307692308
      },
      {
        "timestamp": "2021-04-08T14:30:00.000Z",
        "value": 127.8846153846
      },
      {
        "timestamp": "2021-04-08T14:45:00.000Z",
        "value": 124.0384615385
      },
      {
        "timestamp": "2021-04-08T15:00:00.000Z",
        "value": 121.1538461538
      },
      {
        "timestamp": "2021-04-08T15:15:00.000Z",
        "value": 117.3076923077
      },
      {
        "timestamp": "2021-04-08T15:30:00.000Z",
        "value": 114.4230769231
      },
      {
        "timestamp": "2021-04-08T15:45:00.000Z",
        "value": 111.5384615385
      },
      {
        "timestamp": "2021-04-08T16:00:00.000Z",
        "value": 108.6538461538
      },
      {
        "timestamp": "2021-04-08T16:15:00.000Z",
        "value": 106.7307692308
      },
      {
        "timestamp": "2021-04-08T16:30:00.000Z",
        "value": 105.7692307692
      },
      {
        "timestamp": "2021-04-08T16:45:00.000Z",
        "value": 104.8076923077
      },
      {
        "timestamp": "2021-04-08T17:00:00.000Z",
        "value": 105.7692307692
      },
      {
        "timestamp": "2021-04-08T17:15:00.000Z",
        "value": 108.6538461538
      },
      {
        "timestamp": "2021-04-08T17:30:00.000Z",
        "value": 112.5
      },
      {
        "timestamp": "2021-04-08T17:45:00.000Z",
        "value": 118.2692307692
      },
      {
        "timestamp": "2021-04-08T18:00:00.000Z",
        "value": 124.0384615385
      },
      {
        "timestamp": "2021-04-08T18:15:00.000Z",
        "value": 131.7307692308
      },
      {
        "timestamp": "2021-04-08T18:30:00.000Z",
        "value": 140.3846153846
      },
      {
        "timestamp": "2021-04-08T18:45:00.000Z",
        "value": 149.0384615385
      },
      {
        "timestamp": "2021-04-08T19:00:00.000Z",
        "value": 156.7307692308
      },
      {
        "timestamp": "2021-04-08T19:15:00.000Z",
        "value": 164.4230769231
      },
      {
        "timestamp": "2021-04-08T19:30:00.000Z",
        "value": 170.1923076923
      },
      {
        "timestamp": "2021-04-08T19:45:00.000Z",
        "value": 175.0
      },
      {
        "timestamp": "2021-04-08T20:00:00.000Z",
        "value": 175.9615384615
      },
      {
        "timestamp": "2021-04-08T20:15:00.000Z",
        "value": 174.0384615385
      },
      {
        "timestamp": "2021-04-08T20:30:00.000Z",
        "value": 170.1923076923
      },
      {
        "timestamp": "2021-04-08T20:45:00.000Z",
        "value": 165.3846153846
      },
      {
        "timestamp": "2021-04-08T21:00:00.000Z",
        "value": 160.5769230769
      },
      {
        "timestamp": "2021-04-08T21:15:00.000Z",
        "value": 158.6538461538
      },
      {
        "timestamp": "2021-04-08T21:30:00.000Z",
        "value": 156.7307692308
      },
      {
        "timestamp": "2021-04-08T21:45:00.000Z",
        "value": 154.8076923077
      },
      {
        "timestamp": "2021-04-08T22:00:00.000Z",
        "value": 151.9230769231
      },
      {
        "timestamp": "2021-04-08T22:15:00.000Z",
        "value": 147.1153846154
      },
      {
        "timestamp": "2021-04-08T22:30:00.000Z",
        "value": 139.4230769231
      },
      {
        "timestamp": "2021-04-08T22:45:00.000Z",
        "value": 131.7307692308
      },
      {
        "timestamp": "2021-04-08T23:00:00.000Z",
        "value": 123.0769230769
      },
      {
        "timestamp": "2021-04-08T23:15:00.000Z",
        "value": 113.4615384615
      },
      {
        "timestamp": "2021-04-08T23:30:00.000Z",
        "value": 104.8076923077
      },
      {
        "timestamp": "2021-04-08T23:45:00.000Z",
        "value": 95.1923076923
      }
    ]
  },
  "pv_forecast": {
    "ID": "pymfm-pv",
    "metadata": {
      "latitude": 52.83,
      "longitude": 8.63,
      "height": 50,
      "timezone_abbrevation": "Europe",
      "utc_timeoffset": 0,
      "modelrun_utc": "2021-04-06 14:00:00+02:00",
      "modelrun_updatetime_utc": "2021-04-06 21:18:00+02:00",
      "kwp": 302,
      "slope": 30,
      "facing": 135,
      "tracking": null
    },
    "units": {
      "time": "ISO8601",
      "pvpower": "kW"
    },
    "pv_values": [
      {
        "timestamp": "2021-04-08T00:00:00.000Z",
        "value": 0.0
      },
      {
        "timestamp": "2021-04-08T00:15:00.000Z",
        "value": 0.0
      },
      {
        "timestamp": "2021-04-08T00:30:00.000Z",
        "value": 0.0
      },
      {
        "timestamp": "2021-04-08T00:45:00.000Z",
        "value": 0.0
      },
      {
        "timestamp": "2021-04-08T01:00:00.000Z",
        "value": 0.0
      },
      {
        "timestamp": "2021-04-08T01:15:00.000Z",
        "value": 0.0
      },
      {
        "timestamp": "2021-04-08T01:30:00.000Z",
        "value": 0.0
      },
      {
        "timestamp": "2021-04-08T01:45:00.000Z",
        "value": 0.0
      },
      {
        "timestamp": "2021-04-08T02:00:00.000Z",
        "value": 0.0
      },
      {
        "timestamp": "2021-04-08T02:15:00.000Z",
        "value": 0.0
      },
      {
        "timestamp": "2021-04-08T02:30:00.000Z",
        "value": 0.0
      },
      {
        "timestamp": "2021-04-08T02:45:00.000Z",
        "value": 0.0
      },
      {
        "timestamp": "2021-04-08T03:00:00.000Z",
        "value": 0.0
      },
      {
        "timestamp": "2021-04-08T03:15:00.000Z",
        "value": 0.0
      },
      {
        "timestamp": "2021-04-08T03:30:00.000Z",
        "value": 0.0
      },
      {
        "timestamp": "2021-04-08T03:45:00.000Z",
        "value": 0.0
      },
      {
        "timestamp": "2021-04-08T04:00:00.000Z",
        "value": 0.0
      },
      {
        "timestamp": "2021-04-08T04:15:00.000Z",
        "value": 0.0
      },
      {
        "timestamp": "2021-04-08T04:30:00.000Z",
        "value": 0.0
      },
      {
        "timestamp": "2021-04-08T04:45:00.000Z",
        "value": 0.0
      },
      {
        "timestamp": "2021-04-08T05:00:00.000Z",
        "value": 0.0
      },
      {
        "timestamp": "2021-04-08T05:15:00.000Z",
        "value": 0.0
      },
      {
        "timestamp": "2021-04-08T05:30:00.000Z",
        "value": 0.0
      },
      {
        "timestamp": "2021-04-08T05:45:00.000Z",
        "value": 0.0
      },
      {
        "timestamp": "2021-04-08T06:00:00.000Z",
        "value": 0.0
      },
      {
        "timestamp": "2021-04-08T06:15:00.000Z",
        "value": 0.0725
      },
      {
        "timestamp": "2021-04-08T06:30:00.000Z",
        "value": 0.145
      },
      {
        "timestamp": "2021-04-08T06:45:00.000Z",
        "value": 0.2175
      },
      {
        "timestamp": "2021-04-08T07:00:00.000Z",
        "value": 0.29
      },
      {
        "timestamp": "2021-04-08T07:15:00.000Z",
        "value": 8.2175
      },
      {
        "timestamp": "2021-04-08T07:30:00.000Z",
        "value": 16.145
      },
      {
        "timestamp": "2021-04-08T07:45:00.000Z",
        "value": 24.0725
      },
      {
        "timestamp": "2021-04-08T08:00:00.000Z",
        "value": 32.0
      },
      {
        "timestamp": "2021-04-08T08:15:00.000Z",
        "value": 42.7825
      },
      {
        "timestamp": "2021-04-08T08:30:00.000Z",
        "value": 53.565
      },
      {
        "timestamp": "2021-04-08T08:45:00.000Z",
        "value": 64.3475
      },
      {
        "timestamp": "2021-04-08T09:00:00.000Z",
        "value": 75.13
      },
      {
        "timestamp": "2021-04-08T09:15:00.000Z",
        "value": 86.5325
      },
      {
        "timestamp": "2021-04-08T09:30:00.000Z",
        "value": 97.935
      },
      {
        "timestamp": "2021-04-08T09:45:00.000Z",
        "value": 109.3375
      },
      {
        "timestamp": "2021-04-08T10:00:00.000Z",
        "value": 120.74
      },
      {
        "timestamp": "2021-04-08T10:15:00.000Z",
        "value": 127.6
      },
      {
        "timestamp": "2021-04-08T10:30:00.000Z",
        "value": 134.46
      },
      {
        "timestamp": "2021-04-08T10:45:00.000Z",
        "value": 141.32
      },
      {
        "timestamp": "2021-04-08T11:00:00.000Z",
        "value": 148.18
      },
      {
        "timestamp": "2021-04-08T11:15:00.000Z",
        "value": 149.1325
      },
      {
        "timestamp": "2021-04-08T11:30:00.000Z",
        "value": 150.085
      },
      {
        "timestamp": "2021-04-08T11:45:00.000Z",
        "value": 151.0375
      },
      {
        "timestamp": "2021-04-08T12:00:00.000Z",
        "value": 151.99
      },
      {
        "timestamp": "2021-04-08T12:15:00.000Z",
        "value": 145.785
      },
      {
        "timestamp": "2021-04-08T12:30:00.000Z",
        "value": 139.58
      },
      {
        "timestamp": "2021-04-08T12:45:00.000Z",
        "value": 133.375
      },
      {
        "timestamp": "2021-04-08T13:00:00.000Z",
        "value": 127.17
      },
      {
        "timestamp": "2021-04-08T13:15:00.000Z",
        "value": 120.1075
      },
      {
        "timestamp": "2021-04-08T13:30:00.000Z",
        "value": 113.045
      },
      {
        "timestamp": "2021-04-08T13:45:00.000Z",
        "value": 105.9825
      },
      {
        "timestamp": "2021-04-08T14:00:00.000Z",
        "value": 98.92
      },
      {
        "timestamp": "2021-04-08T14:15:00.000Z",
        "value": 95.34
      },
      {
        "timestamp": "2021-04-08T14:30:00.000Z",
        "value": 91.76
      },
      {
        "timestamp": "2021-04-08T14:45:00.000Z",
        "value": 88.18
      },
      {
        "timestamp": "2021-04-08T15:00:00.000Z",
        "value": 84.6
      },
      {
        "timestamp": "2021-04-08T15:15:00.000Z",
        "value": 80.0625
      },
      {
        "timestamp": "2021-04-08T15:30:00.000Z",
        "value": 75.525
      },
      {
        "timestamp": "2021-04-08T15:45:00.000Z",
        "value": 70.9875
      },
      {
        "timestamp": "2021-04-08T16:00:00.000Z",
        "value": 66.45
      },
      {
        "timestamp": "2021-04-08T16:15:00.000Z",
        "value": 61.0175
      },
      {
        "timestamp": "2021-04-08T16:30:00.000Z",
        "value": 55.585
      },
      {
        "timestamp": "2021-04-08T16:45:00.000Z",
        "value": 50.1525
      },
      {
        "timestamp": "2021-04-08T17:00:00.000Z",
        "value": 44.72
      },
      {
        "timestamp": "2021-04-08T17:15:00.000Z",
        "value": 38.73
      },
      {
        "timestamp": "2021-04-08T17:30:00.000Z",
        "value": 32.74
      },
      {
        "timestamp": "2021-04-08T17:45:00.000Z",
        "value": 26.75
      },
      {
        "timestamp": "2021-04-08T18:00:00.000Z",
        "value": 20.76
      },
      {
        "timestamp": "2021-04-08T18:15:00.000Z",
        "value": 17.4425
      },
      {
        "timestamp": "2021-04-08T18:30:00.000Z",
        "value": 14.125
      },
      {
        "timestamp": "2021-04-08T18:45:00.000Z",
        "value": 10.8075
      },
      {
        "timestamp": "2021-04-08T19:00:00.000Z",
        "value": 7.49
      },
      {
        "timestamp": "2021-04-08T19:15:00.000Z",
        "value": 6.91
      },
      {
        "timestamp": "2021-04-08T19:30:00.000Z",
        "value": 6.33
      },
      {
        "timestamp": "2021-04-08T19:45:00.000Z",
        "value": 5.75
      },
      {
        "timestamp": "2021-04-08T20:00:00.000Z",
        "value": 5.17
      },
      {
        "timestamp": "2021-04-08T20:15:00.000Z",
        "value": 3.905
      },
      {
        "timestamp": "2021-04-08T20:30:00.000Z",
        "value": 2.64
      },
      {
        "timestamp": "2021-04-08T20:45:00.000Z",
        "value": 1.375
      },
      {
        "timestamp": "2021-04-08T21:00:00.000Z",
        "value": 0.11
      },
      {
        "timestamp": "2021-04-08T21:15:00.000Z",
        "value": 0.0825
      },
      {
        "timestamp": "2021-04-08T21:30:00.000Z",
        "value": 0.055
      },
      {
        "timestamp": "2021-04-08T21:45:00.000Z",
        "value": 0.0275
      },
      {
        "timestamp": "2021-04-08T22:00:00.000Z",
        "value": 0.0
      },
      {
        "timestamp": "2021-04-08T22:15:00.000Z",
        "value": 0.0
      },
      {
        "timestamp": "2021-04-08T22:30:00.000Z",
        "value": 0.0
      },
      {
        "timestamp": "2021-04-08T22:45:00.000Z",
        "value": 0.0
      },
      {
        "timestamp": "2021-04-08T23:00:00.000Z",
        "value": 0.0
      },
      {
        "timestamp": "2021-04-08T23:15:00.000Z",
        "value": 0.0
      },
      {
        "timestamp": "2021-04-08T23:30:00.000Z",
        "value": 0.0
      },
      {
        "timestamp": "2021-04-08T23:45:00.000Z",
        "value": 0.0
      }
    ]
  }
}