{
  "application": "pymfm",
  "start_forecast": "2021-04-12T00:00:00Z",
  "end_forecast": "2021-04-12T23:45:00Z",
  "household_sta": {
    "ID": "pymfm-slp",
    "metadata": {
      "households": 90,
      "avgconsumption": 3000,
      "addon": 0,
      "timezone_abbrevation": "Europe",
      "utc_timeoffset": 0
    },
    "units": {
      "time": "ISO8601",
      "householdpower": "W"
    },
    "slp_values": [
      {
        "timestamp": "2021-04-12T00:00:00.000Z",
        "value": 86.2745098039
      },
      {
        "timestamp": "2021-04-12T00:15:00.000Z",
        "value": 77.4509803922
      },
      {
        "timestamp": "2021-04-12T00:30:00.000Z",
        "value": 69.6078431373
      },
      {
        "timestamp": "2021-04-12T00:45:00.000Z",
        "value": 62.7450980392
      },
      {
        "timestamp": "2021-04-12T01:00:00.000Z",
        "value": 56.862745098
      },
      {
        "timestamp": "2021-04-12T01:15:00.000Z",
        "value": 52.9411764706
      },
      {
        "timestamp": "2021-04-12T01:30:00.000Z",
        "value": 50.0
      },
      {
        "timestamp": "2021-04-12T01:45:00.000Z",
        "value": 48.0392156863
      },
      {
        "timestamp": "2021-04-12T02:00:00.000Z",
        "value": 47.0588235294
      },
      {
        "timestamp": "2021-04-12T02:15:00.000Z",
        "value": 45.0980392157
      },
      {
        "timestamp": "2021-04-12T02:30:00.000Z",
        "value": 44.1176470588
      },
      {
        "timestamp": "2021-04-12T02:45:00.000Z",
        "value": 44.1176470588
      },
      {
        "timestamp": "2021-04-12T03:00:00.000Z",
        "value": 43.137254902
      },
      {
        "timestamp": "2021-04-12T03:15:00.000Z",
        "value": 43.137254902
      },
      {
        "timestamp": "2021-04-12T03:30:00.000Z",
        "value": 43.137254902
      },
      {
        "timestamp": "2021-04-12T03:45:00.000Z",
        "value": 43.137254902
      },
      {
        "timestamp": "2021-04-12T04:00:00.000Z",
        "value": 43.137254902
      },
      {
        "timestamp": "2021-04-12T04:15:00.000Z",
        "value": 43.137254902
      },
      {
        "timestamp": "2021-04-12T04:30:00.000Z",
        "value": 44.1176470588
      },
      {
        "timestamp": "2021-04-12T04:45:00.000Z",
        "value": 44.1176470588
      },
      {
        "timestamp": "2021-04-12T05:00:00.000Z",
        "value": 45.0980392157
      },
      {
        "timestamp": "2021-04-12T05:15:00.000Z",
        "value": 46.0784313725
      },
      {
        "timestamp": "2021-04-12T05:30:00.000Z",
        "value": 49.0196078431
      },
      {
        "timestamp": "2021-04-12T05:45:00.000Z",
        "value": 53.9215686275
      },
      {
        "timestamp": "2021-04-12T06:00:00.000Z",
        "value": 61.7647058824
      },
      {
        "timestamp": "2021-04-12T06:15:00.000Z",
        "value": 72.5490196078
      },
      {
        "timestamp": "2021-04-12T06:30:00.000Z",
        "value": 86.2745098039
      },
      {
        "timestamp": "2021-04-12T06:45:00.000Z",
        "value": 100.0
      },
      {
        "timestamp": "2021-04-12T07:00:00.000Z",
        "value": 112.7450980392
      },
      {
        "timestamp": "2021-04-12T07:15:00.000Z",
        "value": 121.568627451
      },
      {
        "timestamp": "2021-04-12T07:30:00.000Z",
        "value": 128.431372549
      },
      {
        "timestamp": "2021-04-12T07:45:00.000Z",
        "value": 133.3333333333
      },
      {
        "timestamp": "2021-04-12T08:00:00.000Z",
        "value": 136.2745098039
      },
      {
        "timestamp": "2021-04-12T08:15:00.000Z",
        "value": 137.2549019608
      },
      {
        "timestamp": "2021-04-12T08:30:00.000Z",
        "value": 138.2352941176
      },
      {
        "timestamp": "2021-04-12T08:45:00.000Z",
        "value": 138.2352941176
      },
      {
        "timestamp": "2021-04-12T09:00:00.000Z",
        "value": 137.2549019608
      },
      {
        "timestamp": "2021-04-12T09:15:00.000Z",
        "value": 137.2549019608
      },
      {
        "timestamp": "2021-04-12T09:30:00.000Z",
        "value": 136.2745098039
      },
      {
        "timestamp": "2021-04-12T09:45:00.000Z",
        "value": 136.2745098039
      },
      {
        "timestamp": "2021-04-12T10:00:00.000Z",
        "value": 135.2941176471
      },
      {
        "timestamp": "2021-04-12T10:15:00.000Z",
        "value": 134.3137254902
      },
      {
        "timestamp": "2021-04-12T10:30:00.000Z",
        "value": 132.3529411765
      },
      {
        "timestamp": "2021-04-12T10:45:00.000Z",
        "value": 131.3725490196
      },
      {
        "timestamp": "2021-04-12T11:00:00.000Z",
        "value": 130.3921568627
      },
      {
        "timestamp": "2021-04-12T11:15:00.000Z",
        "value": 130.3921568627
      },
      {
        "timestamp": "2021-04-12T11:30:00.000Z",
        "value": 131.3725490196
      },
      {
        "timestamp": "2021-04-12T11:45:00.000Z",
        "value": 133.3333333333
      },
      {
        "timestamp": "2021-04-12T12:00:00.000Z",
        "value": 137.2549019608
      },
      {
        "timestamp": "2021-04-12T12:15:00.000Z",
        "value": 143.137254902
      },
      {
        "timestamp": "2021-04-12T12:30:00.000Z",
        "value": 148.0392156863
      },
      {
        "timestamp": "2021-04-12T12:45:00.000Z",
        "value": 152.9411764706
      },
      {
        "timestamp": "2021-04-12T13:00:00.000Z",
        "value": 154.9019607843
      },
      {
        "timestamp": "2021-04-12T13:15:00.000Z",
        "value": 152.9411764706
      },
      {
        "timestamp": "2021-04-12T13:30:00.000Z",
        "value": 149.0196078431
      },
      {
        "timestamp": "2021-04-12T13:45:00.000Z",
        "value": 143.137254902
      },
      {
        "timestamp": "2021-04-12T14:00:00.000Z",
        "value": 137.2549019608
      },
      {
        "timestamp": "2021-04-12T14:15:00.000Z",
        "value": 132.3529411765
      },
      {
        "timestamp": "2021-04-12T14:30:00.000Z",
        "value": 128.431372549
      },
      {
        "timestamp": "2021-04-12T14:45:00.000Z",
        "value": 124.5098039216
      },
      {
        "timestamp": "2021-04-12T15:00:00.000Z",
        "value": 121.568627451
      },
      {
        "timestamp": "2021-04-12T15:15:00.000Z",
        "value": 118.6274509804
      },
      {
        "timestamp": "2021-04-12T15:30:00.000Z",
        "value": 114.7058823529
      },
      {
        "timestamp": "2021-04-12T15:45:00.000Z",
        "value": 111.7647058824
      },
      {
        "timestamp": "2021-04-12T16:00:00.000Z",
        "value": 108.8235294118
      },
      {
        "timestamp": "2021-04-12T16:15:00.000Z",
        "value": 106.862745098
      },
      {
        "timestamp": "2021-04-12T16:30:00.000Z",
        "value": 105.8823529412
      },
      {
        "timestamp": "2021-04-12T16:45:00.000Z",
        "value": 105.8823529412
      },
      {
        "timestamp": "2021-04-12T17:00:00.000Z",
        "value": 106.862745098
      },
      {
        "timestamp": "2021-04-12T17:15:00.000Z",
        "value": 108.8235294118
      },
      {
        "timestamp": "2021-04-12T17:30:00.000Z",
        "value": 112.7450980392
      },
      {
        "timestamp": "2021-04-12T17:45:00.000Z",
        "value": 118.6274509804
      },
      {
        "timestamp": "2021-04-12T18:00:00.000Z",
        "value": 124.5098039216
      },
      {
        "timestamp": "2021-04-12T18:15:00.000Z",
        "value": 132.3529411765
      },
      {
        "timestamp": "2021-04-12T18:30:00.000Z",
        "value": 141.1764705882
      },
      {
        "timestamp": "2021-04-12T18:45:00.000Z",
        "value": 149.0196078431
      },
      {
        "timestamp": "2021-04-12T19:00:00.000Z",
        "value": 157.8431372549
      },
      {
        "timestamp": "2021-04-12T19:15:00.000Z",
        "value": 164.7058823529
      },
      {
        "timestamp": "2021-04-12T19:30:00.000Z",
        "value": 171.568627451
      },
      {
        "timestamp": "2021-04-12T19:45:00.000Z",
        "value": 175.4901960784
      },
      {
        "timestamp": "2021-04-12T20:00:00.000Z",
        "value": 176.4705882353
      },
      {
        "timestamp": "2021-04-12T20:15:00.000Z",
        "value": 174.5098039216
      },
      {
        "timestamp": "2021-04-12T20:30:00.000Z",
        "value": 170.5882352941
      },
      {
        "timestamp": "2021-04-12T20:45:00.000Z",
        "value": 165.6862745098
      },
      {
        "timestamp": "2021-04-12T21:00:00.000Z",
        "value": 161.7647058824
      },
      {
        "timestamp": "2021-04-12T21:15:00.000Z",
        "value": 158.8235294118
      },
      {
        "timestamp": "2021-04-12T21:30:00.000Z",
        "value": 157.8431372549
      },
      {
        "timestamp": "2021-04-12T21:45:00.000Z",
        "value": 155.8823529412
      },
      {
        "timestamp": "2021-04-12T22:00:00.000Z",
        "value": 151.9607843137
      },
      {
        "timestamp": "2021-04-12T22:15:00.000Z",
        "value": 147.0588235294
      },
      {
        "timestamp": "2021-04-12T22:30:00.000Z",
        "value": 140.1960784314
      },
      {
        "timestamp": "2021-04-12T22:45:00.000Z",
        "value": 132.3529411765
      },
      {
        "timestamp": "2021-04-12T23:00:00.000Z",
        "value": 123.5294117647
      },
      {
        "timestamp": "2021-04-12T23:15:00.000Z",
        "value": 113.7254901961
      },
      {
        "timestamp": "2021-04-12T23:30:00.000Z",
        "value": 104.9019607843
      },
      {
        "timestamp": "2021-04-12T23:45:00.000Z",
        "value": 96.0784313725
      }
    ]
  },
  "pv_forecast": {
    "ID": "pymfm-pv",
    "metadata": {
      "latitude": 52.83,
      "longitude": 8.63,
      "height": 50,
      "timezone_abbrevation": "Europe",
      "utc_timeoffset": 0,
      "modelrun_utc": "2021-04-10 14:00:00+02:00",
      "modelrun_updatetime_utc": "2021-04-10 21:22:00+02:00",
      "kwp": 302,
      "slope": 30,
      "facing": 135,
      "tracking": null
    },
    "units": {
      "time": "ISO8601",
      "pvpower": "kW"
    },
    "pv_values": [
      {
        "timestamp": "2021-04-12T00:00:00.000Z",
        "value": 0.0
      },
      {
        "timestamp": "2021-04-12T00:15:00.000Z",
        "value": 0.0
      },
      {
        "timestamp": "2021-04-12T00:30:00.000Z",
        "value": 0.0
      },
      {
        "timestamp": "2021-04-12T00:45:00.000Z",
        "value": 0.0
      },
      {
        "timestamp": "2021-04-12T01:00:00.000Z",
        "value": 0.0
      },
      {
        "timestamp": "2021-04-12T01:15:00.000Z",
        "value": 0.0
      },
      {
        "timestamp": "2021-04-12T01:30:00.000Z",
        "value": 0.0
      },
      {
        "timestamp": "2021-04-12T01:45:00.000Z",
        "value": 0.0
      },
      {
        "timestamp": "2021-04-12T02:00:00.000Z",
        "value": 0.0
      },
      {
        "timestamp": "2021-04-12T02:15:00.000Z",
        "value": 0.0
      },
      {
        "timestamp": "2021-04-12T02:30:00.000Z",
        "value": 0.0
      },
      {
        "timestamp": "2021-04-12T02:45:00.000Z",
        "value": 0.0
      },
      {
        "timestamp": "2021-04-12T03:00:00.000Z",
        "value": 0.0
      },
      {
        "timestamp": "2021-04-12T03:15:00.000Z",
        "value": 0.0
      },
      {
        "timestamp": "2021-04-12T03:30:00.000Z",
        "value": 0.0
      },
      {
        "timestamp": "2021-04-12T03:45:00.000Z",
        "value": 0.0
      },
      {
        "timestamp": "2021-04-12T04:00:00.000Z",
        "value": 0.0
      },
      {
        "timestamp": "2021-04-12T04:15:00.000Z",
        "value": 0.0
      },
      {
        "timestamp": "2021-04-12T04:30:00.000Z",
        "value": 0.0
      },
      {
        "timestamp": "2021-04-12T04:45:00.000Z",
        "value": 0.0
      },
      {
        "timestamp": "2021-04-12T05:00:00.000Z",
        "value": 0.0
      },
      {
        "timestamp": "2021-04-12T05:15:00.000Z",
        "value": 0.0
      },
      {
        "timestamp": "2021-04-12T05:30:00.000Z",
        "value": 0.0
      },
      {
        "timestamp": "2021-04-12T05:45:00.000Z",
        "value": 0.0
      },
      {
        "timestamp": "2021-04-12T06:00:00.000Z",
        "value": 0.0
      },
      {
        "timestamp": "2021-04-12T06:15:00.000Z",
        "value": 0.2925
      },
      {
        "timestamp": "2021-04-12T06:30:00.000Z",
        "value": 0.585
      },
      {
        "timestamp": "2021-04-12T06:45:00.000Z",
        "value": 0.8775
      },
      {
        "timestamp": "2021-04-12T07:00:00.000Z",
        "value": 1.17
      },
      {
        "timestamp": "2021-04-12T07:15:00.000Z",
        "value": 9.7525
      },
      {
        "timestamp": "2021-04-12T07:30:00.000Z",
        "value": 18.335
      },
      {
        "timestamp": "2021-04-12T07:45:00.000Z",
        "value": 26.9175
      },
      {
        "timestamp": "2021-04-12T08:00:00.000Z",
        "value": 35.5
      },
      {
        "timestamp": "2021-04-12T08:15:00.000Z",
        "value": 48.2725
      },
      {
        "timestamp": "2021-04-12T08:30:00.000Z",
        "value": 61.045
      },
      {
        "timestamp": "2021-04-12T08:45:00.000Z",
        "value": 73.8175
      },
      {
        "timestamp": "2021-04-12T09:00:00.000Z",
        "value": 86.59
      },
      {
        "timestamp": "2021-04-12T09:15:00.000Z",
        "value": 98.1225
      },
      {
        "timestamp": "2021-04-12T09:30:00.000Z",
        "value": 109.655
      },
      {
        "timestamp": "2021-04-12T09:45:00.000Z",
        "value": 121.1875
      },
      {
        "timestamp": "2021-04-12T10:00:00.000Z",
        "value": 132.72
      },
      {
        "timestamp": "2021-04-12T10:15:00.000Z",
        "value": 140.52
      },
      {
        "timestamp": "2021-04-12T10:30:00.000Z",
        "value": 148.32
      },
      {
        "timestamp": "2021-04-12T10:45:00.000Z",
        "value": 156.12
      },
      {
        "timestamp": "2021-04-12T11:00:00.000Z",
        "value": 163.92
      },
      {
        "timestamp": "2021-04-12T11:15:00.000Z",
        "value": 169.9625
      },
      {
        "timestamp": "2021-04-12T11:30:00.000Z",
        "value": 176.005
      },
      {
        "timestamp": "2021-04-12T11:45:00.000Z",
        "value": 182.0475
      },
      {
        "timestamp": "2021-04-12T12:00:00.000Z",
        "value": 188.09
      },
      {
        "timestamp": "2021-04-12T12:15:00.000Z",
        "value": 190.2775
      },
      {
        "timestamp": "2021-04-12T12:30:00.000Z",
        "value": 192.465
      },
      {
        "timestamp": "2021-04-12T12:45:00.000Z",
        "value": 194.6525
      },
      {
        "timestamp": "2021-04-12T13:00:00.000Z",
        "value": 196.84
      },
      {
        "timestamp": "2021-04-12T13:15:00.000Z",
        "value": 194.255
      },
      {
        "timestamp": "2021-04-12T13:30:00.000Z",
        "value": 191.67
      },
      {
        "timestamp": "2021-04-12T13:45:00.000Z",
        "value": 189.085
      },
      {
        "timestamp": "2021-04-12T14:00:00.000Z",
        "value": 186.5
      },
      {
        "timestamp": "2021-04-12T14:15:00.000Z",
        "value": 180.3525
      },
      {
        "timestamp": "2021-04-12T14:30:00.000Z",
        "value": 174.205
      },
      {
        "timestamp": "2021-04-12T14:45:00.000Z",
        "value": 168.0575
      },
      {
        "timestamp": "2021-04-12T15:00:00.000Z",
        "value": 161.91
      },
      {
        "timestamp": "2021-04-12T15:15:00.000Z",
        "value": 152.595
      },
      {
        "timestamp": "2021-04-12T15:30:00.000Z",
        "value": 143.28
      },
      {
        "timestamp": "2021-04-12T15:45:00.000Z",
        "value": 133.965
      },
      {
        "timestamp": "2021-04-12T16:00:00.000Z",
        "value": 124.65
      },
      {
        "timestamp": "2021-04-12T16:15:00.000Z",
        "value": 113.355
      },
      {
        "timestamp": "2021-04-12T16:30:00.000Z",
        "value": 102.06
      },
      {
        "timestamp": "2021-04-12T16:45:00.000Z",
        "value": 90.765
      },
      {
        "timestamp": "2021-04-12T17:00:00.000Z",
        "value": 79.47
      },
      {
        "timestamp": "2021-04-12T17:15:00.000Z",
        "value": 68.3375
      },
      {
        "timestamp": "2021-04-12T17:30:00.000Z",
        "value": 57.205
      },
      {
        "timestamp": "2021-04-12T17:45:00.000Z",
        "value": 46.0725
      },
      {
        "timestamp": "2021-04-12T18:00:00.000Z",
        "value": 34.94
      },
      {
        "timestamp": "2021-04-12T18:15:00.000Z",
        "value": 29.8025
      },
      {
        "timestamp": "2021-04-12T18:30:00.000Z",
        "value": 24.665
      },
      {
        "timestamp": "2021-04-12T18:45:00.000Z",
        "value": 19.5275
      },
      {
        "timestamp": "2021-04-12T19:00:00.000Z",
        "value": 14.39
      },
      {
        "timestamp": "2021-04-12T19:15:00.000Z",
        "value": 12.47
      },
      {
        "timestamp": "2021-04-12T19:30:00.000Z",
        "value": 10.55
      },
      {
        "timestamp": "2021-04-12T19:45:00.000Z",
        "value": 8.63
      },
      {
        "timestamp": "2021-04-12T20:00:00.000Z",
        "value": 6.71
      },
      {
        "timestamp": "2021-04-12T20:15:00.000Z",
        "value": 5.15
      },
      {
        "timestamp": "2021-04-12T20:30:00.000Z",
        "value": 3.59
      },
      {
        "timestamp": "2021-04-12T20:45:00.000Z",
        "value": 2.03
      },
      {
        "timestamp": "2021-04-12T21:00:00.000Z",
        "value": 0.47
      },
      {
        "timestamp": "2021-04-12T21:15:00.000Z",
        "value": 0.3525
      },
      {
        "timestamp": "2021-04-12T21:30:00.000Z",
        "value": 0.235
      },
      {
        "timestamp": "2021-04-12T21:45:00.000Z",
        "value": 0.1175
      },
      {
        "timestamp": "2021-04-12T22:00:00.000Z",
        "value": 0.0
      },
      {
        "timestamp": "2021-04-12T22:15:00.000Z",
        "value": 0.0
      },
      {
        "timestamp": "2021-04-12T22:30:00.000Z",
        "value": 0.0
      },
      {
        "timestamp": "2021-04-12T22:45:00.000Z",
        "value": 0.0
      },
      {
        "timestamp": "2021-04-12T23:00:00.000Z",
        "value": 0.0
      },
      {
        "timestamp": "2021-04-12T23:15:00.000Z",
        "value": 0.0
      },
      {
        "timestamp": "2021-04-12T23:30:00.000Z",
        "value": 0.0
      },
      {
        "timestamp": "2021-04-12T23:45:00.000Z",
        "value": 0.0
      }
    ]
  }
}