{
  "application": "pymfm",
  "start_forecast": "2021-04-14T00:00:00Z",
  "end_forecast": "2021-04-14T23:45:00Z",
  "forecast_level": 1,
  "revision": 1,
  "household_sta": {
    "ID": "pymfm-slp",
    "metadata": {
      "households": 90,
      "avgconsumption": 3000,
      "addon": 0,
      "timezone_abbrevation": "Europe",
      "utc_timeoffset": 0
    },
    "units": {
      "time": "ISO8601",
      "householdpower": "W"
    },
    "slp_values": [
      {
        "timestamp": "2021-04-14T00:00:00.000Z",
        "value": 87.1287128713
      },
      {
        "timestamp": "2021-04-14T00:15:00.000Z",
        "value": 78.2178217822
      },
      {
        "timestamp": "2021-04-14T00:30:00.000Z",
        "value": 70.297029703
      },
      {
        "timestamp": "2021-04-14T00:45:00.000Z",
        "value": 62.3762376238
      },
      {
        "timestamp": "2021-04-14T01:00:00.000Z",
        "value": 56.4356435644
      },
      {
        "timestamp": "2021-04-14T01:15:00.000Z",
        "value": 52.4752475248
      },
      {
        "timestamp": "2021-04-14T01:30:00.000Z",
        "value": 49.504950495
      },
      {
        "timestamp": "2021-04-14T01:45:00.000Z",
        "value": 48.5148514851
      },
      {
        "timestamp": "2021-04-14T02:00:00.000Z",
        "value": 46.5346534653
      },
      {
        "timestamp": "2021-04-14T02:15:00.000Z",
        "value": 45.5445544554
      },
      {
        "timestamp": "2021-04-14T02:30:00.000Z",
        "value": 44.5544554455
      },
      {
        "timestamp": "2021-04-14T02:45:00.000Z",
        "value": 43.5643564356
      },
      {
        "timestamp": "2021-04-14T03:00:00.000Z",
        "value": 43.5643564356
      },
      {
        "timestamp": "2021-04-14T03:15:00.000Z",
        "value": 43.5643564356
      },
      {
        "timestamp": "2021-04-14T03:30:00.000Z",
        "value": 43.5643564356
      },
      {
        "timestamp": "2021-04-14T03:45:00.000Z",
        "value": 43.5643564356
      },
      {
        "timestamp": "2021-04-14T04:00:00.000Z",
        "value": 43.5643564356
      },
      {
        "timestamp": "2021-04-14T04:15:00.000Z",
        "value": 43.5643564356
      },
      {
        "timestamp": "2021-04-14T04:30:00.000Z",
        "value": 43.5643564356
      },
      {
        "timestamp": "2021-04-14T04:45:00.000Z",
        "value": 44.5544554455
      },
      {
        "timestamp": "2021-04-14T05:00:00.000Z",
        "value": 44.5544554455
      },
      {
        "timestamp": "2021-04-14T05:15:00.000Z",
        "value": 46.5346534653
      },
      {
        "timestamp": "2021-04-14T05:30:00.000Z",
        "value": 49.504950495
      },
      {
        "timestamp": "2021-04-14T05:45:00.000Z",
        "value": 53.4653465347
      },
      {
        "timestamp": "2021-04-14T06:00:00.000Z",
        "value": 61.3861386139
      },
      {
        "timestamp": "2021-04-14T06:15:00.000Z",
        "value": 73.2673267327
      },
      {
        "timestamp": "2021-04-14T06:30:00.000Z",
        "value": 86.1386138614
      },
      {
        "timestamp": "2021-04-14T06:45:00.000Z",
        "value": 100.0
      },
      {
        "timestamp": "2021-04-14T07:00:00.000Z",
        "value": 112.8712871287
      },
      {
        "timestamp": "2021-04-14T07:15:00.000Z",
        "value": 121.7821782178
      },
      {
        "timestamp": "2021-04-14T07:30:00.000Z",
        "value": 128.7128712871
      },
      {
        "timestamp": "2021-04-14T07:45:00.000Z",
        "value": 133.6633663366
      },
      {
        "timestamp": "2021-04-14T08:00:00.000Z",
        "value": 135.6435643564
      },
      {
        "timestamp": "2021-04-14T08:15:00.000Z",
        "value": 137.6237623762
      },
      {
        "timestamp": "2021-04-14T08:30:00.000Z",
        "value": 138.6138613861
      },
      {
        "timestamp": "2021-04-14T08:45:00.000Z",
        "value": 138.6138613861
      },
      {
        "timestamp": "2021-04-14T09:00:00.000Z",
        "value": 137.6237623762
      },
      {
        "timestamp": "2021-04-14T09:15:00.000Z",
        "value": 137.6237623762
      },
      {
        "timestamp": "2021-04-14T09:30:00.000Z",
        "value": 136.6336633663
      },
      {
        "timestamp": "2021-04-14T09:45:00.000Z",
        "value": 135.6435643564
      },
      {
        "timestamp": "2021-04-14T10:00:00.000Z",
        "value": 135.6435643564
      },
      {
        "timestamp": "2021-04-14T10:15:00.000Z",
        "value": 133.6633663366
      },
      {
        "timestamp": "2021-04-14T10:30:00.000Z",
        "value": 132.6732673267
      },
      {
        "timestamp": "2021-04-14T10:45:00.000Z",
        "value": 131.6831683168
      },
      {
        "timestamp": "2021-04-14T11:00:00.000Z",
        "value": 130.6930693069
      },
      {
        "timestamp": "2021-04-14T11:15:00.000Z",
        "value": 130.6930693069
      },
      {
        "timestamp": "2021-04-14T11:30:00.000Z",
        "value": 131.6831683168
      },
      {
        "timestamp": "2021-04-14T11:45:00.000Z",
        "value": 133.6633663366
      },
      {
        "timestamp": "2021-04-14T12:00:00.000Z",
        "value": 137.6237623762
      },
      {
        "timestamp": "2021-04-14T12:15:00.000Z",
        "value": 142.5742574257
      },
      {
        "timestamp": "2021-04-14T12:30:00.000Z",
        "value": 148.5148514851
      },
      {
        "timestamp": "2021-04-14T12:45:00.000Z",
        "value": 153.4653465347
      },
      {
        "timestamp": "2021-04-14T13:00:00.000Z",
        "value": 155.4455445545
      },
      {
        "timestamp": "2021-04-14T13:15:00.000Z",
        "value": 153.4653465347
      },
      {
        "timestamp": "2021-04-14T13:30:00.000Z",
        "value": 149.504950495
      },
      {
        "timestamp": "2021-04-14T13:45:00.000Z",
        "value": 143.5643564356
      },
      {
        "timestamp": "2021-04-14T14:00:00.000Z",
        "value": 137.6237623762
      },
      {
        "timestamp": "2021-04-14T14:15:00.000Z",
        "value": 132.6732673267
      },
      {
        "timestamp": "2021-04-14T14:30:00.000Z",
        "value": 128.7128712871
      },
      {
        "timestamp": "2021-04-14T14:45:00.000Z",
        "value": 124.7524752475
      },
      {
        "timestamp": "2021-04-14T15:00:00.000Z",
        "value": 121.7821782178
      },
      {
        "timestamp": "2021-04-14T15:15:00.000Z",
        "value": 118.8118811881
      },
      {
        "timestamp": "2021-04-14T15:30:00.000Z",
        "value": 114.8514851485
      },
      {
        "timestamp": "2021-04-14T15:45:00.000Z",
        "value": 111.8811881188
      },
      {
        "timestamp": "2021-04-14T16:00:00.000Z",
        "value": 108.9108910891
      },
      {
        "timestamp": "2021-04-14T16:15:00.000Z",
        "value": 106.9306930693
      },
      {
        "timestamp": "2021-04-14T16:30:00.000Z",
        "value": 105.9405940594
      },
      {
        "timestamp": "2021-04-14T16:45:00.000Z",
        "value": 105.9405940594
      },
      {
        "timestamp": "2021-04-14T17:00:00.000Z",
        "value": 106.9306930693
      },
      {
        "timestamp": "2021-04-14T17:15:00.000Z",
        "value": 109.900990099
      },
      {
        "timestamp": "2021-04-14T17:30:00.000Z",
        "value": 113.8613861386
      },
      {
        "timestamp": "2021-04-14T17:45:00.000Z",
        "value": 118.8118811881
      },
      {
        "timestamp": "2021-04-14T18:00:00.000Z",
        "value": 124.7524752475
      },
      {
        "timestamp": "2021-04-14T18:15:00.000Z",
        "value": 132.6732673267
      },
      {
        "timestamp": "2021-04-14T18:30:00.000Z",
        "value": 140.5940594059
      },
      {
        "timestamp": "2021-04-14T18:45:00.000Z",
        "value": 149.504950495
      },
      {
        "timestamp": "2021-04-14T19:00:00.000Z",
        "value": 157.4257425743
      },
      {
        "timestamp": "2021-04-14T19:15:00.000Z",
        "value": 165.3465346535
      },
      {
        "timestamp": "2021-04-14T19:30:00.000Z",
        "value": 171.2871287129
      },
      {
        "timestamp": "2021-04-14T19:45:00.000Z",
        "value": 176.2376237624
      },
      {
        "timestamp": "2021-04-14T20:00:00.000Z",
        "value": 177.2277227723
      },
      {
        "timestamp": "2021-04-14T20:15:00.000Z",
        "value": 175.2475247525
      },
      {
        "timestamp": "2021-04-14T20:30:00.000Z",
        "value": 171.2871287129
      },
      {
        "timestamp": "2021-04-14T20:45:00.000Z",
        "value": 166.3366336634
      },
      {
        "timestamp": "2021-04-14T21:00:00.000Z",
        "value": 162.3762376238
      },
      {
        "timestamp": "2021-04-14T21:15:00.000Z",
        "value": 159.4059405941
      },
      {
        "timestamp": "2021-04-14T21:30:00.000Z",
        "value": 157.4257425743
      },
      {
        "timestamp": "2021-04-14T21:45:00.000Z",
        "value": 155.4455445545
      },
      {
        "timestamp": "2021-04-14T22:00:00.000Z",
        "value": 152.4752475248
      },
      {
        "timestamp": "2021-04-14T22:15:00.000Z",
        "value": 147.5247524752
      },
      {
        "timestamp": "2021-04-14T22:30:00.000Z",
        "value": 140.5940594059
      },
      {
        "timestamp": "2021-04-14T22:45:00.000Z",
        "value": 132.6732673267
      },
      {
        "timestamp": "2021-04-14T23:00:00.000Z",
        "value": 123.7623762376
      },
      {
        "timestamp": "2021-04-14T23:15:00.000Z",
        "value": 114.8514851485
      },
      {
        "timestamp": "2021-04-14T23:30:00.000Z",
        "value": 104.9504950495
      },
      {
        "timestamp": "2021-04-14T23:45:00.000Z",
        "value": 96.0396039604
      }
    ]
  },
  "pv_forecast": {
    "ID": "pymfm-pv",
    "metadata": {
      "latitude": 52.83,
      "longitude": 8.63,
      "height": 50,
      "timezone_abbrevation": "Europe",
      "utc_timeoffset": 0,
      "modelrun_utc": "2021-04-12 14:00:00+02:00",
      "modelrun_updatetime_utc": "2021-04-12 21:22:00+02:00",
      "kwp": 302,
      "slope": 30,
      "facing": 135,
      "tracking": null
    },
    "units": {
      "time": "ISO8601",
      "pvpower": "kW"
    },
    "pv_values": [
      {
        "timestamp": "2021-04-14T00:00:00.000Z",
        "value": 0.0
      },
      {
        "timestamp": "2021-04-14T00:15:00.000Z",
        "value": 0.0
      },
      {
        "timestamp": "2021-04-14T00:30:00.000Z",
        "value": 0.0
      },
      {
        "timestamp": "2021-04-14T00:45:00.000Z",
        "value": 0.0
      },
      {
        "timestamp": "2021-04-14T01:00:00.000Z",
        "value": 0.0
      },
      {
        "timestamp": "2021-04-14T01:15:00.000Z",
        "value": 0.0
      },
      {
        "timestamp": "2021-04-14T01:30:00.000Z",
        "value": 0.0
      },
      {
        "timestamp": "2021-04-14T01:45:00.000Z",
        "value": 0.0
      },
      {
        "timestamp": "2021-04-14T02:00:00.000Z",
        "value": 0.0
      },
      {
        "timestamp": "2021-04-14T02:15:00.000Z",
        "value": 0.0
      },
      {
        "timestamp": "2021-04-14T02:30:00.000Z",
        "value": 0.0
      },
      {
        "timestamp": "2021-04-14T02:45:00.000Z",
        "value": 0.0
      },
      {
        "timestamp": "2021-04-14T03:00:00.000Z",
        "value": 0.0
      },
      {
        "timestamp": "2021-04-14T03:15:00.000Z",
        "value": 0.0
      },
      {
        "timestamp": "2021-04-14T03:30:00.000Z",
        "value": 0.0
      },
      {
        "timestamp": "2021-04-14T03:45:00.000Z",
        "value": 0.0
      },
      {
        "timestamp": "2021-04-14T04:00:00.000Z",
        "value": 0.0
      },
      {
        "timestamp": "2021-04-14T04:15:00.000Z",
        "value": 0.0
      },
      {
        "timestamp": "2021-04-14T04:30:00.000Z",
        "value": 0.0
      },
      {
        "timestamp": "2021-04-14T04:45:00.000Z",
        "value": 0.0
      },
      {
        "timestamp": "2021-04-14T05:00:00.000Z",
        "value": 0.0
      },
      {
        "timestamp": "2021-04-14T05:15:00.000Z",
        "value": 0.0
      },
      {
        "timestamp": "2021-04-14T05:30:00.000Z",
        "value": 0.0
      },
      {
        "timestamp": "2021-04-14T05:45:00.000Z",
        "value": 0.0
      },
      {
        "timestamp": "2021-04-14T06:00:00.000Z",
        "value": 0.0
      },
      {
        "timestamp": "2021-04-14T06:15:00.000Z",
        "value": 0.4925
      },
      {
        "timestamp": "2021-04-14T06:30:00.000Z",
        "value": 0.985
      },
      {
        "timestamp": "2021-04-14T06:45:00.000Z",
        "value": 1.4775
      },
      {
        "timestamp": "2021-04-14T07:00:00.000Z",
        "value": 1.97
      },
      {
        "timestamp": "2021-04-14T07:15:00.000Z",
        "value": 11.0325
      },
      {
        "timestamp": "2021-04-14T07:30:00.000Z",
        "value": 20.095
      },
      {
        "timestamp": "2021-04-14T07:45:00.000Z",
        "value": 29.1575
      },
      {
        "timestamp": "2021-04-14T08:00:00.000Z",
        "value": 38.22
      },
      {
        "timestamp": "2021-04-14T08:15:00.000Z",
        "value": 50.8025
      },
      {
        "timestamp": "2021-04-14T08:30:00.000Z",
        "value": 63.385
      },
      {
        "timestamp": "2021-04-14T08:45:00.000Z",
        "value": 75.9675
      },
      {
        "timestamp": "2021-04-14T09:00:00.000Z",
        "value": 88.55
      },
      {
        "timestamp": "2021-04-14T09:15:00.000Z",
        "value": 99.26
      },
      {
        "timestamp": "2021-04-14T09:30:00.000Z",
        "value": 109.97
      },
      {
        "timestamp": "2021-04-14T09:45:00.000Z",
        "value": 120.68
      },
      {
        "timestamp": "2021-04-14T10:00:00.000Z",
        "value": 131.39
      },
      {
        "timestamp": "2021-04-14T10:15:00.000Z",
        "value": 138.3675
      },
      {
        "timestamp": "2021-04-14T10:30:00.000Z",
        "value": 145.345
      },
      {
        "timestamp": "2021-04-14T10:45:00.000Z",
        "value": 152.3225
      },
      {
        "timestamp": "2021-04-14T11:00:00.000Z",
        "value": 159.3
      },
      {
        "timestamp": "2021-04-14T11:15:00.000Z",
        "value": 163.915
      },
      {
        "timestamp": "2021-04-14T11:30:00.000Z",
        "value": 168.53
      },
      {
        "timestamp": "2021-04-14T11:45:00.000Z",
        "value": 173.145
      },
      {
        "timestamp": "2021-04-14T12:00:00.000Z",
        "value": 177.76
      },
      {
        "timestamp": "2021-04-14T12:15:00.000Z",
        "value": 179.34
      },
      {
        "timestamp": "2021-04-14T12:30:00.000Z",
        "value": 180.92
      },
      {
        "timestamp": "2021-04-14T12:45:00.000Z",
        "value": 182.5
      },
      {
        "timestamp": "2021-04-14T13:00:00.000Z",
        "value": 184.08
      },
      {
        "timestamp": "2021-04-14T13:15:00.000Z",
        "value": 182.3275
      },
      {
        "timestamp": "2021-04-14T13:30:00.000Z",
        "value": 180.575
      },
      {
        "timestamp": "2021-04-14T13:45:00.000Z",
        "value": 178.8225
      },
      {
        "timestamp": "2021-04-14T14:00:00.000Z",
        "value": 177.07
      },
      {
        "timestamp": "2021-04-14T14:15:00.000Z",
        "value": 171.965
      },
      {
        "timestamp": "2021-04-14T14:30:00.000Z",
        "value": 166.86
      },
      {
        "timestamp": "2021-04-14T14:45:00.000Z",
        "value": 161.755
      },
      {
        "timestamp": "2021-04-14T15:00:00.000Z",
        "value": 156.65
      },
      {
        "timestamp": "2021-04-14T15:15:00.000Z",
        "value": 148.49
      },
      {
        "timestamp": "2021-04-14T15:30:00.000Z",
        "value": 140.33
      },
      {
        "timestamp": "2021-04-14T15:45:00.000Z",
        "value": 132.17
      },
      {
        "timestamp": "2021-04-14T16:00:00.000Z",
        "value": 124.01
      },
      {
        "timestamp": "2021-04-14T16:15:00.000Z",
        "value": 113.0525
      },
      {
        "timestamp": "2021-04-14T16:30:00.000Z",
        "value": 102.095
      },
      {
        "timestamp": "2021-04-14T16:45:00.000Z",
        "value": 91.1375
      },
      {
        "timestamp": "2021-04-14T17:00:00.000Z",
        "value": 80.18
      },
      {
        "timestamp": "2021-04-14T17:15:00.000Z",
        "value": 68.53
      },
      {
        "timestamp": "2021-04-14T17:30:00.000Z",
        "value": 56.88
      },
      {
        "timestamp": "2021-04-14T17:45:00.000Z",
        "value": 45.23
      },
      {
        "timestamp": "2021-04-14T18:00:00.000Z",
        "value": 33.58
      },
      {
        "timestamp": "2021-04-14T18:15:00.000Z",
        "value": 28.4675
      },
      {
        "timestamp": "2021-04-14T18:30:00.000Z",
        "value": 23.355
      },
      {
        "timestamp": "2021-04-14T18:45:00.000Z",
        "value": 18.2425
      },
      {
        "timestamp": "2021-04-14T19:00:00.000Z",
        "value": 13.13
      },
      {
        "timestamp": "2021-04-14T19:15:00.000Z",
        "value": 11.56
      },
      {
        "timestamp": "2021-04-14T19:30:00.000Z",
        "value": 9.99
      },
      {
        "timestamp": "2021-04-14T19:45:00.000Z",
        "value": 8.42
      },
      {
        "timestamp": "2021-04-14T20:00:00.000Z",
        "value": 6.85
      },
      {
        "timestamp": "2021-04-14T20:15:00.000Z",
        "value": 5.3125
      },
      {
        "timestamp": "2021-04-14T20:30:00.000Z",
        "value": 3.775
      },
      {
        "timestamp": "2021-04-14T20:45:00.000Z",
        "value": 2.2375
      },
      {
        "timestamp": "2021-04-14T21:00:00.000Z",
        "value": 0.7
      },
      {
        "timestamp": "2021-04-14T21:15:00.000Z",
        "value": 0.525
      },
      {
        "timestamp": "2021-04-14T21:30:00.000Z",
        "value": 0.35
      },
      {
        "timestamp": "2021-04-14T21:45:00.000Z",
        "value": 0.175
      },
      {
        "timestamp": "2021-04-14T22:00:00.000Z",
        "value": 0.0
      },
      {
        "timestamp": "2021-04-14T22:15:00.000Z",
        "value": 0.0
      },
      {
        "timestamp": "2021-04-14T22:30:00.000Z",
        "value": 0.0
      },
      {
        "timestamp": "2021-04-14T22:45:00.000Z",
        "value": 0.0
      },
      {
        "timestamp": "2021-04-14T23:00:00.000Z",
        "value": 0.0
      },
      {
        "timestamp": "2021-04-14T23:15:00.000Z",
        "value": 0.0
      },
      {
        "timestamp": "2021-04-14T23:30:00.000Z",
        "value": 0.0
      },
      {
        "timestamp": "2021-04-14T23:45:00.000Z",
        "value": 0.0
      }
    ]
  }
}