{
  "Day ahead": "A01",
  "Intra day incremental": "A02",
  "Realised": "A16",
  "Intraday total": "A18",
  "Week ahead": "A31",
  "Month ahead": "A32",
  "Year ahead": "A33",
  "Synchronisation process": "A39",
  "Intraday process": "A40",
  "Replacement reserve": "A46",
  "Manual frequency restoration reserve": "A47",
  "Automatic frequency restoration reserve": "A51",
  "Frequency containment reserve": "A52",
  "Frequency restoration reserve": "A56"
}