Merge branch 'dev' into ControlComponentBehaviour

10 jobs for dev in 17 minutes and 15 seconds (queued for 19 seconds)
Status Job ID Name Coverage
  Build
passed #737523
build:linux64

00:04:40

passed #737524
build:win64

00:07:43

 
  Test
passed #737530
test:compliance:external:acplt

00:07:46

passed #737528
test:compliance:profile_server

00:00:35

passed #737527
test:compliance:selfcheck

00:00:35

failed #737529
allowed to fail
test:compliance:selfcheck:disabled

00:00:21

passed #737526
test:internal:profile_server

00:00:36

passed #737525
test:internal:selfcheck

00:00:36

 
  Memcheck
passed #737531
memleaks:profile_server

00:00:56

passed #737532
memleaks:test_compliance

00:01:09

 
Name Stage Failure
failed
test:compliance:selfcheck:disabled Test
[  PASSED  ] 0 tests.
[ FAILED ] 1 test, listed below:
[ FAILED ] ns=1;i=1/OM.DISABLED_CONTI_Optional

1 FAILED TEST
Uploading artifacts...
build/bin/test_*.xml: found 1 matching files
Uploading artifacts to coordinator... ok
id=737529 responseStatus=201 Created token=yp4V5pZk
ERROR: Job failed: exit code 1