<?xml version="1.0" encoding="UTF-8" standalone="no"?>
<graphml xmlns="http://graphml.graphdrawing.org/xmlns" xmlns:java="http://www.yworks.com/xml/yfiles-common/1.0/java" xmlns:sys="http://www.yworks.com/xml/yfiles-common/markup/primitives/2.0" xmlns:x="http://www.yworks.com/xml/yfiles-common/markup/2.0" xmlns:xsi="http://www.w3.org/2001/XMLSchema-instance" xmlns:y="http://www.yworks.com/xml/graphml" xmlns:yed="http://www.yworks.com/xml/yed/3" xsi:schemaLocation="http://graphml.graphdrawing.org/xmlns http://www.yworks.com/xml/schema/graphml/1.1/ygraphml.xsd">
  <!--Created by yEd 3.19.1.1-->
  <key attr.name="Description" attr.type="string" for="graph" id="d0"/>
  <key for="port" id="d1" yfiles.type="portgraphics"/>
  <key for="port" id="d2" yfiles.type="portgeometry"/>
  <key for="port" id="d3" yfiles.type="portuserdata"/>
  <key attr.name="url" attr.type="string" for="node" id="d4"/>
  <key attr.name="description" attr.type="string" for="node" id="d5"/>
  <key for="node" id="d6" yfiles.type="nodegraphics"/>
  <key for="graphml" id="d7" yfiles.type="resources"/>
  <key attr.name="url" attr.type="string" for="edge" id="d8"/>
  <key attr.name="description" attr.type="string" for="edge" id="d9"/>
  <key for="edge" id="d10" yfiles.type="edgegraphics"/>
  <graph edgedefault="directed" id="G">
    <data key="d0" xml:space="preserve"/>
    <node id="n0">
      <data key="d6">
        <y:ImageNode>
          <y:Geometry height="48.0" width="48.0" x="409.0" y="215.0"/>
          <y:Fill color="#CCCCFF" transparent="false"/>
          <y:BorderStyle color="#000000" type="line" width="1.0"/>
          <y:NodeLabel alignment="center" autoSizePolicy="content" fontFamily="Dialog" fontSize="12" fontStyle="plain" hasBackgroundColor="false" hasLineColor="false" hasText="false" height="4.0" horizontalTextPosition="center" iconTextGap="4" modelName="sandwich" modelPosition="s" textColor="#000000" verticalTextPosition="bottom" visible="true" width="4.0" x="22.0" y="52.0"/>
          <y:Image alphaImage="true" refid="1"/>
        </y:ImageNode>
      </data>
    </node>
    <node id="n1">
      <data key="d6">
        <y:ImageNode>
          <y:Geometry height="48.0" width="48.0" x="409.0" y="94.0"/>
          <y:Fill color="#CCCCFF" transparent="false"/>
          <y:BorderStyle color="#000000" type="line" width="1.0"/>
          <y:Image alphaImage="true" refid="2"/>
        </y:ImageNode>
      </data>
    </node>
    <node id="n2">
      <data key="d6">
        <y:ImageNode>
          <y:Geometry height="48.0" width="48.0" x="201.0" y="215.0"/>
          <y:Fill color="#CCCCFF" transparent="false"/>
          <y:BorderStyle color="#000000" type="line" width="1.0"/>
          <y:Image alphaImage="true" refid="1"/>
        </y:ImageNode>
      </data>
    </node>
    <node id="n3">
      <data key="d6">
        <y:ImageNode>
          <y:Geometry height="48.0" width="48.0" x="305.0" y="215.0"/>
          <y:Fill color="#CCCCFF" transparent="false"/>
          <y:BorderStyle color="#000000" type="line" width="1.0"/>
          <y:NodeLabel alignment="center" autoSizePolicy="content" fontFamily="Dialog" fontSize="12" fontStyle="plain" hasBackgroundColor="false" hasLineColor="false" hasText="false" height="4.0" horizontalTextPosition="center" iconTextGap="4" modelName="sandwich" modelPosition="s" textColor="#000000" verticalTextPosition="bottom" visible="true" width="4.0" x="22.0" y="52.0"/>
          <y:Image alphaImage="true" refid="1"/>
        </y:ImageNode>
      </data>
    </node>
    <node id="n4">
      <data key="d6">
        <y:ImageNode>
          <y:Geometry height="48.0" width="48.0" x="513.0" y="215.0"/>
          <y:Fill color="#CCCCFF" transparent="false"/>
          <y:BorderStyle color="#000000" type="line" width="1.0"/>
          <y:NodeLabel alignment="center" autoSizePolicy="content" fontFamily="Dialog" fontSize="12" fontStyle="plain" hasBackgroundColor="false" hasLineColor="false" hasText="false" height="4.0" horizontalTextPosition="center" iconTextGap="4" modelName="sandwich" modelPosition="s" textColor="#000000" verticalTextPosition="bottom" visible="true" width="4.0" x="22.0" y="52.0"/>
          <y:Image alphaImage="true" refid="1"/>
        </y:ImageNode>
      </data>
    </node>
    <node id="n5">
      <data key="d6">
        <y:ImageNode>
          <y:Geometry height="48.0" width="48.0" x="617.0" y="215.0"/>
          <y:Fill color="#CCCCFF" transparent="false"/>
          <y:BorderStyle color="#000000" type="line" width="1.0"/>
          <y:NodeLabel alignment="center" autoSizePolicy="content" fontFamily="Dialog" fontSize="12" fontStyle="plain" hasBackgroundColor="false" hasLineColor="false" hasText="false" height="4.0" horizontalTextPosition="center" iconTextGap="4" modelName="sandwich" modelPosition="s" textColor="#000000" verticalTextPosition="bottom" visible="true" width="4.0" x="22.0" y="52.0"/>
          <y:Image alphaImage="true" refid="1"/>
        </y:ImageNode>
      </data>
    </node>
    <node id="n6">
      <data key="d6">
        <y:ShapeNode>
          <y:Geometry height="30.0" width="30.0" x="712.0" y="224.0"/>
          <y:Fill color="#FFFFFF" transparent="false"/>
          <y:BorderStyle color="#FFFFFF" raised="false" type="line" width="1.0"/>
          <y:NodeLabel alignment="center" autoSizePolicy="content" fontFamily="Dialog" fontSize="12" fontStyle="plain" hasBackgroundColor="false" hasLineColor="false" height="17.96875" horizontalTextPosition="center" iconTextGap="4" modelName="custom" textColor="#000000" verticalTextPosition="bottom" visible="true" width="15.443359375" x="7.2783203125" xml:space="preserve" y="6.015625">...<y:LabelModel><y:SmartNodeLabelModel distance="4.0"/></y:LabelModel><y:ModelParameter><y:SmartNodeLabelModelParameter labelRatioX="0.0" labelRatioY="0.0" nodeRatioX="0.0" nodeRatioY="0.0" offsetX="0.0" offsetY="0.0" upX="0.0" upY="-1.0"/></y:ModelParameter></y:NodeLabel>
          <y:Shape type="rectangle"/>
        </y:ShapeNode>
      </data>
    </node>
    <node id="n7">
      <data key="d5"/>
      <data key="d6">
        <y:ShapeNode>
          <y:Geometry height="17.96875" width="100.416015625" x="50.7919921875" y="109.015625"/>
          <y:Fill hasColor="false" transparent="false"/>
          <y:BorderStyle hasColor="false" type="line" width="1.0"/>
          <y:NodeLabel alignment="center" autoSizePolicy="content" fontFamily="Dialog" fontSize="12" fontStyle="bold" hasBackgroundColor="false" hasLineColor="false" height="17.96875" horizontalTextPosition="center" iconTextGap="0" modelName="internal" modelPosition="c" textColor="#000000" verticalTextPosition="bottom" visible="true" width="113.34765625" x="-6.4658203125" xml:space="preserve" y="0.0">Master Contract</y:NodeLabel>
          <y:Shape type="rectangle"/>
        </y:ShapeNode>
      </data>
    </node>
    <node id="n8">
      <data key="d5"/>
      <data key="d6">
        <y:ShapeNode>
          <y:Geometry height="17.96875" width="82.955078125" x="50.7919921875" y="230.015625"/>
          <y:Fill hasColor="false" transparent="false"/>
          <y:BorderStyle hasColor="false" type="line" width="1.0"/>
          <y:NodeLabel alignment="center" autoSizePolicy="content" fontFamily="Dialog" fontSize="12" fontStyle="bold" hasBackgroundColor="false" hasLineColor="false" height="17.96875" horizontalTextPosition="center" iconTextGap="0" modelName="internal" modelPosition="c" textColor="#000000" verticalTextPosition="bottom" visible="true" width="99.994140625" x="-8.51953125" xml:space="preserve" y="0.0">City Contracts</y:NodeLabel>
          <y:Shape type="rectangle"/>
        </y:ShapeNode>
      </data>
    </node>
    <edge id="e0" source="n1" target="n2">
      <data key="d10">
        <y:PolyLineEdge>
          <y:Path sx="0.0" sy="0.0" tx="0.0" ty="0.0"/>
          <y:LineStyle color="#000000" type="line" width="1.0"/>
          <y:Arrows source="none" target="standard"/>
          <y:BendStyle smoothed="false"/>
        </y:PolyLineEdge>
      </data>
    </edge>
    <edge id="e1" source="n1" target="n3">
      <data key="d10">
        <y:PolyLineEdge>
          <y:Path sx="0.0" sy="0.0" tx="0.0" ty="0.0"/>
          <y:LineStyle color="#000000" type="line" width="1.0"/>
          <y:Arrows source="none" target="standard"/>
          <y:BendStyle smoothed="false"/>
        </y:PolyLineEdge>
      </data>
    </edge>
    <edge id="e2" source="n0" target="n1">
      <data key="d10">
        <y:PolyLineEdge>
          <y:Path sx="0.0" sy="0.0" tx="0.0" ty="0.0"/>
          <y:LineStyle color="#000000" type="line" width="1.0"/>
          <y:Arrows source="standard" target="none"/>
          <y:BendStyle smoothed="false"/>
        </y:PolyLineEdge>
      </data>
    </edge>
    <edge id="e3" source="n4" target="n1">
      <data key="d10">
        <y:PolyLineEdge>
          <y:Path sx="0.0" sy="0.0" tx="0.0" ty="0.0"/>
          <y:LineStyle color="#000000" type="line" width="1.0"/>
          <y:Arrows source="standard" target="none"/>
          <y:BendStyle smoothed="false"/>
        </y:PolyLineEdge>
      </data>
    </edge>
    <edge id="e4" source="n5" target="n1">
      <data key="d10">
        <y:PolyLineEdge>
          <y:Path sx="0.0" sy="0.0" tx="0.0" ty="0.0"/>
          <y:LineStyle color="#000000" type="line" width="1.0"/>
          <y:Arrows source="standard" target="none"/>
          <y:BendStyle smoothed="false"/>
        </y:PolyLineEdge>
      </data>
    </edge>
    <edge id="e5" source="n6" target="n1">
      <data key="d10">
        <y:PolyLineEdge>
          <y:Path sx="0.0" sy="0.0" tx="0.0" ty="0.0"/>
          <y:LineStyle color="#000000" type="line" width="1.0"/>
          <y:Arrows source="standard" target="none"/>
          <y:BendStyle smoothed="false"/>
        </y:PolyLineEdge>
      </data>
    </edge>
  </graph>
  <data key="d7">
    <y:Resources>
      <y:Resource id="1" type="java.awt.image.BufferedImage" xml:space="preserve">iVBORw0KGgoAAAANSUhEUgAAADAAAAAwCAYAAABXAvmHAAAGEklEQVR4XtWabWwURRjH+eIX8RNf&#13;
/AAGYzRGEhOjKAoxvGnVtve27SGmVBQaXrSiRmlJKIlG+EDUWKhFGtCAthRSog0Y2tpUEEpFaIUK&#13;
MdFcaHlp77i967V31/b2etfHefZ2t92Z3bvduy3qk/zSSWZv5v/fnZ15ZrazZlkQgzbbvQGn0xlw&#13;
ufaQv628y+UhBAlxCSx7sE66xom/odu5qzHids/xO51vEGHNhDECmAR/04xtYFt0+zMWfrf7Pp7j&#13;
dpDOwxqisiVMjFT58vJm0/1ZFrBhwz2ko00En4YAq/ASNmFfdP85RdDheIA03KPR4UzRg33SOrKK&#13;
oMv1HD+zd10PX5DjnqX1mIoAx5WShgSNxtPS63RBeaEN3i6wQbvDwdSbIIYaaF2GQhJPN8hwnYAi&#13;
p/OxzQaXnU7wkrpyux1qXZyK0xzHtJMOMu2uofWlDXx0vME7j4KX5Req2Ezu/qc2B9TbHbCGPA2b&#13;
e5WKCpc5A4SY4eEkvbDMmA/XLINY59MgdD2j4tzepYwBZD0xsZHwEjHxgk2ClAuKiqGyxA6R2kUM&#13;
wx+uAJ5jxMv4Mr7Y0lTJzDbBskJIBhdCMsTSdWIxI15mOXkHVhY6VORzxbCtLB/i3Q9qMlyxkhY+&#13;
nZ60UyyfmufpH0G4ejkj3IiBwmL10JFJZyC8ewnTvwqO20jrFkNcYTWGDmMgXAqTwkkF/0AjnGr+&#13;
XJP6wzvhq9odCvuqq2DfZ1Vwoa0GkoEmhUTfB8YNkMVOc8WW0gP6YsbAZHQrWB1Jf4MZA4Bph0o8&#13;
JlOkIkJf+F81QAirEkApq6QvymggmUzC5OSkWE4kEiZJTrVj3gCQtHytYoBPpcTMRTJ6Bu74gxAO&#13;
R8Vy/40BU9y4Oai0k40BMuR/EMXjxoLPkM/rGUDx4+MxsRwIhMwRDCntZGWAaBY3Rbg70qhUoWfA&#13;
qsjSAA4jxyzc4tEVNHoGxsbGQYjHxTI+DVNEUkMPI52BQJGdDBfthBC14xPAPSxTacTATL8Dd1bZ&#13;
IVp3P0S/nAsBt53RRWjBFxg34HSFIQOCEIeJiYRYxqdhFjm0DHhK34Tqdeuhf9ejMH5sNjExT8uE&#13;
Bw3giQFdYciAVUEbQPFbv++FDW39sHPt64qJyO5HVLr8LlcADeCxByPaiIHg0DBER8fE8sCg3xSD&#13;
Xr/SznQDN7+wi+LX/eyFd078CSU1R+Cj0hLo+2QBhDY/T2sTcjKA02EkOiqWb932meL2gE9pBw0I&#13;
v80HX8fjUNHarYh372+CJxpPw9JvTsIlt5vRJRv494fQrUPgPf4wVLZfYMQv/rYNfil7i9GEyEMo&#13;
65c4Hp9QUoJYTDCHICjt8H/VK+K3/NRrSLyEx9w0OvQU2di8r3RsxTQ6FEvAtrOelPj23+HVhu+M&#13;
ikdajC1ku1bAhOcxiF95CBKeTYoBfIHlOzk8HDaNKP5XvyJ+9dGvzYhXFrKMqUTovReVWWK6gVxi&#13;
uvh3z1yfEn+kxZB4REwljCRzVhtQie/0weoTbaL4JY2n4MKBl5n+dUglc0bSaSsN0OJfa+tWxF86&#13;
uhCi+9WLlS5yOo2RaUNjlQFd8cc6RPFiymDQgGpDI20pdY/LrTAwNqEjvuksXL5SL4o3YUC9pcRI&#13;
t6m3wkBX36Cm+F5+hLR50JQBZlOPgUcVvM6xihUGvP1XobX3GlSe6VGJxzBpQPtYBYPXOdjK1UB0&#13;
ZAh8nosi2zvOwSvNnYp4DFMG9A62MPSOFnM10Fi3F35sqIPQ4N8wHhmCpHSSIYcJA+mPFjG0Dndz&#13;
NXC+/RSEAlPpMx0GDXiDHDeP1qsZ0vF6TMvA+DU3jHgOG+PqQRj+40BGwl1bMhmIBRyORbTOtDH9&#13;
A8dQeZ5iwCjCxfmKKDNE9iygxZv/wCGH8ompyAmjh56E+EVWqB7C+bmMuIwcnwOB0gL1nc9WvBzS&#13;
cNKcXmeY3D/yyfG//swqhzjFkjmYT32Mpju0Ci/2kXGqzCVwFcSlnE+TO2VBmOxvt+uusDMRmExh&#13;
RohpLZ9hP6HDGP4W22ASs7sd4r/bkN2RtD1tIXjwxIBPfaoVpDIeHrSI/25DrrXq323+AZ+8hHD9&#13;
Q0dwAAAAAElFTkSuQmCC</y:Resource>
      <y:Resource id="2" type="java.awt.image.BufferedImage" xml:space="preserve">iVBORw0KGgoAAAANSUhEUgAAADAAAAAwCAYAAABXAvmHAAAE8klEQVR4Xu2ZW2gcVRjHT8zOTNKW&#13;
YMVLvRSjpjtrUvGhIihVKkpVJMnO2kghPkSkFbXaFC9YQVgvrSjduRpMa6WQ7iVsfdBqq9Kd2dgo&#13;
rdJiLeKL+qJP9kEFX3zY2eP3ndldJ5M1mWxnhkTyhz/JnHPmzPeb+c6Zc2YJWdb/QLRI2mmZrGrZ&#13;
RcJ7+4xMdJqsrpjCBWrxtFXbFl+xLeEATZNLvP2HKnqcCHaJ/xaDAIiT1BR2tGK7zCk1mEHvNUIT&#13;
PUO4qhX7qHEnTf4lbxu/gjTqYH2UhZ3eulAEF4zRMl90Lso94QAIz3vb+VUDwBRGG4Uf968g+WSS&#13;
5KRhkh3sdTW/OOGAhZzNOneee4rBBA1QHOokeek8mDJnpSrAPOI5beHCQQaD7aATvLCLlYUBkB/s&#13;
Z4HnpK2kkOwm2YFzjh/s8pzqX5SSNrskjNVyfnejPAwADBwBMHjUYekndnxY+huexKOuU/2JBW9x&#13;
Ml4E0ufVGXVRAORTR8mE9AuUWeDfSTrtf7p1guf31oJ/C49n1MNUyi5eFp5zly9E8wLkkpMwDr4n&#13;
BWkXKz800uE6fW5Bx6+w4Euc5g2e1ZdXrnHSitvurfMr3wD51OiCAGCgvuDceWG8WfAomE63OBeP&#13;
3YnHY71yjyGqx/R1mc/8WItrG0MBsE2BvR0hbc5CcHfTcmzjTHdswmkU2l2wTf58fRmgiqqoi8qU&#13;
KipfzmdoN62JmXsCB6DHyPVOWszviiVMA0y3t4+FKHiAWl7bU/ye2Xe+5lLsDmp2Xus9txWFBgDL&#13;
hBFvXRiKDEBLKNv1uLovSBvxfYnIAIxE5gtNVP4MyrqY+QNmrKFZAIXUAAt0cssg+XDrWgD4Bo6/&#13;
vmiAsDQLYGLzSpIf+Lm98DBtw4DzKVwXDS8dAFRWGmfBgttysBplUMkXWVlxaO4t6KIAKKQO1gGY&#13;
c8mdsC/4C/6edZ3aXM0A2AsqoYwE7h79Cl8AhYEBkk3qZKL/hkab/1JzAGUc3pw0aOPM5gsg3395&#13;
o24+NQPYv2E/N9b39pogra5Xr6KEtkUCEKaWAbxqBqB0K5caonxb0IZBLEQCAGv3970DMAhrceXp&#13;
SABwwOlx5b4gDZuZe2FyWBEJQJCS++TL3MdLCsAQlTd0Uf5ViSs31ssiAcD5+lB3usOvi6TY7uqS&#13;
CZbPe1RRfh1yfxj8ZL08EgA9LhveATiXjYR82tXlv8H36F1sPK1TjtTrIgLI3AqBjfp2Qt5cP9eI&#13;
K3sxeEM0rjHEzA84JUObqTRxPlBFAtCqtIT6Jgav3KxcXfsS8R4s4lLgDDzV27HNogVwBw+BT0Na&#13;
3QIp1KuJ6ruaKD8AT+llbLcoAWCVuRuDx//1hLoDxsApgJiELeTj8A44g/O/LqqfYv1iBXgGUuQr&#13;
uMsHcN+Lc//YTZm1sHx4DJ5ADvcB+GVOvk7u9AWQe2i1q/u5FQRAXe/0yn21gX0UBy6mFb6BcQ2E&#13;
KWQk1PubAuSTH9SDb8MfOPBHD78KEsAt3FPAU7lLE5XX4GVWAn8HqbWtKUAhuakBkEuZrm7mV1gA&#13;
XmH64N+mAKD2vHSSQRQG2Ydj36Kfr7rS6ZDb5q0LQ/Q46WLXs4RnZ1RMSuvZZn6hYj9qnGj/0ba4&#13;
36ol/pOwbVv8ObvEV6nFbfDG0rJoSYhXzdiRSok/VTnBnw7TVYszqckPeWNY1lLQPyGRYPs7VoBk&#13;
AAAAAElFTkSuQmCC</y:Resource>
    </y:Resources>
  </data>
</graphml>
