﻿

---------------------------------------------------------------------------
Job: ATENA, Log start: 12/13/2019 2:59:48 PM
---------------------------------------------------------------------------

ATENA x64 Version 5.6.1.16910   (c) Cervenka Consulting 1999-2018
License Demo


---------------------------------------------------------------------------
Job: Step 1(1), Log start: 12/13/2019 2:59:48 PM
---------------------------------------------------------------------------
 Iter       Eta   Disp.Err  Resid.Err  Res.Abs.E  Energy E. (NR)
 Iter       Eta     Unbal. Energy Ratio: Current   Required (LS)
---------------------------------------------------------------------------
    1         1         1!   4.5e-06    6.5e-06    4.5e-06  (NR)
    2         1   1.2e-06    3.1e-16    6.1e-16    3.9e-22  (NR)
---------------------------------------------------------------------------
Step: 1(1) completed. Elapsed CPU (sec) - step this: 0.87,  all: 0.87 
---------------------------------------------------------------------------

---------------------------------------------------------------------------
Job: Step 2(2), Log start: 12/13/2019 2:59:49 PM
---------------------------------------------------------------------------
 Iter       Eta   Disp.Err  Resid.Err  Res.Abs.E  Energy E. (NR)
 Iter       Eta     Unbal. Energy Ratio: Current   Required (LS)
---------------------------------------------------------------------------
    1         1       0.5!   2.3e-06    3.2e-06    1.2e-06  (NR)
    2         1   6.3e-07      2e-16      3e-16    1.3e-22  (NR)
---------------------------------------------------------------------------
Step: 2(2) completed. Elapsed CPU (sec) - step this: 0.453,  all: 1.323 
---------------------------------------------------------------------------

---------------------------------------------------------------------------
Job: Step 3(3), Log start: 12/13/2019 2:59:50 PM
---------------------------------------------------------------------------
 Iter       Eta   Disp.Err  Resid.Err  Res.Abs.E  Energy E. (NR)
 Iter       Eta     Unbal. Energy Ratio: Current   Required (LS)
---------------------------------------------------------------------------
    1         1      0.33!   1.7e-06    2.1e-06    5.8e-07  (NR)
    2         1   4.4e-07    2.7e-16      4e-16    1.2e-22  (NR)
---------------------------------------------------------------------------
Step: 3(3) completed. Elapsed CPU (sec) - step this: 0.412,  all: 1.735 
---------------------------------------------------------------------------

---------------------------------------------------------------------------
Job: Step 4(4), Log start: 12/13/2019 2:59:50 PM
---------------------------------------------------------------------------
 Iter       Eta   Disp.Err  Resid.Err  Res.Abs.E  Energy E. (NR)
 Iter       Eta     Unbal. Energy Ratio: Current   Required (LS)
---------------------------------------------------------------------------
    1         1      0.25!   1.5e-06    1.6e-06    3.7e-07  (NR)
    2         1   3.4e-07    2.3e-16      3e-16    7.9e-23  (NR)
---------------------------------------------------------------------------
Step: 4(4) completed. Elapsed CPU (sec) - step this: 0.413,  all: 2.148 
---------------------------------------------------------------------------

---------------------------------------------------------------------------
Job: Step 5(5), Log start: 12/13/2019 2:59:51 PM
---------------------------------------------------------------------------
 Iter       Eta   Disp.Err  Resid.Err  Res.Abs.E  Energy E. (NR)
 Iter       Eta     Unbal. Energy Ratio: Current   Required (LS)
---------------------------------------------------------------------------
    1         1       0.2!   1.4e-06    1.2e-06    2.8e-07  (NR)
    2         1   2.8e-07    1.7e-16    3.6e-16    4.8e-23  (NR)
---------------------------------------------------------------------------
Step: 5(5) completed. Elapsed CPU (sec) - step this: 0.409,  all: 2.557 
---------------------------------------------------------------------------

---------------------------------------------------------------------------
Job: Step 6(6), Log start: 12/13/2019 2:59:51 PM
---------------------------------------------------------------------------
 Iter       Eta   Disp.Err  Resid.Err  Res.Abs.E  Energy E. (NR)
 Iter       Eta     Unbal. Energy Ratio: Current   Required (LS)
---------------------------------------------------------------------------
    1         1      0.17!   1.3e-06      1e-06    2.2e-07  (NR)
    2         1   2.4e-07    2.6e-16    6.1e-16    6.5e-23  (NR)
---------------------------------------------------------------------------
Step: 6(6) completed. Elapsed CPU (sec) - step this: 0.414,  all: 2.971 
---------------------------------------------------------------------------

---------------------------------------------------------------------------
Job: Step 7(7), Log start: 12/13/2019 2:59:51 PM
---------------------------------------------------------------------------
 Iter       Eta   Disp.Err  Resid.Err  Res.Abs.E  Energy E. (NR)
 Iter       Eta     Unbal. Energy Ratio: Current   Required (LS)
---------------------------------------------------------------------------
    1         1      0.14!   1.3e-06    8.7e-07    1.8e-07  (NR)
    2         1   2.2e-07    2.1e-16    3.5e-16    4.7e-23  (NR)
---------------------------------------------------------------------------
Step: 7(7) completed. Elapsed CPU (sec) - step this: 0.406,  all: 3.377 
---------------------------------------------------------------------------

---------------------------------------------------------------------------
Job: Step 8(8), Log start: 12/13/2019 2:59:52 PM
---------------------------------------------------------------------------
 Iter       Eta   Disp.Err  Resid.Err  Res.Abs.E  Energy E. (NR)
 Iter       Eta     Unbal. Energy Ratio: Current   Required (LS)
---------------------------------------------------------------------------
    1         1      0.12!   1.3e-06    8.3e-07    1.6e-07  (NR)
    2         1     2e-07    4.8e-16    9.1e-16    9.6e-23  (NR)
---------------------------------------------------------------------------
Step: 8(8) completed. Elapsed CPU (sec) - step this: 0.4,  all: 3.777 
---------------------------------------------------------------------------

---------------------------------------------------------------------------
Job: Step 9(9), Log start: 12/13/2019 2:59:52 PM
---------------------------------------------------------------------------
 Iter       Eta   Disp.Err  Resid.Err  Res.Abs.E  Energy E. (NR)
 Iter       Eta     Unbal. Energy Ratio: Current   Required (LS)
---------------------------------------------------------------------------
    1         1      0.11!    0.0049     0.0066    0.00054! (NR)
    2         1    0.0021     0.0047     0.0059    9.7e-06  (NR)
---------------------------------------------------------------------------
Step: 9(9) completed. Elapsed CPU (sec) - step this: 0.401,  all: 4.178 
---------------------------------------------------------------------------

---------------------------------------------------------------------------
Job: Step 10(10), Log start: 12/13/2019 2:59:53 PM
---------------------------------------------------------------------------
 Iter       Eta   Disp.Err  Resid.Err  Res.Abs.E  Energy E. (NR)
 Iter       Eta     Unbal. Energy Ratio: Current   Required (LS)
---------------------------------------------------------------------------
    1         1       0.1!      0.01!     0.007      0.001! (NR)
    2         1    0.0011     0.0035     0.0024    3.7e-06  (NR)
---------------------------------------------------------------------------
Step: 10(10) completed. Elapsed CPU (sec) - step this: 0.41,  all: 4.588 
---------------------------------------------------------------------------

---------------------------------------------------------------------------
Job: Step 11(11), Log start: 12/13/2019 2:59:53 PM
---------------------------------------------------------------------------
 Iter       Eta   Disp.Err  Resid.Err  Res.Abs.E  Energy E. (NR)
 Iter       Eta     Unbal. Energy Ratio: Current   Required (LS)
---------------------------------------------------------------------------
    1         1     0.091!    0.0095     0.0066    0.00086! (NR)
    2         1   0.00076     0.0033     0.0022    2.5e-06  (NR)
---------------------------------------------------------------------------
Step: 11(11) completed. Elapsed CPU (sec) - step this: 0.403,  all: 4.991 
---------------------------------------------------------------------------

---------------------------------------------------------------------------
Job: Step 12(12), Log start: 12/13/2019 2:59:53 PM
---------------------------------------------------------------------------
 Iter       Eta   Disp.Err  Resid.Err  Res.Abs.E  Energy E. (NR)
 Iter       Eta     Unbal. Energy Ratio: Current   Required (LS)
---------------------------------------------------------------------------
    1         1     0.083!     0.018!     0.013!    0.0015! (NR)
    2         1    0.0028      0.011!    0.0075      3e-05  (NR)
    1         1                            0.93!       0.8  (LS)
Warning: Convergence criteria (within Line Search) not satisfied due to eta limits, continuing superordinate iterations. (Source line: 999, file: ..\..\Sources\CCStructures\execute_model_load_step_AL_LS_method.cpp, last modified at: Wed Mar 28 17:13:35 2018)
    3         1   0.00087       0.01!    0.0069    8.8e-06  (NR)
    4         1   0.00082     0.0094     0.0065    7.7e-06  (NR)
---------------------------------------------------------------------------
Step: 12(12) completed. Elapsed CPU (sec) - step this: 0.783,  all: 5.774 
---------------------------------------------------------------------------

---------------------------------------------------------------------------
Job: Step 13(13), Log start: 12/13/2019 2:59:54 PM
---------------------------------------------------------------------------
 Iter       Eta   Disp.Err  Resid.Err  Res.Abs.E  Energy E. (NR)
 Iter       Eta     Unbal. Energy Ratio: Current   Required (LS)
---------------------------------------------------------------------------
    1         1     0.077!     0.031!     0.021!    0.0024! (NR)
    2         1    0.0021       0.01!    0.0073    2.2e-05  (NR)
    3         1   0.00073     0.0098     0.0068    7.1e-06  (NR)
---------------------------------------------------------------------------
Step: 13(13) completed. Elapsed CPU (sec) - step this: 0.607,  all: 6.381 
---------------------------------------------------------------------------

---------------------------------------------------------------------------
Job: Step 14(14), Log start: 12/13/2019 2:59:55 PM
---------------------------------------------------------------------------
 Iter       Eta   Disp.Err  Resid.Err  Res.Abs.E  Energy E. (NR)
 Iter       Eta     Unbal. Energy Ratio: Current   Required (LS)
---------------------------------------------------------------------------
    1         1     0.071!      0.03!     0.021!    0.0022! (NR)
    2         1    0.0018     0.0048     0.0036    8.9e-06  (NR)
---------------------------------------------------------------------------
Step: 14(14) completed. Elapsed CPU (sec) - step this: 0.424,  all: 6.805 
---------------------------------------------------------------------------

---------------------------------------------------------------------------
Job: Step 15(15), Log start: 12/13/2019 2:59:55 PM
---------------------------------------------------------------------------
 Iter       Eta   Disp.Err  Resid.Err  Res.Abs.E  Energy E. (NR)
 Iter       Eta     Unbal. Energy Ratio: Current   Required (LS)
---------------------------------------------------------------------------
    1         1     0.067!     0.012!    0.0083    0.00081! (NR)
    2         1   0.00071     0.0042     0.0029      3e-06  (NR)
---------------------------------------------------------------------------
Step: 15(15) completed. Elapsed CPU (sec) - step this: 0.4,  all: 7.205 
---------------------------------------------------------------------------

---------------------------------------------------------------------------
Job: Step 16(16), Log start: 12/13/2019 2:59:56 PM
---------------------------------------------------------------------------
 Iter       Eta   Disp.Err  Resid.Err  Res.Abs.E  Energy E. (NR)
 Iter       Eta     Unbal. Energy Ratio: Current   Required (LS)
---------------------------------------------------------------------------
    1         1     0.062!     0.013!    0.0088     0.0008! (NR)
    2         1   0.00072     0.0044      0.003    3.2e-06  (NR)
---------------------------------------------------------------------------
Step: 16(16) completed. Elapsed CPU (sec) - step this: 0.389,  all: 7.594 
---------------------------------------------------------------------------

---------------------------------------------------------------------------
Job: Step 17(17), Log start: 12/13/2019 2:59:56 PM
---------------------------------------------------------------------------
 Iter       Eta   Disp.Err  Resid.Err  Res.Abs.E  Energy E. (NR)
 Iter       Eta     Unbal. Energy Ratio: Current   Required (LS)
---------------------------------------------------------------------------
    1         1     0.059!     0.013!    0.0093    0.00079! (NR)
    2         1   0.00073     0.0045     0.0032    3.3e-06  (NR)
---------------------------------------------------------------------------
Step: 17(17) completed. Elapsed CPU (sec) - step this: 0.426,  all: 8.02 
---------------------------------------------------------------------------

---------------------------------------------------------------------------
Job: Step 18(18), Log start: 12/13/2019 2:59:56 PM
---------------------------------------------------------------------------
 Iter       Eta   Disp.Err  Resid.Err  Res.Abs.E  Energy E. (NR)
 Iter       Eta     Unbal. Energy Ratio: Current   Required (LS)
---------------------------------------------------------------------------
    1         1     0.056!    0.0058     0.0042    0.00032! (NR)
    2         1   0.00035     0.0018     0.0012    6.2e-07  (NR)
---------------------------------------------------------------------------
Step: 18(18) completed. Elapsed CPU (sec) - step this: 0.412,  all: 8.432 
---------------------------------------------------------------------------

---------------------------------------------------------------------------
Job: Step 19(19), Log start: 12/13/2019 2:59:57 PM
---------------------------------------------------------------------------
 Iter       Eta   Disp.Err  Resid.Err  Res.Abs.E  Energy E. (NR)
 Iter       Eta     Unbal. Energy Ratio: Current   Required (LS)
---------------------------------------------------------------------------
    1         1     0.053!    0.0054     0.0037    0.00028! (NR)
    2         1    0.0003     0.0018     0.0013    5.5e-07  (NR)
---------------------------------------------------------------------------
Step: 19(19) completed. Elapsed CPU (sec) - step this: 0.387,  all: 8.819 
---------------------------------------------------------------------------

---------------------------------------------------------------------------
Job: Step 20(20), Log start: 12/13/2019 2:59:57 PM
---------------------------------------------------------------------------
 Iter       Eta   Disp.Err  Resid.Err  Res.Abs.E  Energy E. (NR)
 Iter       Eta     Unbal. Energy Ratio: Current   Required (LS)
---------------------------------------------------------------------------
    1         1      0.05!    0.0056     0.0039    0.00028! (NR)
    2         1    0.0003     0.0019     0.0013    5.8e-07  (NR)
---------------------------------------------------------------------------
Step: 20(20) completed. Elapsed CPU (sec) - step this: 0.412,  all: 9.231 
---------------------------------------------------------------------------

---------------------------------------------------------------------------
Job: Step 21(21), Log start: 12/13/2019 2:59:58 PM
---------------------------------------------------------------------------
 Iter       Eta   Disp.Err  Resid.Err  Res.Abs.E  Energy E. (NR)
 Iter       Eta     Unbal. Energy Ratio: Current   Required (LS)
---------------------------------------------------------------------------
    1         1     0.048!    0.0058      0.004    0.00028! (NR)
    2         1   0.00031      0.002     0.0014    6.1e-07  (NR)
---------------------------------------------------------------------------
Step: 21(21) completed. Elapsed CPU (sec) - step this: 0.395,  all: 9.626 
---------------------------------------------------------------------------

---------------------------------------------------------------------------
Job: Step 22(22), Log start: 12/13/2019 2:59:58 PM
---------------------------------------------------------------------------
 Iter       Eta   Disp.Err  Resid.Err  Res.Abs.E  Energy E. (NR)
 Iter       Eta     Unbal. Energy Ratio: Current   Required (LS)
---------------------------------------------------------------------------
    1         1     0.045!    0.0061     0.0042    0.00028! (NR)
    2         1   0.00031     0.0021     0.0014    6.4e-07  (NR)
---------------------------------------------------------------------------
Step: 22(22) completed. Elapsed CPU (sec) - step this: 0.411,  all: 10.037 
---------------------------------------------------------------------------

---------------------------------------------------------------------------
Job: Step 23(23), Log start: 12/13/2019 2:59:58 PM
---------------------------------------------------------------------------
 Iter       Eta   Disp.Err  Resid.Err  Res.Abs.E  Energy E. (NR)
 Iter       Eta     Unbal. Energy Ratio: Current   Required (LS)
---------------------------------------------------------------------------
    1         1     0.043!    0.0063     0.0044    0.00027! (NR)
    2         1   0.00032     0.0021     0.0015    6.8e-07  (NR)
---------------------------------------------------------------------------
Step: 23(23) completed. Elapsed CPU (sec) - step this: 0.405,  all: 10.442 
---------------------------------------------------------------------------

---------------------------------------------------------------------------
Job: Step 24(24), Log start: 12/13/2019 2:59:59 PM
---------------------------------------------------------------------------
 Iter       Eta   Disp.Err  Resid.Err  Res.Abs.E  Energy E. (NR)
 Iter       Eta     Unbal. Energy Ratio: Current   Required (LS)
---------------------------------------------------------------------------
    1         1     0.042!    0.0065     0.0045    0.00027! (NR)
    2         1   0.00032     0.0022     0.0015    7.1e-07  (NR)
---------------------------------------------------------------------------
Step: 24(24) completed. Elapsed CPU (sec) - step this: 0.435,  all: 10.877 
---------------------------------------------------------------------------

---------------------------------------------------------------------------
Job: Step 25(25), Log start: 12/13/2019 2:59:59 PM
---------------------------------------------------------------------------
 Iter       Eta   Disp.Err  Resid.Err  Res.Abs.E  Energy E. (NR)
 Iter       Eta     Unbal. Energy Ratio: Current   Required (LS)
---------------------------------------------------------------------------
    1         1      0.04!    0.0067     0.0047    0.00027! (NR)
    2         1   0.00033     0.0023     0.0016    7.4e-07  (NR)
---------------------------------------------------------------------------
Step: 25(25) completed. Elapsed CPU (sec) - step this: 0.429,  all: 11.306 
---------------------------------------------------------------------------

---------------------------------------------------------------------------
Job: Step 26(26), Log start: 12/13/2019 3:00:00 PM
---------------------------------------------------------------------------
 Iter       Eta   Disp.Err  Resid.Err  Res.Abs.E  Energy E. (NR)
 Iter       Eta     Unbal. Energy Ratio: Current   Required (LS)
---------------------------------------------------------------------------
    1         1     0.038!    0.0069     0.0048    0.00027! (NR)
    2         1   0.00033     0.0023     0.0016    7.7e-07  (NR)
---------------------------------------------------------------------------
Step: 26(26) completed. Elapsed CPU (sec) - step this: 0.436,  all: 11.742 
---------------------------------------------------------------------------

---------------------------------------------------------------------------
Job: Step 27(27), Log start: 12/13/2019 3:00:00 PM
---------------------------------------------------------------------------
 Iter       Eta   Disp.Err  Resid.Err  Res.Abs.E  Energy E. (NR)
 Iter       Eta     Unbal. Energy Ratio: Current   Required (LS)
---------------------------------------------------------------------------
    1         1     0.037!    0.0072      0.005    0.00027! (NR)
    2         1   0.00033     0.0024     0.0017    8.1e-07  (NR)
---------------------------------------------------------------------------
Step: 27(27) completed. Elapsed CPU (sec) - step this: 0.429,  all: 12.171 
---------------------------------------------------------------------------

---------------------------------------------------------------------------
Job: Step 28(28), Log start: 12/13/2019 3:00:01 PM
---------------------------------------------------------------------------
 Iter       Eta   Disp.Err  Resid.Err  Res.Abs.E  Energy E. (NR)
 Iter       Eta     Unbal. Energy Ratio: Current   Required (LS)
---------------------------------------------------------------------------
    1         1     0.036!    0.0074     0.0051    0.00026! (NR)
    2         1   0.00034     0.0025     0.0017    8.4e-07  (NR)
---------------------------------------------------------------------------
Step: 28(28) completed. Elapsed CPU (sec) - step this: 0.42,  all: 12.591 
---------------------------------------------------------------------------

---------------------------------------------------------------------------
Job: Step 29(29), Log start: 12/13/2019 3:00:01 PM
---------------------------------------------------------------------------
 Iter       Eta   Disp.Err  Resid.Err  Res.Abs.E  Energy E. (NR)
 Iter       Eta     Unbal. Energy Ratio: Current   Required (LS)
---------------------------------------------------------------------------
    1         1     0.034!    0.0076     0.0053    0.00026! (NR)
    2         1   0.00034     0.0026     0.0018    8.7e-07  (NR)
---------------------------------------------------------------------------
Step: 29(29) completed. Elapsed CPU (sec) - step this: 0.381,  all: 12.972 
---------------------------------------------------------------------------

---------------------------------------------------------------------------
Job: Step 30(30), Log start: 12/13/2019 3:00:01 PM
---------------------------------------------------------------------------
 Iter       Eta   Disp.Err  Resid.Err  Res.Abs.E  Energy E. (NR)
 Iter       Eta     Unbal. Energy Ratio: Current   Required (LS)
---------------------------------------------------------------------------
    1         1     0.033!    0.0078     0.0054    0.00026! (NR)
    2         1   0.00034     0.0026     0.0018    9.1e-07  (NR)
---------------------------------------------------------------------------
Step: 30(30) completed. Elapsed CPU (sec) - step this: 0.41,  all: 13.382 
---------------------------------------------------------------------------

---------------------------------------------------------------------------
Job: Step 31(31), Log start: 12/13/2019 3:00:02 PM
---------------------------------------------------------------------------
 Iter       Eta   Disp.Err  Resid.Err  Res.Abs.E  Energy E. (NR)
 Iter       Eta     Unbal. Energy Ratio: Current   Required (LS)
---------------------------------------------------------------------------
    1         1     0.032!     0.008     0.0056    0.00026! (NR)
    2         1   0.00035     0.0027     0.0019    9.4e-07  (NR)
---------------------------------------------------------------------------
Step: 31(31) completed. Elapsed CPU (sec) - step this: 0.41,  all: 13.792 
---------------------------------------------------------------------------

---------------------------------------------------------------------------
Job: Step 32(32), Log start: 12/13/2019 3:00:02 PM
---------------------------------------------------------------------------
 Iter       Eta   Disp.Err  Resid.Err  Res.Abs.E  Energy E. (NR)
 Iter       Eta     Unbal. Energy Ratio: Current   Required (LS)
---------------------------------------------------------------------------
    1         1     0.031!    0.0083     0.0058    0.00026! (NR)
    2         1   0.00035     0.0028     0.0019    9.7e-07  (NR)
---------------------------------------------------------------------------
Step: 32(32) completed. Elapsed CPU (sec) - step this: 0.396,  all: 14.188 
---------------------------------------------------------------------------

---------------------------------------------------------------------------
Job: Step 33(33), Log start: 12/13/2019 3:00:03 PM
---------------------------------------------------------------------------
 Iter       Eta   Disp.Err  Resid.Err  Res.Abs.E  Energy E. (NR)
 Iter       Eta     Unbal. Energy Ratio: Current   Required (LS)
---------------------------------------------------------------------------
    1         1      0.03!    0.0085     0.0059    0.00026! (NR)
    2         1   0.00035     0.0028      0.002      1e-06  (NR)
---------------------------------------------------------------------------
Step: 33(33) completed. Elapsed CPU (sec) - step this: 0.4,  all: 14.588 
---------------------------------------------------------------------------

---------------------------------------------------------------------------
Job: Step 34(34), Log start: 12/13/2019 3:00:03 PM
---------------------------------------------------------------------------
 Iter       Eta   Disp.Err  Resid.Err  Res.Abs.E  Energy E. (NR)
 Iter       Eta     Unbal. Energy Ratio: Current   Required (LS)
---------------------------------------------------------------------------
    1         1     0.029!    0.0087     0.0061    0.00026! (NR)
    2         1   0.00035     0.0029      0.002      1e-06  (NR)
---------------------------------------------------------------------------
Step: 34(34) completed. Elapsed CPU (sec) - step this: 0.406,  all: 14.994 
---------------------------------------------------------------------------

---------------------------------------------------------------------------
Job: Step 35(35), Log start: 12/13/2019 3:00:03 PM
---------------------------------------------------------------------------
 Iter       Eta   Disp.Err  Resid.Err  Res.Abs.E  Energy E. (NR)
 Iter       Eta     Unbal. Energy Ratio: Current   Required (LS)
---------------------------------------------------------------------------
    1         1     0.029!    0.0089     0.0062    0.00026! (NR)
    2         1   0.00036      0.003     0.0021    1.1e-06  (NR)
---------------------------------------------------------------------------
Step: 35(35) completed. Elapsed CPU (sec) - step this: 0.405,  all: 15.399 
---------------------------------------------------------------------------

---------------------------------------------------------------------------
Job: Step 36(36), Log start: 12/13/2019 3:00:04 PM
---------------------------------------------------------------------------
 Iter       Eta   Disp.Err  Resid.Err  Res.Abs.E  Energy E. (NR)
 Iter       Eta     Unbal. Energy Ratio: Current   Required (LS)
---------------------------------------------------------------------------
    1         1     0.028!    0.0092     0.0064    0.00025! (NR)
    2         1   0.00036     0.0031     0.0021    1.1e-06  (NR)
---------------------------------------------------------------------------
Step: 36(36) completed. Elapsed CPU (sec) - step this: 0.41,  all: 15.809 
---------------------------------------------------------------------------

---------------------------------------------------------------------------
Job: Step 37(37), Log start: 12/13/2019 3:00:04 PM
---------------------------------------------------------------------------
 Iter       Eta   Disp.Err  Resid.Err  Res.Abs.E  Energy E. (NR)
 Iter       Eta     Unbal. Energy Ratio: Current   Required (LS)
---------------------------------------------------------------------------
    1         1     0.027!    0.0094     0.0065    0.00025! (NR)
    2         1   0.00036     0.0031     0.0022    1.1e-06  (NR)
---------------------------------------------------------------------------
Step: 37(37) completed. Elapsed CPU (sec) - step this: 0.406,  all: 16.215 
---------------------------------------------------------------------------

---------------------------------------------------------------------------
Job: Step 38(38), Log start: 12/13/2019 3:00:05 PM
---------------------------------------------------------------------------
 Iter       Eta   Disp.Err  Resid.Err  Res.Abs.E  Energy E. (NR)
 Iter       Eta     Unbal. Energy Ratio: Current   Required (LS)
---------------------------------------------------------------------------
    1         1     0.026!    0.0096     0.0067    0.00025! (NR)
    2         1   0.00036     0.0032     0.0022    1.2e-06  (NR)
---------------------------------------------------------------------------
Step: 38(38) completed. Elapsed CPU (sec) - step this: 0.415,  all: 16.63 
---------------------------------------------------------------------------

---------------------------------------------------------------------------
Job: Step 39(39), Log start: 12/13/2019 3:00:05 PM
---------------------------------------------------------------------------
 Iter       Eta   Disp.Err  Resid.Err  Res.Abs.E  Energy E. (NR)
 Iter       Eta     Unbal. Energy Ratio: Current   Required (LS)
---------------------------------------------------------------------------
    1         1     0.026!    0.0098     0.0069    0.00025! (NR)
    2         1   0.00036     0.0033     0.0023    1.2e-06  (NR)
---------------------------------------------------------------------------
Step: 39(39) completed. Elapsed CPU (sec) - step this: 0.406,  all: 17.036 
---------------------------------------------------------------------------

---------------------------------------------------------------------------
Job: Step 40(40), Log start: 12/13/2019 3:00:05 PM
---------------------------------------------------------------------------
 Iter       Eta   Disp.Err  Resid.Err  Res.Abs.E  Energy E. (NR)
 Iter       Eta     Unbal. Energy Ratio: Current   Required (LS)
---------------------------------------------------------------------------
    1         1     0.025!      0.01!     0.007    0.00025! (NR)
    2         1   0.00036     0.0034     0.0024    1.2e-06  (NR)
---------------------------------------------------------------------------
Step: 40(40) completed. Elapsed CPU (sec) - step this: 0.397,  all: 17.433 
---------------------------------------------------------------------------

---------------------------------------------------------------------------
Job: Step 41(41), Log start: 12/13/2019 3:00:06 PM
---------------------------------------------------------------------------
 Iter       Eta   Disp.Err  Resid.Err  Res.Abs.E  Energy E. (NR)
 Iter       Eta     Unbal. Energy Ratio: Current   Required (LS)
---------------------------------------------------------------------------
    1         1     0.024!      0.01!    0.0072    0.00025! (NR)
    2         1   0.00036     0.0034     0.0024    1.2e-06  (NR)
---------------------------------------------------------------------------
Step: 41(41) completed. Elapsed CPU (sec) - step this: 0.4,  all: 17.833 
---------------------------------------------------------------------------

---------------------------------------------------------------------------
Job: Step 42(42), Log start: 12/13/2019 3:00:06 PM
---------------------------------------------------------------------------
 Iter       Eta   Disp.Err  Resid.Err  Res.Abs.E  Energy E. (NR)
 Iter       Eta     Unbal. Energy Ratio: Current   Required (LS)
---------------------------------------------------------------------------
    1         1     0.024!     0.011!    0.0074    0.00025! (NR)
    2         1   0.00036     0.0035     0.0025    1.3e-06  (NR)
---------------------------------------------------------------------------
Step: 42(42) completed. Elapsed CPU (sec) - step this: 0.384,  all: 18.217 
---------------------------------------------------------------------------

---------------------------------------------------------------------------
Job: Step 43(43), Log start: 12/13/2019 3:00:07 PM
---------------------------------------------------------------------------
 Iter       Eta   Disp.Err  Resid.Err  Res.Abs.E  Energy E. (NR)
 Iter       Eta     Unbal. Energy Ratio: Current   Required (LS)
---------------------------------------------------------------------------
    1         1     0.023!     0.011!    0.0075    0.00025! (NR)
    2         1   0.00036     0.0036     0.0025    1.3e-06  (NR)
---------------------------------------------------------------------------
Step: 43(43) completed. Elapsed CPU (sec) - step this: 0.391,  all: 18.608 
---------------------------------------------------------------------------

---------------------------------------------------------------------------
Job: Step 44(44), Log start: 12/13/2019 3:00:07 PM
---------------------------------------------------------------------------
 Iter       Eta   Disp.Err  Resid.Err  Res.Abs.E  Energy E. (NR)
 Iter       Eta     Unbal. Energy Ratio: Current   Required (LS)
---------------------------------------------------------------------------
    1         1     0.023!     0.011!    0.0077    0.00025! (NR)
    2         1   0.00036     0.0037     0.0026    1.3e-06  (NR)
---------------------------------------------------------------------------
Step: 44(44) completed. Elapsed CPU (sec) - step this: 0.404,  all: 19.012 
---------------------------------------------------------------------------

---------------------------------------------------------------------------
Job: Step 45(45), Log start: 12/13/2019 3:00:07 PM
---------------------------------------------------------------------------
 Iter       Eta   Disp.Err  Resid.Err  Res.Abs.E  Energy E. (NR)
 Iter       Eta     Unbal. Energy Ratio: Current   Required (LS)
---------------------------------------------------------------------------
    1         1     0.022!     0.011!    0.0079    0.00025! (NR)
    2         1   0.00036     0.0037     0.0026    1.3e-06  (NR)
---------------------------------------------------------------------------
Step: 45(45) completed. Elapsed CPU (sec) - step this: 0.43,  all: 19.442 
---------------------------------------------------------------------------

---------------------------------------------------------------------------
Job: Step 46(46), Log start: 12/13/2019 3:00:08 PM
---------------------------------------------------------------------------
 Iter       Eta   Disp.Err  Resid.Err  Res.Abs.E  Energy E. (NR)
 Iter       Eta     Unbal. Energy Ratio: Current   Required (LS)
---------------------------------------------------------------------------
    1         1     0.022!     0.011!    0.0081    0.00025! (NR)
    2         1   0.00036     0.0038     0.0027    1.4e-06  (NR)
---------------------------------------------------------------------------
Step: 46(46) completed. Elapsed CPU (sec) - step this: 0.407,  all: 19.849 
---------------------------------------------------------------------------

---------------------------------------------------------------------------
Job: Step 47(47), Log start: 12/13/2019 3:00:08 PM
---------------------------------------------------------------------------
 Iter       Eta   Disp.Err  Resid.Err  Res.Abs.E  Energy E. (NR)
 Iter       Eta     Unbal. Energy Ratio: Current   Required (LS)
---------------------------------------------------------------------------
    1         1     0.021!     0.012!    0.0082    0.00025! (NR)
    2         1   0.00036     0.0039     0.0027    1.4e-06  (NR)
---------------------------------------------------------------------------
Step: 47(47) completed. Elapsed CPU (sec) - step this: 0.412,  all: 20.261 
---------------------------------------------------------------------------

---------------------------------------------------------------------------
Job: Step 48(48), Log start: 12/13/2019 3:00:09 PM
---------------------------------------------------------------------------
 Iter       Eta   Disp.Err  Resid.Err  Res.Abs.E  Energy E. (NR)
 Iter       Eta     Unbal. Energy Ratio: Current   Required (LS)
---------------------------------------------------------------------------
    1         1     0.021!     0.012!    0.0084    0.00025! (NR)
    2         1   0.00036      0.004     0.0028    1.4e-06  (NR)
---------------------------------------------------------------------------
Step: 48(48) completed. Elapsed CPU (sec) - step this: 0.397,  all: 20.658 
---------------------------------------------------------------------------

---------------------------------------------------------------------------
Job: Step 49(49), Log start: 12/13/2019 3:00:09 PM
---------------------------------------------------------------------------
 Iter       Eta   Disp.Err  Resid.Err  Res.Abs.E  Energy E. (NR)
 Iter       Eta     Unbal. Energy Ratio: Current   Required (LS)
---------------------------------------------------------------------------
    1         1      0.02!     0.012!    0.0086    0.00025! (NR)
    2         1   0.00036     0.0041     0.0029    1.4e-06  (NR)
---------------------------------------------------------------------------
Step: 49(49) completed. Elapsed CPU (sec) - step this: 0.39,  all: 21.048 
---------------------------------------------------------------------------

---------------------------------------------------------------------------
Job: Step 50(50), Log start: 12/13/2019 3:00:09 PM
---------------------------------------------------------------------------
 Iter       Eta   Disp.Err  Resid.Err  Res.Abs.E  Energy E. (NR)
 Iter       Eta     Unbal. Energy Ratio: Current   Required (LS)
---------------------------------------------------------------------------
    1         1      0.02!     0.012!    0.0088    0.00025! (NR)
    2         1   0.00036     0.0041     0.0029    1.5e-06  (NR)
---------------------------------------------------------------------------
Step: 50(50) completed. Elapsed CPU (sec) - step this: 0.395,  all: 21.443 
---------------------------------------------------------------------------

---------------------------------------------------------------------------
Job: ATENA, Log end: 12/13/2019 3:00:10 PM
---------------------------------------------------------------------------



---------------------------------------------------------------------------
Job: ATENA, Log start: 12/13/2019 3:46:06 PM
---------------------------------------------------------------------------

ATENA x64 Version 5.6.1.16910   (c) Cervenka Consulting 1999-2018
License Id. 683, Key No. 1, User RWTH Aachen


---------------------------------------------------------------------------
Job: Step 1(1), Log start: 12/13/2019 3:46:06 PM
---------------------------------------------------------------------------
 Iter       Eta   Disp.Err  Resid.Err  Res.Abs.E  Energy E. (NR)
 Iter       Eta     Unbal. Energy Ratio: Current   Required (LS)
---------------------------------------------------------------------------
    1         1         1!   4.5e-06    6.5e-06    4.5e-06  (NR)
    2         1   1.2e-06    3.1e-16    6.1e-16    3.9e-22  (NR)
---------------------------------------------------------------------------
Step: 1(1) completed. Elapsed CPU (sec) - step this: 0.674,  all: 0.674 
---------------------------------------------------------------------------

---------------------------------------------------------------------------
Job: Step 2(2), Log start: 12/13/2019 3:46:07 PM
---------------------------------------------------------------------------
 Iter       Eta   Disp.Err  Resid.Err  Res.Abs.E  Energy E. (NR)
 Iter       Eta     Unbal. Energy Ratio: Current   Required (LS)
---------------------------------------------------------------------------
    1         1       0.5!   2.3e-06    3.2e-06    1.2e-06  (NR)
    2         1   6.3e-07      2e-16      3e-16    1.3e-22  (NR)
---------------------------------------------------------------------------
Step: 2(2) completed. Elapsed CPU (sec) - step this: 0.52,  all: 1.194 
---------------------------------------------------------------------------

---------------------------------------------------------------------------
Job: Step 3(3), Log start: 12/13/2019 3:46:07 PM
---------------------------------------------------------------------------
 Iter       Eta   Disp.Err  Resid.Err  Res.Abs.E  Energy E. (NR)
 Iter       Eta     Unbal. Energy Ratio: Current   Required (LS)
---------------------------------------------------------------------------
    1         1      0.33!   1.7e-06    2.1e-06    5.8e-07  (NR)
    2         1   4.4e-07    2.7e-16      4e-16    1.2e-22  (NR)
---------------------------------------------------------------------------
Step: 3(3) completed. Elapsed CPU (sec) - step this: 0.412,  all: 1.606 
---------------------------------------------------------------------------

---------------------------------------------------------------------------
Job: Step 4(4), Log start: 12/13/2019 3:46:08 PM
---------------------------------------------------------------------------
 Iter       Eta   Disp.Err  Resid.Err  Res.Abs.E  Energy E. (NR)
 Iter       Eta     Unbal. Energy Ratio: Current   Required (LS)
---------------------------------------------------------------------------
    1         1      0.25!   1.5e-06    1.6e-06    3.7e-07  (NR)
    2         1   3.4e-07    2.3e-16      3e-16    7.9e-23  (NR)
---------------------------------------------------------------------------
Step: 4(4) completed. Elapsed CPU (sec) - step this: 0.416,  all: 2.022 
---------------------------------------------------------------------------

---------------------------------------------------------------------------
Job: Step 5(5), Log start: 12/13/2019 3:46:08 PM
---------------------------------------------------------------------------
 Iter       Eta   Disp.Err  Resid.Err  Res.Abs.E  Energy E. (NR)
 Iter       Eta     Unbal. Energy Ratio: Current   Required (LS)
---------------------------------------------------------------------------
    1         1       0.2!   1.4e-06    1.2e-06    2.8e-07  (NR)
    2         1   2.8e-07    1.7e-16    3.6e-16    4.8e-23  (NR)
---------------------------------------------------------------------------
Step: 5(5) completed. Elapsed CPU (sec) - step this: 0.396,  all: 2.418 
---------------------------------------------------------------------------

---------------------------------------------------------------------------
Job: Step 6(6), Log start: 12/13/2019 3:46:08 PM
---------------------------------------------------------------------------
 Iter       Eta   Disp.Err  Resid.Err  Res.Abs.E  Energy E. (NR)
 Iter       Eta     Unbal. Energy Ratio: Current   Required (LS)
---------------------------------------------------------------------------
    1         1      0.17!   1.3e-06      1e-06    2.2e-07  (NR)
    2         1   2.4e-07    2.6e-16    6.1e-16    6.5e-23  (NR)
---------------------------------------------------------------------------
Step: 6(6) completed. Elapsed CPU (sec) - step this: 0.391,  all: 2.809 
---------------------------------------------------------------------------

---------------------------------------------------------------------------
Job: Step 7(7), Log start: 12/13/2019 3:46:09 PM
---------------------------------------------------------------------------
 Iter       Eta   Disp.Err  Resid.Err  Res.Abs.E  Energy E. (NR)
 Iter       Eta     Unbal. Energy Ratio: Current   Required (LS)
---------------------------------------------------------------------------
    1         1      0.14!   1.3e-06    8.7e-07    1.8e-07  (NR)
    2         1   2.2e-07    2.1e-16    3.5e-16    4.7e-23  (NR)
---------------------------------------------------------------------------
Step: 7(7) completed. Elapsed CPU (sec) - step this: 0.414,  all: 3.223 
---------------------------------------------------------------------------

---------------------------------------------------------------------------
Job: Step 8(8), Log start: 12/13/2019 3:46:09 PM
---------------------------------------------------------------------------
 Iter       Eta   Disp.Err  Resid.Err  Res.Abs.E  Energy E. (NR)
 Iter       Eta     Unbal. Energy Ratio: Current   Required (LS)
---------------------------------------------------------------------------
    1         1      0.12!   1.3e-06    8.3e-07    1.6e-07  (NR)
    2         1     2e-07    4.8e-16    9.1e-16    9.6e-23  (NR)
---------------------------------------------------------------------------
Step: 8(8) completed. Elapsed CPU (sec) - step this: 0.39,  all: 3.613 
---------------------------------------------------------------------------

---------------------------------------------------------------------------
Job: Step 9(9), Log start: 12/13/2019 3:46:10 PM
---------------------------------------------------------------------------
 Iter       Eta   Disp.Err  Resid.Err  Res.Abs.E  Energy E. (NR)
 Iter       Eta     Unbal. Energy Ratio: Current   Required (LS)
---------------------------------------------------------------------------
    1         1      0.11!    0.0049     0.0066    0.00054! (NR)
    2         1    0.0021     0.0047     0.0059    9.7e-06  (NR)
---------------------------------------------------------------------------
Step: 9(9) completed. Elapsed CPU (sec) - step this: 0.401,  all: 4.014 
---------------------------------------------------------------------------

---------------------------------------------------------------------------
Job: Step 10(10), Log start: 12/13/2019 3:46:10 PM
---------------------------------------------------------------------------
 Iter       Eta   Disp.Err  Resid.Err  Res.Abs.E  Energy E. (NR)
 Iter       Eta     Unbal. Energy Ratio: Current   Required (LS)
---------------------------------------------------------------------------
    1         1       0.1!      0.01!     0.007      0.001! (NR)
    2         1    0.0011     0.0035     0.0024    3.7e-06  (NR)
---------------------------------------------------------------------------
Step: 10(10) completed. Elapsed CPU (sec) - step this: 0.397,  all: 4.411 
---------------------------------------------------------------------------

---------------------------------------------------------------------------
Job: Step 11(11), Log start: 12/13/2019 3:46:10 PM
---------------------------------------------------------------------------
 Iter       Eta   Disp.Err  Resid.Err  Res.Abs.E  Energy E. (NR)
 Iter       Eta     Unbal. Energy Ratio: Current   Required (LS)
---------------------------------------------------------------------------
    1         1     0.091!    0.0095     0.0066    0.00086! (NR)
    2         1   0.00076     0.0033     0.0022    2.5e-06  (NR)
---------------------------------------------------------------------------
Step: 11(11) completed. Elapsed CPU (sec) - step this: 0.393,  all: 4.804 
---------------------------------------------------------------------------

---------------------------------------------------------------------------
Job: Step 12(12), Log start: 12/13/2019 3:46:11 PM
---------------------------------------------------------------------------
 Iter       Eta   Disp.Err  Resid.Err  Res.Abs.E  Energy E. (NR)
 Iter       Eta     Unbal. Energy Ratio: Current   Required (LS)
---------------------------------------------------------------------------
    1         1     0.083!     0.018!     0.013!    0.0015! (NR)
    2         1    0.0028      0.011!    0.0075      3e-05  (NR)
    1         1                            0.93!       0.8  (LS)
Warning: Convergence criteria (within Line Search) not satisfied due to eta limits, continuing superordinate iterations. (Source line: 999, file: ..\..\Sources\CCStructures\execute_model_load_step_AL_LS_method.cpp, last modified at: Wed Mar 28 17:13:35 2018)
    3         1   0.00087       0.01!    0.0069    8.8e-06  (NR)
    4         1   0.00082     0.0094     0.0065    7.7e-06  (NR)
---------------------------------------------------------------------------
Step: 12(12) completed. Elapsed CPU (sec) - step this: 0.768,  all: 5.572 
---------------------------------------------------------------------------

---------------------------------------------------------------------------
Job: Step 13(13), Log start: 12/13/2019 3:46:12 PM
---------------------------------------------------------------------------
 Iter       Eta   Disp.Err  Resid.Err  Res.Abs.E  Energy E. (NR)
 Iter       Eta     Unbal. Energy Ratio: Current   Required (LS)
---------------------------------------------------------------------------
    1         1     0.077!     0.031!     0.021!    0.0024! (NR)
    2         1    0.0021       0.01!    0.0073    2.2e-05  (NR)
    3         1   0.00073     0.0098     0.0068    7.1e-06  (NR)
---------------------------------------------------------------------------
Step: 13(13) completed. Elapsed CPU (sec) - step this: 0.588,  all: 6.16 
---------------------------------------------------------------------------

---------------------------------------------------------------------------
Job: Step 14(14), Log start: 12/13/2019 3:46:12 PM
---------------------------------------------------------------------------
 Iter       Eta   Disp.Err  Resid.Err  Res.Abs.E  Energy E. (NR)
 Iter       Eta     Unbal. Energy Ratio: Current   Required (LS)
---------------------------------------------------------------------------
    1         1     0.071!      0.03!     0.021!    0.0022! (NR)
    2         1    0.0018     0.0048     0.0036    8.9e-06  (NR)
---------------------------------------------------------------------------
Step: 14(14) completed. Elapsed CPU (sec) - step this: 0.422,  all: 6.582 
---------------------------------------------------------------------------

---------------------------------------------------------------------------
Job: Step 15(15), Log start: 12/13/2019 3:46:13 PM
---------------------------------------------------------------------------
 Iter       Eta   Disp.Err  Resid.Err  Res.Abs.E  Energy E. (NR)
 Iter       Eta     Unbal. Energy Ratio: Current   Required (LS)
---------------------------------------------------------------------------
    1         1     0.067!     0.012!    0.0083    0.00081! (NR)
    2         1   0.00071     0.0042     0.0029      3e-06  (NR)
---------------------------------------------------------------------------
Step: 15(15) completed. Elapsed CPU (sec) - step this: 0.424,  all: 7.006 
---------------------------------------------------------------------------

---------------------------------------------------------------------------
Job: Step 16(16), Log start: 12/13/2019 3:46:13 PM
---------------------------------------------------------------------------
 Iter       Eta   Disp.Err  Resid.Err  Res.Abs.E  Energy E. (NR)
 Iter       Eta     Unbal. Energy Ratio: Current   Required (LS)
---------------------------------------------------------------------------
    1         1     0.062!     0.013!    0.0088     0.0008! (NR)
    2         1   0.00072     0.0044      0.003    3.2e-06  (NR)
---------------------------------------------------------------------------
Step: 16(16) completed. Elapsed CPU (sec) - step this: 0.406,  all: 7.412 
---------------------------------------------------------------------------

---------------------------------------------------------------------------
Job: Step 17(17), Log start: 12/13/2019 3:46:13 PM
---------------------------------------------------------------------------
 Iter       Eta   Disp.Err  Resid.Err  Res.Abs.E  Energy E. (NR)
 Iter       Eta     Unbal. Energy Ratio: Current   Required (LS)
---------------------------------------------------------------------------
    1         1     0.059!     0.013!    0.0093    0.00079! (NR)
    2         1   0.00073     0.0045     0.0032    3.3e-06  (NR)
---------------------------------------------------------------------------
Step: 17(17) completed. Elapsed CPU (sec) - step this: 0.402,  all: 7.814 
---------------------------------------------------------------------------

---------------------------------------------------------------------------
Job: Step 18(18), Log start: 12/13/2019 3:46:14 PM
---------------------------------------------------------------------------
 Iter       Eta   Disp.Err  Resid.Err  Res.Abs.E  Energy E. (NR)
 Iter       Eta     Unbal. Energy Ratio: Current   Required (LS)
---------------------------------------------------------------------------
    1         1     0.056!    0.0058     0.0042    0.00032! (NR)
    2         1   0.00035     0.0018     0.0012    6.2e-07  (NR)
---------------------------------------------------------------------------
Step: 18(18) completed. Elapsed CPU (sec) - step this: 0.399,  all: 8.213 
---------------------------------------------------------------------------

---------------------------------------------------------------------------
Job: Step 19(19), Log start: 12/13/2019 3:46:14 PM
---------------------------------------------------------------------------
 Iter       Eta   Disp.Err  Resid.Err  Res.Abs.E  Energy E. (NR)
 Iter       Eta     Unbal. Energy Ratio: Current   Required (LS)
---------------------------------------------------------------------------
    1         1     0.053!    0.0054     0.0037    0.00028! (NR)
    2         1    0.0003     0.0018     0.0013    5.5e-07  (NR)
---------------------------------------------------------------------------
Step: 19(19) completed. Elapsed CPU (sec) - step this: 0.414,  all: 8.627 
---------------------------------------------------------------------------

---------------------------------------------------------------------------
Job: Step 20(20), Log start: 12/13/2019 3:46:15 PM
---------------------------------------------------------------------------
 Iter       Eta   Disp.Err  Resid.Err  Res.Abs.E  Energy E. (NR)
 Iter       Eta     Unbal. Energy Ratio: Current   Required (LS)
---------------------------------------------------------------------------
    1         1      0.05!    0.0056     0.0039    0.00028! (NR)
    2         1    0.0003     0.0019     0.0013    5.8e-07  (NR)
---------------------------------------------------------------------------
Step: 20(20) completed. Elapsed CPU (sec) - step this: 0.415,  all: 9.042 
---------------------------------------------------------------------------

---------------------------------------------------------------------------
Job: Step 21(21), Log start: 12/13/2019 3:46:15 PM
---------------------------------------------------------------------------
 Iter       Eta   Disp.Err  Resid.Err  Res.Abs.E  Energy E. (NR)
 Iter       Eta     Unbal. Energy Ratio: Current   Required (LS)
---------------------------------------------------------------------------
    1         1     0.048!    0.0058      0.004    0.00028! (NR)
    2         1   0.00031      0.002     0.0014    6.1e-07  (NR)
---------------------------------------------------------------------------
Step: 21(21) completed. Elapsed CPU (sec) - step this: 0.417,  all: 9.459 
---------------------------------------------------------------------------

---------------------------------------------------------------------------
Job: Step 22(22), Log start: 12/13/2019 3:46:15 PM
---------------------------------------------------------------------------
 Iter       Eta   Disp.Err  Resid.Err  Res.Abs.E  Energy E. (NR)
 Iter       Eta     Unbal. Energy Ratio: Current   Required (LS)
---------------------------------------------------------------------------
    1         1     0.045!    0.0061     0.0042    0.00028! (NR)
    2         1   0.00031     0.0021     0.0014    6.4e-07  (NR)
---------------------------------------------------------------------------
Step: 22(22) completed. Elapsed CPU (sec) - step this: 0.396,  all: 9.855 
---------------------------------------------------------------------------

---------------------------------------------------------------------------
Job: Step 23(23), Log start: 12/13/2019 3:46:16 PM
---------------------------------------------------------------------------
 Iter       Eta   Disp.Err  Resid.Err  Res.Abs.E  Energy E. (NR)
 Iter       Eta     Unbal. Energy Ratio: Current   Required (LS)
---------------------------------------------------------------------------
    1         1     0.043!    0.0063     0.0044    0.00027! (NR)
    2         1   0.00032     0.0021     0.0015    6.8e-07  (NR)
---------------------------------------------------------------------------
Step: 23(23) completed. Elapsed CPU (sec) - step this: 0.4,  all: 10.255 
---------------------------------------------------------------------------

---------------------------------------------------------------------------
Job: Step 24(24), Log start: 12/13/2019 3:46:16 PM
---------------------------------------------------------------------------
 Iter       Eta   Disp.Err  Resid.Err  Res.Abs.E  Energy E. (NR)
 Iter       Eta     Unbal. Energy Ratio: Current   Required (LS)
---------------------------------------------------------------------------
    1         1     0.042!    0.0065     0.0045    0.00027! (NR)
    2         1   0.00032     0.0022     0.0015    7.1e-07  (NR)
---------------------------------------------------------------------------
Step: 24(24) completed. Elapsed CPU (sec) - step this: 0.402,  all: 10.657 
---------------------------------------------------------------------------

---------------------------------------------------------------------------
Job: Step 25(25), Log start: 12/13/2019 3:46:17 PM
---------------------------------------------------------------------------
 Iter       Eta   Disp.Err  Resid.Err  Res.Abs.E  Energy E. (NR)
 Iter       Eta     Unbal. Energy Ratio: Current   Required (LS)
---------------------------------------------------------------------------
    1         1      0.04!    0.0067     0.0047    0.00027! (NR)
    2         1   0.00033     0.0023     0.0016    7.4e-07  (NR)
---------------------------------------------------------------------------
Step: 25(25) completed. Elapsed CPU (sec) - step this: 0.415,  all: 11.072 
---------------------------------------------------------------------------

---------------------------------------------------------------------------
Job: Step 26(26), Log start: 12/13/2019 3:46:17 PM
---------------------------------------------------------------------------
 Iter       Eta   Disp.Err  Resid.Err  Res.Abs.E  Energy E. (NR)
 Iter       Eta     Unbal. Energy Ratio: Current   Required (LS)
---------------------------------------------------------------------------
    1         1     0.038!    0.0069     0.0048    0.00027! (NR)
    2         1   0.00033     0.0023     0.0016    7.7e-07  (NR)
---------------------------------------------------------------------------
Step: 26(26) completed. Elapsed CPU (sec) - step this: 0.409,  all: 11.481 
---------------------------------------------------------------------------

---------------------------------------------------------------------------
Job: Step 27(27), Log start: 12/13/2019 3:46:17 PM
---------------------------------------------------------------------------
 Iter       Eta   Disp.Err  Resid.Err  Res.Abs.E  Energy E. (NR)
 Iter       Eta     Unbal. Energy Ratio: Current   Required (LS)
---------------------------------------------------------------------------
    1         1     0.037!    0.0072      0.005    0.00027! (NR)
    2         1   0.00033     0.0024     0.0017    8.1e-07  (NR)
---------------------------------------------------------------------------
Step: 27(27) completed. Elapsed CPU (sec) - step this: 0.406,  all: 11.887 
---------------------------------------------------------------------------

---------------------------------------------------------------------------
Job: Step 28(28), Log start: 12/13/2019 3:46:18 PM
---------------------------------------------------------------------------
 Iter       Eta   Disp.Err  Resid.Err  Res.Abs.E  Energy E. (NR)
 Iter       Eta     Unbal. Energy Ratio: Current   Required (LS)
---------------------------------------------------------------------------
    1         1     0.036!    0.0074     0.0051    0.00026! (NR)
    2         1   0.00034     0.0025     0.0017    8.4e-07  (NR)
---------------------------------------------------------------------------
Step: 28(28) completed. Elapsed CPU (sec) - step this: 0.406,  all: 12.293 
---------------------------------------------------------------------------

---------------------------------------------------------------------------
Job: Step 29(29), Log start: 12/13/2019 3:46:18 PM
---------------------------------------------------------------------------
 Iter       Eta   Disp.Err  Resid.Err  Res.Abs.E  Energy E. (NR)
 Iter       Eta     Unbal. Energy Ratio: Current   Required (LS)
---------------------------------------------------------------------------
    1         1     0.034!    0.0076     0.0053    0.00026! (NR)
    2         1   0.00034     0.0026     0.0018    8.7e-07  (NR)
---------------------------------------------------------------------------
Step: 29(29) completed. Elapsed CPU (sec) - step this: 0.435,  all: 12.728 
---------------------------------------------------------------------------

---------------------------------------------------------------------------
Job: Step 30(30), Log start: 12/13/2019 3:46:19 PM
---------------------------------------------------------------------------
 Iter       Eta   Disp.Err  Resid.Err  Res.Abs.E  Energy E. (NR)
 Iter       Eta     Unbal. Energy Ratio: Current   Required (LS)
---------------------------------------------------------------------------
    1         1     0.033!    0.0078     0.0054    0.00026! (NR)
    2         1   0.00034     0.0026     0.0018    9.1e-07  (NR)
---------------------------------------------------------------------------
Step: 30(30) completed. Elapsed CPU (sec) - step this: 0.441,  all: 13.169 
---------------------------------------------------------------------------

---------------------------------------------------------------------------
Job: Step 31(31), Log start: 12/13/2019 3:46:19 PM
---------------------------------------------------------------------------
 Iter       Eta   Disp.Err  Resid.Err  Res.Abs.E  Energy E. (NR)
 Iter       Eta     Unbal. Energy Ratio: Current   Required (LS)
---------------------------------------------------------------------------
    1         1     0.032!     0.008     0.0056    0.00026! (NR)
    2         1   0.00035     0.0027     0.0019    9.4e-07  (NR)
---------------------------------------------------------------------------
Step: 31(31) completed. Elapsed CPU (sec) - step this: 0.401,  all: 13.57 
---------------------------------------------------------------------------

---------------------------------------------------------------------------
Job: Step 32(32), Log start: 12/13/2019 3:46:20 PM
---------------------------------------------------------------------------
 Iter       Eta   Disp.Err  Resid.Err  Res.Abs.E  Energy E. (NR)
 Iter       Eta     Unbal. Energy Ratio: Current   Required (LS)
---------------------------------------------------------------------------
    1         1     0.031!    0.0083     0.0058    0.00026! (NR)
    2         1   0.00035     0.0028     0.0019    9.7e-07  (NR)
---------------------------------------------------------------------------
Step: 32(32) completed. Elapsed CPU (sec) - step this: 0.389,  all: 13.959 
---------------------------------------------------------------------------

---------------------------------------------------------------------------
Job: Step 33(33), Log start: 12/13/2019 3:46:20 PM
---------------------------------------------------------------------------
 Iter       Eta   Disp.Err  Resid.Err  Res.Abs.E  Energy E. (NR)
 Iter       Eta     Unbal. Energy Ratio: Current   Required (LS)
---------------------------------------------------------------------------
    1         1      0.03!    0.0085     0.0059    0.00026! (NR)
    2         1   0.00035     0.0028      0.002      1e-06  (NR)
---------------------------------------------------------------------------
Step: 33(33) completed. Elapsed CPU (sec) - step this: 0.416,  all: 14.375 
---------------------------------------------------------------------------

---------------------------------------------------------------------------
Job: Step 34(34), Log start: 12/13/2019 3:46:20 PM
---------------------------------------------------------------------------
 Iter       Eta   Disp.Err  Resid.Err  Res.Abs.E  Energy E. (NR)
 Iter       Eta     Unbal. Energy Ratio: Current   Required (LS)
---------------------------------------------------------------------------
    1         1     0.029!    0.0087     0.0061    0.00026! (NR)
    2         1   0.00035     0.0029      0.002      1e-06  (NR)
---------------------------------------------------------------------------
Step: 34(34) completed. Elapsed CPU (sec) - step this: 0.403,  all: 14.778 
---------------------------------------------------------------------------

---------------------------------------------------------------------------
Job: Step 35(35), Log start: 12/13/2019 3:46:21 PM
---------------------------------------------------------------------------
 Iter       Eta   Disp.Err  Resid.Err  Res.Abs.E  Energy E. (NR)
 Iter       Eta     Unbal. Energy Ratio: Current   Required (LS)
---------------------------------------------------------------------------
    1         1     0.029!    0.0089     0.0062    0.00026! (NR)
    2         1   0.00036      0.003     0.0021    1.1e-06  (NR)
---------------------------------------------------------------------------
Step: 35(35) completed. Elapsed CPU (sec) - step this: 0.405,  all: 15.183 
---------------------------------------------------------------------------

---------------------------------------------------------------------------
Job: Step 36(36), Log start: 12/13/2019 3:46:21 PM
---------------------------------------------------------------------------
 Iter       Eta   Disp.Err  Resid.Err  Res.Abs.E  Energy E. (NR)
 Iter       Eta     Unbal. Energy Ratio: Current   Required (LS)
---------------------------------------------------------------------------
    1         1     0.028!    0.0092     0.0064    0.00025! (NR)
    2         1   0.00036     0.0031     0.0021    1.1e-06  (NR)
---------------------------------------------------------------------------
Step: 36(36) completed. Elapsed CPU (sec) - step this: 0.404,  all: 15.587 
---------------------------------------------------------------------------

---------------------------------------------------------------------------
Job: Step 37(37), Log start: 12/13/2019 3:46:22 PM
---------------------------------------------------------------------------
 Iter       Eta   Disp.Err  Resid.Err  Res.Abs.E  Energy E. (NR)
 Iter       Eta     Unbal. Energy Ratio: Current   Required (LS)
---------------------------------------------------------------------------
    1         1     0.027!    0.0094     0.0065    0.00025! (NR)
    2         1   0.00036     0.0031     0.0022    1.1e-06  (NR)
---------------------------------------------------------------------------
Step: 37(37) completed. Elapsed CPU (sec) - step this: 0.397,  all: 15.984 
---------------------------------------------------------------------------

---------------------------------------------------------------------------
Job: Step 38(38), Log start: 12/13/2019 3:46:22 PM
---------------------------------------------------------------------------
 Iter       Eta   Disp.Err  Resid.Err  Res.Abs.E  Energy E. (NR)
 Iter       Eta     Unbal. Energy Ratio: Current   Required (LS)
---------------------------------------------------------------------------
    1         1     0.026!    0.0096     0.0067    0.00025! (NR)
    2         1   0.00036     0.0032     0.0022    1.2e-06  (NR)
---------------------------------------------------------------------------
Step: 38(38) completed. Elapsed CPU (sec) - step this: 0.426,  all: 16.41 
---------------------------------------------------------------------------

---------------------------------------------------------------------------
Job: Step 39(39), Log start: 12/13/2019 3:46:22 PM
---------------------------------------------------------------------------
 Iter       Eta   Disp.Err  Resid.Err  Res.Abs.E  Energy E. (NR)
 Iter       Eta     Unbal. Energy Ratio: Current   Required (LS)
---------------------------------------------------------------------------
    1         1     0.026!    0.0098     0.0069    0.00025! (NR)
    2         1   0.00036     0.0033     0.0023    1.2e-06  (NR)
---------------------------------------------------------------------------
Step: 39(39) completed. Elapsed CPU (sec) - step this: 0.403,  all: 16.813 
---------------------------------------------------------------------------

---------------------------------------------------------------------------
Job: Step 40(40), Log start: 12/13/2019 3:46:23 PM
---------------------------------------------------------------------------
 Iter       Eta   Disp.Err  Resid.Err  Res.Abs.E  Energy E. (NR)
 Iter       Eta     Unbal. Energy Ratio: Current   Required (LS)
---------------------------------------------------------------------------
    1         1     0.025!      0.01!     0.007    0.00025! (NR)
    2         1   0.00036     0.0034     0.0024    1.2e-06  (NR)
---------------------------------------------------------------------------
Step: 40(40) completed. Elapsed CPU (sec) - step this: 0.4,  all: 17.213 
---------------------------------------------------------------------------

---------------------------------------------------------------------------
Job: Step 41(41), Log start: 12/13/2019 3:46:23 PM
---------------------------------------------------------------------------
 Iter       Eta   Disp.Err  Resid.Err  Res.Abs.E  Energy E. (NR)
 Iter       Eta     Unbal. Energy Ratio: Current   Required (LS)
---------------------------------------------------------------------------
    1         1     0.024!      0.01!    0.0072    0.00025! (NR)
    2         1   0.00036     0.0034     0.0024    1.2e-06  (NR)
---------------------------------------------------------------------------
Step: 41(41) completed. Elapsed CPU (sec) - step this: 0.408,  all: 17.621 
---------------------------------------------------------------------------

---------------------------------------------------------------------------
Job: Step 42(42), Log start: 12/13/2019 3:46:24 PM
---------------------------------------------------------------------------
 Iter       Eta   Disp.Err  Resid.Err  Res.Abs.E  Energy E. (NR)
 Iter       Eta     Unbal. Energy Ratio: Current   Required (LS)
---------------------------------------------------------------------------
    1         1     0.024!     0.011!    0.0074    0.00025! (NR)
    2         1   0.00036     0.0035     0.0025    1.3e-06  (NR)
---------------------------------------------------------------------------
Step: 42(42) completed. Elapsed CPU (sec) - step this: 0.401,  all: 18.022 
---------------------------------------------------------------------------

---------------------------------------------------------------------------
Job: Step 43(43), Log start: 12/13/2019 3:46:24 PM
---------------------------------------------------------------------------
 Iter       Eta   Disp.Err  Resid.Err  Res.Abs.E  Energy E. (NR)
 Iter       Eta     Unbal. Energy Ratio: Current   Required (LS)
---------------------------------------------------------------------------
    1         1     0.023!     0.011!    0.0075    0.00025! (NR)
    2         1   0.00036     0.0036     0.0025    1.3e-06  (NR)
---------------------------------------------------------------------------
Step: 43(43) completed. Elapsed CPU (sec) - step this: 0.393,  all: 18.415 
---------------------------------------------------------------------------

---------------------------------------------------------------------------
Job: Step 44(44), Log start: 12/13/2019 3:46:24 PM
---------------------------------------------------------------------------
 Iter       Eta   Disp.Err  Resid.Err  Res.Abs.E  Energy E. (NR)
 Iter       Eta     Unbal. Energy Ratio: Current   Required (LS)
---------------------------------------------------------------------------
    1         1     0.023!     0.011!    0.0077    0.00025! (NR)
    2         1   0.00036     0.0037     0.0026    1.3e-06  (NR)
---------------------------------------------------------------------------
Step: 44(44) completed. Elapsed CPU (sec) - step this: 0.428,  all: 18.843 
---------------------------------------------------------------------------

---------------------------------------------------------------------------
Job: Step 45(45), Log start: 12/13/2019 3:46:25 PM
---------------------------------------------------------------------------
 Iter       Eta   Disp.Err  Resid.Err  Res.Abs.E  Energy E. (NR)
 Iter       Eta     Unbal. Energy Ratio: Current   Required (LS)
---------------------------------------------------------------------------
    1         1     0.022!     0.011!    0.0079    0.00025! (NR)
    2         1   0.00036     0.0037     0.0026    1.3e-06  (NR)
---------------------------------------------------------------------------
Step: 45(45) completed. Elapsed CPU (sec) - step this: 0.388,  all: 19.231 
---------------------------------------------------------------------------

---------------------------------------------------------------------------
Job: Step 46(46), Log start: 12/13/2019 3:46:25 PM
---------------------------------------------------------------------------
 Iter       Eta   Disp.Err  Resid.Err  Res.Abs.E  Energy E. (NR)
 Iter       Eta     Unbal. Energy Ratio: Current   Required (LS)
---------------------------------------------------------------------------
    1         1     0.022!     0.011!    0.0081    0.00025! (NR)
    2         1   0.00036     0.0038     0.0027    1.4e-06  (NR)
---------------------------------------------------------------------------
Step: 46(46) completed. Elapsed CPU (sec) - step this: 0.381,  all: 19.612 
---------------------------------------------------------------------------

---------------------------------------------------------------------------
Job: Step 47(47), Log start: 12/13/2019 3:46:26 PM
---------------------------------------------------------------------------
 Iter       Eta   Disp.Err  Resid.Err  Res.Abs.E  Energy E. (NR)
 Iter       Eta     Unbal. Energy Ratio: Current   Required (LS)
---------------------------------------------------------------------------
    1         1     0.021!     0.012!    0.0082    0.00025! (NR)
    2         1   0.00036     0.0039     0.0027    1.4e-06  (NR)
---------------------------------------------------------------------------
Step: 47(47) completed. Elapsed CPU (sec) - step this: 0.399,  all: 20.011 
---------------------------------------------------------------------------

---------------------------------------------------------------------------
Job: Step 48(48), Log start: 12/13/2019 3:46:26 PM
---------------------------------------------------------------------------
 Iter       Eta   Disp.Err  Resid.Err  Res.Abs.E  Energy E. (NR)
 Iter       Eta     Unbal. Energy Ratio: Current   Required (LS)
---------------------------------------------------------------------------
    1         1     0.021!     0.012!    0.0084    0.00025! (NR)
    2         1   0.00036      0.004     0.0028    1.4e-06  (NR)
---------------------------------------------------------------------------
Step: 48(48) completed. Elapsed CPU (sec) - step this: 0.402,  all: 20.413 
---------------------------------------------------------------------------

---------------------------------------------------------------------------
Job: Step 49(49), Log start: 12/13/2019 3:46:26 PM
---------------------------------------------------------------------------
 Iter       Eta   Disp.Err  Resid.Err  Res.Abs.E  Energy E. (NR)
 Iter       Eta     Unbal. Energy Ratio: Current   Required (LS)
---------------------------------------------------------------------------
    1         1      0.02!     0.012!    0.0086    0.00025! (NR)
    2         1   0.00036     0.0041     0.0029    1.4e-06  (NR)
---------------------------------------------------------------------------
Step: 49(49) completed. Elapsed CPU (sec) - step this: 0.406,  all: 20.819 
---------------------------------------------------------------------------

---------------------------------------------------------------------------
Job: Step 50(50), Log start: 12/13/2019 3:46:27 PM
---------------------------------------------------------------------------
 Iter       Eta   Disp.Err  Resid.Err  Res.Abs.E  Energy E. (NR)
 Iter       Eta     Unbal. Energy Ratio: Current   Required (LS)
---------------------------------------------------------------------------
    1         1      0.02!     0.012!    0.0088    0.00025! (NR)
    2         1   0.00036     0.0041     0.0029    1.5e-06  (NR)
---------------------------------------------------------------------------
Step: 50(50) completed. Elapsed CPU (sec) - step this: 0.431,  all: 21.25 
---------------------------------------------------------------------------

---------------------------------------------------------------------------
Job: ATENA, Log end: 12/13/2019 3:46:27 PM
---------------------------------------------------------------------------

