nan,nan,1.202037520523622643e-01
7.913976190459640847e+00,4.928770648835764945e+01,1.320161686632801423e-01
8.147937525276079285e+00,4.922517228917620002e+01,1.427388569215840841e-01
7.933334846946865859e+00,4.927253141197047626e+01,1.534753910922029285e-01
7.931926725760039432e+00,4.930503919164014093e+01,1.642071366988628045e-01
8.093020532233662578e+00,4.916714645221274793e+01,1.749581645046080491e-01
8.050333824818627804e+00,4.919850162148952677e+01,1.857211011304092385e-01
7.963025182072142272e+00,4.926461482514364576e+01,1.964883687022253300e-01
8.152404115514162442e+00,4.920744361488160479e+01,2.066296313223284220e-01
7.992500506868119636e+00,4.917660872866193245e+01,2.174256522708573613e-01
8.031286755750674189e+00,4.919294233375921976e+01,2.281670052556310224e-01
