nan,nan,2.028331322564895234e-01
9.314035982751500242e+00,5.313356708059755107e+01,2.143832906787382364e-01
9.006338965505360505e+00,5.337789206102633699e+01,2.265695215604857093e-01
9.484076873966804655e+00,5.317019619155589538e+01,2.404164040010029479e-01
9.203358214880793753e+00,5.312919070095662022e+01,2.519399698803789778e-01
8.954677632509975282e+00,5.351046395386644861e+01,2.627715716758650677e-01
9.150968615885206603e+00,5.319102066654465233e+01,2.738134753939772126e-01
9.141059843429292897e+00,5.337536994921654099e+01,2.846335462231986968e-01
9.377890506995635533e+00,5.329510411392777058e+01,2.959224726582376230e-01
9.419256359003426837e+00,5.319315288492281724e+01,3.067229007497010995e-01
9.231566398279261065e+00,5.307359517258314696e+01,3.180705691766820276e-01
