nan,nan,1.071956247257090933e-01
6.450599507138832678e+00,5.119371562225070704e+01,1.224703915345674438e-01
6.443320807478074563e+00,5.116582882413671740e+01,1.410090542810266134e-01
6.465489078032457648e+00,5.117299779653074410e+01,1.556539777099359978e-01
6.388996090985625820e+00,5.120329042846749701e+01,1.693198300449622051e-01
6.453640329616173510e+00,5.113528810487916587e+01,1.855646514116040535e-01
6.410968663991267746e+00,5.119743311892353432e+01,1.982597865251631564e-01
6.437020744902199887e+00,5.119404503086398961e+01,2.066043874596352192e-01
6.447333805339288126e+00,5.120329632646252094e+01,2.162930575766491281e-01
6.388858863232348639e+00,5.117005963947928393e+01,2.283877776745030785e-01
6.410139480333754136e+00,5.116534388817869683e+01,2.408716884976166428e-01
