50.9241975,11.2939246170675,0.259199978263454
50.9241975,11.3011191337914,0.259199978263454
50.9241975,11.3083136505154,0.259199978263454
50.9241975,11.3155081672393,0.259199978263454
50.9241975,11.3227026839632,0.259199978263454
50.9287820993646,11.2795355836197,0.259199978263454
50.9287820993646,11.2867301003436,0.259199978263454
50.9287820993646,11.2939246170675,0.323378028234673
50.9287820993646,11.3011191337914,0.271168361130268
50.9287820993646,11.3083136505154,0.259199978263454
50.9287820993646,11.3155081672393,0.259199978263454
50.9287820993646,11.3227026839632,0.259199978263454
50.9333666987292,11.2795355836197,0.259199978263454
50.9333666987292,11.2867301003436,0.381917087863131
50.9333666987292,11.2939246170675,0.444656134452084
50.9333666987292,11.3011191337914,0.331973257279187
50.9333666987292,11.3083136505154,0.259199978263454
50.9333666987292,11.3155081672393,0.259199978263454
50.9333666987292,11.3227026839632,0.259199978263454
50.9379512980938,11.2723410668957,0.313009800056498
50.9379512980938,11.2795355836197,0.40315945271542
50.9379512980938,11.2867301003436,0.383836213974692
50.9379512980938,11.2939246170675,0.278499600502343
50.9379512980938,11.3011191337914,0.259199978263454
50.9379512980938,11.3083136505154,0.262203805114342
50.9379512980938,11.3155081672393,0.260902880485468
50.9379512980938,11.3227026839632,0.259199978263454
50.9425358974584,11.2795355836197,0.325831046637273
50.9425358974584,11.2867301003436,0.260477519560245
50.9425358974584,11.2939246170675,0.277031651320582
50.9425358974584,11.3011191337914,0.259199978263454
50.9425358974584,11.3083136505154,0.261227104851335
50.9425358974584,11.3155081672393,0.26013333910245
50.9425358974584,11.3227026839632,0.259199978263454
50.9425358974584,11.3298972006872,0.259199978263454
50.9425358974584,11.344286234135,0.259199978263454
50.9425358974584,11.351480750859,0.259199978263454
50.9425358974584,11.3586752675829,0.371657642307553
50.9425358974584,11.3658697843068,0.267026626155762
50.947120496823,11.2867301003436,0.259199978263454
50.947120496823,11.2939246170675,0.259804468826808
50.947120496823,11.3011191337914,0.236992673512564
50.947120496823,11.3083136505154,0.259199978263454
50.947120496823,11.3155081672393,0.259199978263454
50.947120496823,11.3227026839632,0.259199978263454
50.947120496823,11.3298972006872,0.259199978263454
50.947120496823,11.3370917174111,0.259199978263454
50.947120496823,11.344286234135,0.374213436744226
50.947120496823,11.351480750859,0.379485089031675
50.947120496823,11.3586752675829,0.315414379545802
50.947120496823,11.3658697843068,0.259199978263454
50.947120496823,11.3730643010308,0.259199978263454
50.947120496823,11.3802588177547,0.260343256896113
50.9517050961876,11.2795355836197,0.259199978263454
50.9517050961876,11.2867301003436,0.259199978263454
50.9517050961876,11.2939246170675,0.272179663914292
50.9517050961876,11.3011191337914,0.36395437828884
50.9517050961876,11.3083136505154,0.249060289898592
50.9517050961876,11.3155081672393,0.259199978263454
50.9517050961876,11.3227026839632,0.259199978263454
50.9517050961876,11.3298972006872,0.259199978263454
50.9517050961876,11.3370917174111,0.259199978263454
50.9517050961876,11.344286234135,0.275496644340907
50.9517050961876,11.351480750859,0.282428736471441
50.9517050961876,11.3586752675829,0.259199978263454
50.9517050961876,11.3658697843068,0.259199978263454
50.9517050961876,11.3730643010308,0.259199978263454
50.9517050961876,11.3802588177547,0.223939491726742
50.9517050961876,11.3874533344786,0.237554414057139
50.9562896955522,11.2795355836197,0.226220915565701
50.9562896955522,11.2867301003436,0.26331615078982
50.9562896955522,11.2939246170675,0.259199978263454
50.9562896955522,11.3011191337914,0.265575648844416
50.9562896955522,11.3083136505154,0.259199978263454
50.9562896955522,11.3155081672393,0.275321397883478
50.9562896955522,11.3227026839632,0.261134539859137
50.9562896955522,11.3298972006872,0.260252020131717
50.9562896955522,11.3370917174111,0.352185867458807
50.9562896955522,11.344286234135,0.229313603411223
50.9562896955522,11.351480750859,0.262566212207443
50.9562896955522,11.3586752675829,0.259199978263454
50.9562896955522,11.3658697843068,0.259199978263454
50.9562896955522,11.3730643010308,0.259199978263454
50.9562896955522,11.3802588177547,0.259199978263454
50.9562896955522,11.3874533344786,0.259199978263454
50.9608742949168,11.2795355836197,0.262731931759599
50.9608742949168,11.2867301003436,0.303441377259482
50.9608742949168,11.2939246170675,0.259199978263454
50.9608742949168,11.3011191337914,0.259199978263454
50.9608742949168,11.3083136505154,0.263183856067673
50.9608742949168,11.3155081672393,0.267659506386784
50.9608742949168,11.3227026839632,0.453432807661273
50.9608742949168,11.3298972006872,0.304186668227245
50.9608742949168,11.3370917174111,0.356522307917892
50.9608742949168,11.344286234135,0.362402698808323
50.9608742949168,11.351480750859,0.33998802492905
50.9608742949168,11.3586752675829,0.258744352049034
50.9608742949168,11.3658697843068,0.259199978263454
50.9608742949168,11.3730643010308,0.259199978263454
50.9608742949168,11.3802588177547,0.259199978263454
50.9608742949168,11.3874533344786,0.259199978263454
50.9654588942814,11.2723410668957,0.259199978263454
50.9654588942814,11.2795355836197,0.259199978263454
50.9654588942814,11.2867301003436,0.259199978263454
50.9654588942814,11.2939246170675,0.259199978263454
50.9654588942814,11.3011191337914,0.259199978263454
50.9654588942814,11.3083136505154,0.257150692346465
50.9654588942814,11.3155081672393,0.317772715979702
50.9654588942814,11.3227026839632,0.348709642321053
50.9654588942814,11.3298972006872,0.373865240198791
50.9654588942814,11.3370917174111,0.43594053368107
50.9654588942814,11.344286234135,0.743067683394014
50.9654588942814,11.351480750859,0.410475693381328
50.9654588942814,11.3586752675829,0.388875587260029
50.9654588942814,11.3658697843068,0.303119072836113
50.9654588942814,11.3730643010308,0.259199978263454
50.9654588942814,11.3802588177547,0.259199978263454
50.9654588942814,11.3874533344786,0.259199978263454
50.9700434936461,11.2723410668957,0.259199978263454
50.9700434936461,11.2795355836197,0.259199978263454
50.9700434936461,11.2867301003436,0.294392967330666
50.9700434936461,11.2939246170675,0.259199978263454
50.9700434936461,11.3011191337914,0.259199978263454
50.9700434936461,11.3083136505154,0.261307330948792
50.9700434936461,11.3155081672393,0.411374434575108
50.9700434936461,11.3227026839632,0.372762399993622
50.9700434936461,11.3298972006872,0.387773659956878
50.9700434936461,11.3370917174111,0.382020055647007
50.9700434936461,11.344286234135,0.479144327687798
50.9700434936461,11.351480750859,0.337548689649477
50.9700434936461,11.3586752675829,0.349413998420904
50.9700434936461,11.3658697843068,0.312175275960024
50.9700434936461,11.3730643010308,0.259199978263454
50.9700434936461,11.3802588177547,0.259199978263454
50.9700434936461,11.3874533344786,0.259199978263454
50.9746280930107,11.2723410668957,0.259199978263454
50.9746280930107,11.2795355836197,0.279664503178986
50.9746280930107,11.2867301003436,0.354356874985354
50.9746280930107,11.2939246170675,0.292762115240025
50.9746280930107,11.3011191337914,0.308512936285844
50.9746280930107,11.3083136505154,0.467967885026179
50.9746280930107,11.3155081672393,0.564911312428245
50.9746280930107,11.3227026839632,0.797004114257424
50.9746280930107,11.3298972006872,0.834651478973663
50.9746280930107,11.3370917174111,0.435833043376675
50.9746280930107,11.344286234135,0.43647526711379
50.9746280930107,11.351480750859,0.316322107342976
50.9746280930107,11.3586752675829,0.259199978263454
50.9746280930107,11.3658697843068,0.259199978263454
50.9746280930107,11.3730643010308,0.259199978263454
50.9746280930107,11.3802588177547,0.259199978263454
50.9746280930107,11.3874533344786,0.259199978263454
50.9792126923753,11.2723410668957,0.259199978263454
50.9792126923753,11.2795355836197,0.278284452153801
50.9792126923753,11.2867301003436,0.280819361878686
50.9792126923753,11.2939246170675,0.26504057088869
50.9792126923753,11.3011191337914,0.249946581380019
50.9792126923753,11.3083136505154,0.428072478900588
50.9792126923753,11.3155081672393,0.479474593125411
50.9792126923753,11.3227026839632,0.852289107774787
50.9792126923753,11.3298972006872,0.888755388121235
50.9792126923753,11.3370917174111,0.539194631076053
50.9792126923753,11.344286234135,0.39143813385856
50.9792126923753,11.351480750859,0.232376926675752
50.9792126923753,11.3586752675829,0.255265220426973
50.9792126923753,11.3658697843068,0.259199978263454
50.9792126923753,11.3730643010308,0.259199978263454
50.9792126923753,11.3802588177547,0.280764424684711
50.9792126923753,11.3874533344786,0.274672201179331
50.9837972917399,11.2651465501718,0.259199978263454
50.9837972917399,11.2723410668957,0.272774978201474
50.9837972917399,11.2795355836197,0.354994332823126
50.9837972917399,11.2867301003436,0.288990844408695
50.9837972917399,11.2939246170675,0.245981460564791
50.9837972917399,11.3011191337914,0.310617004283098
50.9837972917399,11.3083136505154,0.315964056687478
50.9837972917399,11.3155081672393,0.467459772639079
50.9837972917399,11.3227026839632,0.731234428712734
50.9837972917399,11.3298972006872,0.86137264765083
50.9837972917399,11.3370917174111,0.448624835410356
50.9837972917399,11.344286234135,0.357888210026253
50.9837972917399,11.351480750859,0.259199978263454
50.9837972917399,11.3586752675829,0.259199978263454
50.9837972917399,11.3658697843068,0.259199978263454
50.9837972917399,11.3730643010308,0.259199978263454
50.9837972917399,11.3802588177547,0.262108393087189
50.9837972917399,11.3874533344786,0.293648790175712
50.9883818911045,11.2651465501718,0.259199978263454
50.9883818911045,11.2723410668957,0.259199978263454
50.9883818911045,11.2795355836197,0.259199978263454
50.9883818911045,11.2867301003436,0.262568152514344
50.9883818911045,11.2939246170675,0.229679399610285
50.9883818911045,11.3011191337914,0.327888032997299
50.9883818911045,11.3083136505154,0.334326704619503
50.9883818911045,11.3155081672393,0.507930800951796
50.9883818911045,11.3227026839632,0.710494054997565
50.9883818911045,11.3298972006872,0.770375833810569
50.9883818911045,11.3370917174111,0.419357730519823
50.9883818911045,11.344286234135,0.298415086058598
50.9883818911045,11.351480750859,0.259199978263454
50.9883818911045,11.3586752675829,0.259199978263454
50.9883818911045,11.3658697843068,0.259270911015089
50.9883818911045,11.3730643010308,0.259199978263454
50.9883818911045,11.3802588177547,0.259199978263454
50.9883818911045,11.3874533344786,0.259238766544676
50.9929664904691,11.2723410668957,0.259199978263454
50.9929664904691,11.2795355836197,0.251557633848811
50.9929664904691,11.2867301003436,0.259199978263454
50.9929664904691,11.2939246170675,0.259199978263454
50.9929664904691,11.3011191337914,0.30714891036894
50.9929664904691,11.3083136505154,0.336761994860021
50.9929664904691,11.3155081672393,0.513232790672826
50.9929664904691,11.3227026839632,0.464739667506403
50.9929664904691,11.3298972006872,0.378763344589644
50.9929664904691,11.3370917174111,0.272168899238517
50.9929664904691,11.344286234135,0.334369603663331
50.9929664904691,11.351480750859,0.259199978263454
50.9929664904691,11.3586752675829,0.331797619455234
50.9929664904691,11.3658697843068,0.463629924735391
50.9929664904691,11.3874533344786,0.259199978263454
50.9975510898337,11.2723410668957,0.260639906097261
50.9975510898337,11.2795355836197,0.247173261499391
50.9975510898337,11.2867301003436,0.259199978263454
50.9975510898337,11.2939246170675,0.259199978263454
50.9975510898337,11.3011191337914,0.254025378951643
50.9975510898337,11.3083136505154,0.288661546533429
50.9975510898337,11.3155081672393,0.38882473952326
50.9975510898337,11.3227026839632,0.260718905673645
50.9975510898337,11.3298972006872,0.25174967394682
50.9975510898337,11.3370917174111,0.216581645129691
50.9975510898337,11.344286234135,0.272117138220841
50.9975510898337,11.351480750859,0.259199978263454
51.0021356891983,11.2723410668957,0.259199978263454
51.0021356891983,11.2795355836197,0.259199978263454
51.0021356891983,11.2867301003436,0.259199978263454
51.0021356891983,11.2939246170675,0.259199978263454
51.0021356891983,11.3011191337914,0.28198645923144
51.0021356891983,11.3083136505154,0.275622103599786
51.0021356891983,11.3155081672393,0.300701092366538
51.0021356891983,11.3227026839632,0.253509430137493
51.0021356891983,11.3298972006872,0.26086843883863
51.0021356891983,11.3370917174111,0.260892088074488
51.0021356891983,11.344286234135,0.259199978263454
51.0021356891983,11.351480750859,0.259199978263454
51.0067202885629,11.2507575167239,0.259199978263454
51.0067202885629,11.2579520334479,0.259199978263454
51.0067202885629,11.2651465501718,0.259199978263454
51.0067202885629,11.2723410668957,0.259199978263454
51.0067202885629,11.2795355836197,0.259199978263454
51.0067202885629,11.2867301003436,0.259199978263454
51.0067202885629,11.2939246170675,0.259199978263454
51.0067202885629,11.3011191337914,0.259199978263454
51.0067202885629,11.3083136505154,0.259199978263454
51.0067202885629,11.3155081672393,0.355626846540609
51.0067202885629,11.3227026839632,0.284280150418574
51.0067202885629,11.3298972006872,0.309085441612223
51.0067202885629,11.3370917174111,0.341845919994106
51.0067202885629,11.344286234135,0.288020970357089
51.0113048879275,11.2507575167239,0.259199978263454
51.0113048879275,11.2579520334479,0.259199978263454
51.0113048879275,11.2651465501718,0.259199978263454
51.0113048879275,11.2723410668957,0.259199978263454
51.0113048879275,11.2795355836197,0.259199978263454
51.0113048879275,11.2867301003436,0.259199978263454
51.0113048879275,11.2939246170675,0.259199978263454
51.0113048879275,11.3011191337914,0.258954629325293
51.0113048879275,11.3083136505154,0.244309753972921
51.0113048879275,11.3155081672393,0.272101087831888
51.0113048879275,11.3227026839632,0.259199978263454
51.0113048879275,11.3298972006872,0.362439671417287
51.0113048879275,11.3370917174111,0.446864017048595
51.0113048879275,11.344286234135,0.301606439340656
51.0113048879275,11.351480750859,0.230951953808317
51.0158894872921,11.2507575167239,0.259199978263454
51.0158894872921,11.2579520334479,0.259199978263454
51.0158894872921,11.2651465501718,0.259199978263454
51.0158894872921,11.2723410668957,0.259199978263454
51.0158894872921,11.2795355836197,0.259199978263454
51.0158894872921,11.2867301003436,0.259199978263454
51.0158894872921,11.2939246170675,0.259199978263454
51.0158894872921,11.3011191337914,0.257885819570814
51.0158894872921,11.3083136505154,0.242372031689857
51.0158894872921,11.3155081672393,0.259199978263454
51.0158894872921,11.3227026839632,0.259199978263454
51.0158894872921,11.3298972006872,0.258127767725335
51.0158894872921,11.3370917174111,0.356933759687361
51.0158894872921,11.344286234135,0.292585302520981
51.0158894872921,11.351480750859,0.215432195897937
51.0158894872921,11.3586752675829,0.250461479396916
51.0158894872921,11.3658697843068,0.259199978263454
51.0204740866567,11.243563,0.259199978263454
51.0204740866567,11.2507575167239,0.280702561511422
51.0204740866567,11.2579520334479,0.259199978263454
51.0204740866567,11.2651465501718,0.259199978263454
51.0204740866567,11.2723410668957,0.259199978263454
51.0204740866567,11.2795355836197,0.259199978263454
51.0204740866567,11.2867301003436,0.259199978263454
51.0204740866567,11.2939246170675,0.323301576452704
51.0204740866567,11.3011191337914,0.311933724350824
51.0204740866567,11.3083136505154,0.264004548073758
51.0204740866567,11.3155081672393,0.259827148582933
51.0204740866567,11.3227026839632,0.259199978263454
51.0204740866567,11.3298972006872,0.259199978263454
51.0204740866567,11.3370917174111,0.259199978263454
51.0204740866567,11.351480750859,0.259199978263454
51.0250586860213,11.243563,0.259199978263454
51.0250586860213,11.2507575167239,0.311319237645324
51.0250586860213,11.2579520334479,0.273271659114478
51.0250586860213,11.2651465501718,0.259199978263454
51.0250586860213,11.2723410668957,0.259199978263454
51.0250586860213,11.2795355836197,0.259199978263454
51.0250586860213,11.2867301003436,0.259199978263454
51.0250586860213,11.2939246170675,0.26984449538969
51.0250586860213,11.3155081672393,0.259199978263454
