nan,nan,4.139264143570277610e-01
8.596728276607347397e+00,4.862587660808745937e+01,4.270116108885376183e-01
8.489827325337651942e+00,4.879454566111640190e+01,4.391890903052702022e-01
8.752012315065824666e+00,4.878724044620693689e+01,4.503401913341019136e-01
8.634848607174406609e+00,4.861298570091624782e+01,4.616683586834743336e-01
8.603419169183363024e+00,4.875473090506430651e+01,4.736766095578937574e-01
8.547712634667508524e+00,4.866555192225334281e+01,4.856608876269343233e-01
8.711547846327231781e+00,4.882339774951949352e+01,4.980874673771173988e-01
8.713821654296262764e+00,4.874809278570351978e+01,5.094721845899145007e-01
8.728212951833933531e+00,4.862682755497606735e+01,5.216151434074369764e-01
8.736391693793409630e+00,4.858064027517641392e+01,5.331038710753975840e-01
