nan,nan,2.588943786433093308e-01
9.213937879272346976e+00,4.996502791059719328e+01,2.705576815866319595e-01
9.324888575025360282e+00,5.000933865511421317e+01,2.841399501133654026e-01
9.045932203047669873e+00,4.988375028811614698e+01,2.958851975785036226e-01
9.255179229626836701e+00,5.002519130478420806e+01,3.089927537333359009e-01
9.098467090655399048e+00,4.990669610752264873e+01,3.234070878720157194e-01
9.030458400968653265e+00,5.005067083012733065e+01,3.366933313527632476e-01
9.106342358804969450e+00,5.010191413709893737e+01,3.516475773625598600e-01
9.040118119159473054e+00,5.003243961505316406e+01,3.628454514920592677e-01
9.040622423020831633e+00,4.993214244905319532e+01,3.748389053351854905e-01
9.140558405397564812e+00,5.002983468923022059e+01,3.881087556027475460e-01
