nan,nan,6.702850375291243001e-02
1.102923890935729645e+01,4.959559425627816154e+01,8.164425140394626634e-02
1.096096127729138736e+01,4.956868005842631675e+01,9.646439335460130216e-02
1.102922695038816769e+01,4.957965815490092609e+01,1.093256811985366950e-01
1.096522574857062615e+01,4.959126010399806717e+01,1.237873057564207041e-01
1.100448916979414093e+01,4.960174249944248714e+01,1.314624849637958115e-01
1.093983749530303662e+01,4.962828055879944600e+01,1.439319869297017440e-01
1.102104385076004611e+01,4.956143324644385473e+01,1.556948422467625270e-01
1.095062552233363817e+01,4.959846914674804452e+01,1.677165282373415112e-01
1.100838225838493756e+01,4.956810915634677173e+01,1.781955020964699488e-01
1.096296165331469474e+01,4.954329229431006354e+01,1.889577719165821679e-01
