nan,nan,1.176602452211255034e-01
9.053140927484962575e+00,5.300461010611005008e+01,1.306882068528350538e-01
9.085241410397115303e+00,5.300275709605828922e+01,1.427273317048738666e-01
9.062172061433379611e+00,5.311585254417280311e+01,1.543183800434346220e-01
9.073150517617794009e+00,5.301802846206796715e+01,1.657597971194379738e-01
9.302376844865685612e+00,5.289166849569047457e+01,1.768165840469527461e-01
9.041860108059470491e+00,5.300861019707174648e+01,1.859319298035436996e-01
9.212643251953444690e+00,5.286874257509955299e+01,1.978696592759867368e-01
9.310271938674198111e+00,5.293456516230977371e+01,2.092641529073654694e-01
9.045814611348815149e+00,5.304997945546220706e+01,2.211480663232952837e-01
8.927192024286979333e+00,5.301009375051889094e+01,2.327449518496330083e-01
