nan,nan,5.999870244461837088e-02
1.125346168146461778e+01,5.013398965823779463e+01,7.257229479545976303e-02
1.106439561327968057e+01,5.006929489743113493e+01,8.530056422863159515e-02
1.121107153757226804e+01,5.017463634293609687e+01,9.809845342121195633e-02
1.111710444292809541e+01,5.010962294560749086e+01,1.093866362052346303e-01
1.123335472405437585e+01,5.008132525624138509e+01,1.215540535619277634e-01
1.096622258484042511e+01,5.016720787870635689e+01,1.332467594833464941e-01
1.117320614882329188e+01,5.014850081850178753e+01,1.451404177018908725e-01
1.098914911059685373e+01,5.008006057093101049e+01,1.571374043000800247e-01
1.104880605600736665e+01,5.007850349166024984e+01,1.687277968538933581e-01
1.116809662439417572e+01,5.016773002766154121e+01,1.806988244966750423e-01
