nan,nan,7.816284140208777653e-02
1.243762865011863639e+01,5.188386799019367857e+01,9.072613369848388232e-02
1.272820009991312418e+01,5.168094490880345404e+01,1.037978418946171599e-01
1.279629668492778194e+01,5.171892919214087669e+01,1.162704247845094963e-01
1.297712104824274171e+01,5.178913648346913590e+01,1.274995741266203297e-01
1.281471744848184713e+01,5.183242649048635542e+01,1.394712869968709190e-01
1.295406872249222019e+01,5.178030000092627461e+01,1.521811652763363221e-01
1.254969635834182284e+01,5.178064910850801539e+01,1.636470898603932800e-01
1.242704682092669266e+01,5.181817528214342161e+01,1.747803566669286213e-01
1.259026220988734224e+01,5.186730364676390792e+01,1.869398648235336136e-01
1.257199499732022474e+01,5.175157391162302645e+01,1.980971573023148358e-01
