nan,nan,1.463476971261022386e-01
1.062097577051488351e+01,4.893027937001127015e+01,1.583332656560025864e-01
1.087821079196412555e+01,4.870609757800002626e+01,1.695155190468815853e-01
1.047810958544735627e+01,4.883463517118903496e+01,1.809543193919821991e-01
1.085757366329196927e+01,4.884488893229011808e+01,1.928332078535198724e-01
1.045136846123872942e+01,4.896743643799250378e+01,2.044871779320179273e-01
1.071941160982546926e+01,4.887164032290219495e+01,2.179732549758313098e-01
1.062629801941090868e+01,4.900570150936064806e+01,2.293383344341310137e-01
1.057422891941457799e+01,4.876972885420972403e+01,2.402952827809317349e-01
1.069730546623104317e+01,4.878603250363380539e+01,2.520483992520524685e-01
1.078493093808432413e+01,4.890054185105347528e+01,2.634373021223264666e-01
