nan,nan,5.255673104007890784e-02
1.209639697676854198e+01,4.957369406282558089e+01,6.403349077979281212e-02
1.215629702302471493e+01,4.980081334563349316e+01,8.083748343179979201e-02
1.221823652509868730e+01,4.962746847111335313e+01,9.291635622901990577e-02
1.191058703013427511e+01,4.971887494386527351e+01,1.040829270338591989e-01
1.215330892791432227e+01,4.971609444238193021e+01,1.164086657796064989e-01
1.186853176372169116e+01,4.980356514648217114e+01,1.278480710046865920e-01
1.214688388888057702e+01,4.958335217186847643e+01,1.400163632273188075e-01
1.231947413905882271e+01,4.973012885582571840e+01,1.521671223965438413e-01
1.183847330699008715e+01,4.982613707892720356e+01,1.639513476921371504e-01
1.179867207615579083e+01,4.980079546688929071e+01,1.752428943886202017e-01
