nan,nan,6.343310725509865300e-02
1.438246939119507140e+01,5.177646982479336657e+01,7.573601380016364848e-02
1.432191501672886780e+01,5.175769702683156481e+01,9.097380599799237411e-02
1.432722630371084982e+01,5.173950425868424219e+01,1.042803388083009680e-01
1.434513299292394706e+01,5.174278696985107473e+01,1.166071572914232357e-01
1.430385794793662591e+01,5.175354422661178688e+01,1.296838792761726422e-01
1.434931735702664568e+01,5.178537611762830295e+01,1.423718983284008033e-01
1.436444443506451663e+01,5.174312136478972945e+01,1.553781400266502355e-01
1.429953082544540699e+01,5.179855099807718943e+01,1.677484307155143461e-01
1.437751240247096973e+01,5.180532385697267728e+01,1.794546783428273562e-01
1.432046065126371737e+01,5.181040476120840310e+01,1.910022183833262888e-01
