nan,nan,1.401071545122195006e-01
1.140243331716486708e+01,4.875036490670977685e+01,1.523256187998311972e-01
1.133822725973938006e+01,4.875354369770518304e+01,1.643954386574116577e-01
1.140004930638899694e+01,4.873139992274240484e+01,1.772187030831189336e-01
1.143035988577436335e+01,4.879983735509129161e+01,1.888809942245709972e-01
1.140525629994533396e+01,4.871124827198200080e+01,2.029495731440073003e-01
1.135504010703785305e+01,4.877465356886809644e+01,2.155436321819619305e-01
1.139267269969272434e+01,4.877471532008647159e+01,2.262812619640826028e-01
1.145731942393172176e+01,4.877325045208588250e+01,2.380369749387642453e-01
1.144188955477021530e+01,4.872618057999084584e+01,2.496647757615382823e-01
1.142185332430712208e+01,4.874465612210514109e+01,2.602801319981807304e-01
