nan,nan,4.298969168343692582e-01
6.659660720728699523e+00,5.188816167172485905e+01,4.428719918903643027e-01
6.887585508301766524e+00,5.175080592951471914e+01,4.538273470266017684e-01
6.918967310865230758e+00,5.188690838250093407e+01,4.670283597838947864e-01
6.953837187859636337e+00,5.205777069137574387e+01,4.786181404644810899e-01
6.834586892156977456e+00,5.203462772288056470e+01,4.915662587082763046e-01
7.082158511755622499e+00,5.218283199501961178e+01,5.029255816365314491e-01
6.811035783978405256e+00,5.193487020570935897e+01,5.166280416797217612e-01
7.015900249340083050e+00,5.205595957291085796e+01,5.276655829733944980e-01
6.917803067153194263e+00,5.208035624618074166e+01,5.391123617837249027e-01
6.978956295030798174e+00,5.196618361475270120e+01,5.503938592831698617e-01
