nan,nan,4.455739098917391172e-02
1.117644835573932482e+01,4.858072354853210584e+01,5.652515216156543676e-02
1.102142683115064870e+01,4.869974033220222509e+01,6.801588946189897344e-02
1.122365579199573382e+01,4.872219222379489878e+01,7.957533318065604377e-02
1.127011497477739077e+01,4.849158663451235896e+01,9.040035252391223630e-02
1.129058332599305992e+01,4.868356727388628258e+01,1.019873541689859386e-01
1.118810718024769102e+01,4.864300703049387664e+01,1.132064022508000312e-01
1.126614379920949460e+01,4.856106215957051120e+01,1.288146041771557615e-01
1.105105347366273527e+01,4.875525832541649152e+01,1.421472084688070459e-01
1.111535599897189464e+01,4.864023517717250655e+01,1.534850116564211997e-01
1.114048681161397525e+01,4.871393187546104997e+01,1.647932616822517793e-01
