nan,nan,8.016308544284987680e-02
9.780546318520880078e+00,5.119888896347607954e+01,9.149607914484238214e-02
9.975841171434382204e+00,5.108915120849834324e+01,1.034612938046751279e-01
9.875385678643889165e+00,5.114563690471396740e+01,1.159570662573436439e-01
9.999660482554387997e+00,5.115039252138237913e+01,1.294598649423601422e-01
9.806347663537335890e+00,5.131488389560085039e+01,1.403040446440401157e-01
9.689592208599350442e+00,5.121093563641823465e+01,1.521334784813396790e-01
9.881337096176219248e+00,5.132177612071973272e+01,1.633995660274639161e-01
1.005744744513363287e+01,5.109967885329699300e+01,1.743948328745389964e-01
9.719447746706364910e+00,5.119691459361309427e+01,1.898325463482594677e-01
9.917594234533320119e+00,5.137568167641166639e+01,2.019867815836040026e-01
