nan,nan,2.085666658366018833e-01
1.315958405400208875e+01,4.902390603211541986e+01,2.198728458446643774e-01
1.307751841397942805e+01,4.904367520556041882e+01,2.316504573996490124e-01
1.304310814898082427e+01,4.909351360647249862e+01,2.427380280966487391e-01
1.317606947027617359e+01,4.898750002326670483e+01,2.538872029035306177e-01
1.323173375657414574e+01,4.892980038965239942e+01,2.648901044475869271e-01
1.306752070091827100e+01,4.902762831422259637e+01,2.760810773333257639e-01
1.296582042186362393e+01,4.906031105589624275e+01,2.877504040897581605e-01
1.320099927665893880e+01,4.894892365778087395e+01,3.001573637070177325e-01
1.326066942088207767e+01,4.903780201269772476e+01,3.117133266730474084e-01
1.314370970684320739e+01,4.894876301483953540e+01,3.229739999658725602e-01
