nan,nan,5.688676862192423855e-02
1.366874596009710352e+01,5.150639720079471573e+01,7.045468900202248030e-02
1.404197630249116457e+01,5.149307575945748994e+01,8.345142332989481659e-02
1.385662160008149080e+01,5.147681131571719959e+01,9.624198742453730915e-02
1.375770382856641838e+01,5.137709379966872802e+01,1.074641064966481013e-01
1.400276901414305186e+01,5.143380646266657408e+01,1.197266820603188064e-01
1.403934966532854212e+01,5.181798944840735288e+01,1.319448628138926716e-01
1.387227128279561406e+01,5.145712372013870350e+01,1.445087340109590390e-01
1.405175869692239310e+01,5.161062181774467206e+01,1.560970423033882504e-01
1.394766758551985575e+01,5.174396350563269209e+01,1.696259834994565674e-01
1.390085275149510124e+01,5.151754769658889899e+01,1.827079647885583580e-01
