nan,nan,2.132393803820420708e-01
9.716409088589371024e+00,4.758082094285283858e+01,2.247173886018195288e-01
9.943554699901902438e+00,4.756295541591893539e+01,2.374628088525087555e-01
9.853024623514443192e+00,4.765735256984397239e+01,2.503022767696148065e-01
9.865668745156646935e+00,4.753989713293101715e+01,2.624893594317886936e-01
9.666298010833253684e+00,4.756267752604934174e+01,2.751333676999538902e-01
9.739913830845134513e+00,4.760700220362790702e+01,2.865198299533648352e-01
9.791785412427335800e+00,4.762090513567516581e+01,2.979273183513523882e-01
9.794606867343436107e+00,4.759934742812826869e+01,3.088364804877197223e-01
9.957436952253337026e+00,4.760113774427263422e+01,3.202303978317101452e-01
9.978372076313199557e+00,4.757327413891731283e+01,3.312378636251047115e-01
