nan,nan,2.716364179276162250e-02
9.547378171933344149e+00,5.176666057680147048e+01,3.920923590930795732e-02
9.641480304297381565e+00,5.192973192654259407e+01,5.079844241946319949e-02
9.520865655963051566e+00,5.196528797196398841e+01,6.330123797357223303e-02
9.392141481931906455e+00,5.165983237503603931e+01,7.517418091973171457e-02
9.564736605173928652e+00,5.182511063120568195e+01,8.658593799866927399e-02
9.433192793367975781e+00,5.169661067595039583e+01,9.804406534123727424e-02
9.499449312002949952e+00,5.185747743536855836e+01,1.133674731774719224e-01
9.392463699584379100e+00,5.175020043161066496e+01,1.275934414223940383e-01
9.514271110452774849e+00,5.179492847919865994e+01,1.386355176153113156e-01
9.572430247910350687e+00,5.189053974120724888e+01,1.504066144875586541e-01
