nan,nan,6.745760730589155096e-02
1.303076459326686809e+01,5.239370656527602677e+01,8.306893669008036385e-02
1.313050795856135089e+01,5.236924203034695324e+01,9.709229768230287494e-02
1.294133239586025574e+01,5.239211973686321500e+01,1.100656936155656740e-01
1.306699932757473981e+01,5.239585412902961536e+01,1.217688288469598451e-01
1.309298449316001012e+01,5.236458448892967965e+01,1.364430275894219224e-01
1.312339969071899226e+01,5.239139548341587016e+01,1.499125207635828017e-01
1.306064495745395959e+01,5.242284999955640501e+01,1.624881951949140868e-01
1.310272247896052633e+01,5.240904754099906881e+01,1.753188059343792626e-01
1.304512188326597055e+01,5.244026998526565109e+01,1.883047708647819785e-01
1.310521398201487386e+01,5.246496334775167725e+01,2.022551268313143302e-01
