nan,nan,2.176489619604072556e-01
8.180716002675007203e+00,4.891758801043805960e+01,2.299006742602885678e-01
8.169749810113621891e+00,4.876651490866758110e+01,2.435878424037204726e-01
8.271088389128117058e+00,4.893321726717707065e+01,2.580785288964276281e-01
8.139904717733747574e+00,4.876792672796001682e+01,2.753592890109644031e-01
8.145839287143836316e+00,4.882034017379388047e+01,2.902642574043434731e-01
8.321475434753757838e+00,4.880384948213725238e+01,3.019973090819016437e-01
8.267595605733628616e+00,4.866128892232085690e+01,3.140139272887569888e-01
8.002401264084053167e+00,4.872748885908740846e+01,3.271558622014870132e-01
8.231247728748806836e+00,4.864512456692551723e+01,3.398516564257104133e-01
8.112322748937167205e+00,4.879743548002162612e+01,3.530964758160601291e-01
