nan,nan,2.319437587465610906e-01
6.197943534199030324e+00,5.132304348997347176e+01,2.473829288764226308e-01
6.448749262454458453e+00,5.138580696445737317e+01,2.606596129638270032e-01
6.322211683013017947e+00,5.129225440273418002e+01,2.728905425183905664e-01
6.537619857086824027e+00,5.126859022915365927e+01,2.836942747699494061e-01
6.182837845041428970e+00,5.124156148392444265e+01,2.985811150216876597e-01
6.237270810721963876e+00,5.123404895347322707e+01,3.112237560196260966e-01
6.154759357519480112e+00,5.123008420797112450e+01,3.240373974570961990e-01
6.432420604782902451e+00,5.130320866288409576e+01,3.369676978679310153e-01
6.478272901107433590e+00,5.132344997238961071e+01,3.503666013453352046e-01
6.300010101129321249e+00,5.134679687631349765e+01,3.631503819995920979e-01
