nan,nan,3.144759563959303450e-01
9.808750552093748354e+00,4.901981650304592364e+01,3.261525749718157674e-01
1.023394860266220441e+01,4.905443924561308933e+01,3.370691356411431028e-01
1.008059744772092081e+01,4.927645116466021591e+01,3.492871244454643365e-01
9.698380868365457985e+00,4.913541481650148768e+01,3.618837039438662639e-01
9.833390972868178537e+00,4.906747490016471147e+01,3.737164545557839501e-01
9.724817719627505852e+00,4.910475737378383343e+01,3.856617337723156069e-01
9.917784956010043729e+00,4.925512334538532855e+01,3.974186969645758238e-01
1.002754163135189458e+01,4.925550722194567044e+01,4.093190307264891747e-01
9.695450366168932632e+00,4.910083854272158277e+01,4.210677308118651596e-01
9.763040015517189474e+00,4.910471008292302031e+01,4.326244169543341234e-01
