nan,nan,3.291571996000050571e-01
7.635983940545290949e+00,4.759304718402386669e+01,3.411375390383905026e-01
7.592762951431409668e+00,4.776660716776020621e+01,3.525750803517200826e-01
7.725868505396369379e+00,4.764418010344405019e+01,3.646587501783295493e-01
7.911062039546425950e+00,4.787467811923664840e+01,3.761022881453801592e-01
7.931746023219734099e+00,4.769296615904134029e+01,3.875143809246809901e-01
7.582907600408613114e+00,4.771897419074218050e+01,4.000592590465197884e-01
7.755579673200115209e+00,4.771421808708456069e+01,4.121814059425761845e-01
7.560934113352413277e+00,4.765481874017741148e+01,4.262396843569836724e-01
7.747971185875230482e+00,4.763918703296990032e+01,4.382116253246921556e-01
7.636852311163652374e+00,4.768580207002172955e+01,4.493112837737786025e-01
