nan,nan,7.360680727449098182e-01
8.289987884223853243e+00,4.896156570181967282e+01,7.495522243219341352e-01
8.609689137967531991e+00,4.923901438797461338e+01,7.616381498549101847e-01
8.493247116986117007e+00,4.915921100815024403e+01,7.735135194731046493e-01
8.843513760799654122e+00,4.907757225002072943e+01,7.884950753835593407e-01
8.692980276694722619e+00,4.915168288504269611e+01,8.006646585740484490e-01
8.574656216050108526e+00,4.903126594934765592e+01,8.137035450573122386e-01
8.526865110371137035e+00,4.905149450074097928e+01,8.284985482270277313e-01
8.305437313444958392e+00,4.897485838147982662e+01,8.420383890245166647e-01
8.333815792876187345e+00,4.887943778606738476e+01,8.556335111472799237e-01
8.485736117340497486e+00,4.925829485031675148e+01,8.691533208438442237e-01
