nan,nan,1.367360599135024612e-01
1.283240266731722201e+01,5.148970789957773775e+01,1.481434991516777377e-01
1.258145469399502581e+01,5.159597960739360190e+01,1.599931518803807962e-01
1.299089247098741140e+01,5.139790130936222567e+01,1.719128757022447274e-01
1.297646559206667938e+01,5.155112936824762926e+01,1.829476081539154753e-01
1.292759379057618929e+01,5.145364703387656391e+01,1.954325446679992806e-01
1.315295684099900875e+01,5.142470685194297886e+01,2.073367410426110446e-01
1.318432468713550421e+01,5.131493617640532534e+01,2.183024362767253257e-01
1.263261537582319249e+01,5.154867692085213804e+01,2.294329035978432685e-01
1.262544130896693062e+01,5.145950446768615194e+01,2.417397363016019762e-01
1.307558862899050922e+01,5.135819612991014083e+01,2.528122586274870742e-01
