nan,nan,5.132362110537881661e-02
7.614907350217372084e+00,4.941584561289354838e+01,6.322917539164726874e-02
7.894177189551935925e+00,4.948472542802309704e+01,7.571357788310333070e-02
7.893767178150447705e+00,4.944016406233668448e+01,8.795990365494665841e-02
7.489623877891133041e+00,4.939986766722310563e+01,1.004562590176869968e-01
7.565453029036540933e+00,4.944180922178654214e+01,1.115471525729945790e-01
7.535792969918569284e+00,4.950256067864125953e+01,1.237341078110294479e-01
7.525765244000758081e+00,4.945574005481939395e+01,1.349771596148027220e-01
7.608600929963740711e+00,4.939358541925648893e+01,1.466971624785782524e-01
7.780168589342975949e+00,4.935045863901546426e+01,1.582155587086057635e-01
7.630999819592542366e+00,4.937240281605713932e+01,1.719347355379720610e-01
