nan,nan,5.695412677380273792e-02
9.153698930103661979e+00,5.148739791943417998e+01,7.094730083283169730e-02
9.030051151360760642e+00,5.173543703002538763e+01,8.343153854073093179e-02
9.119993197928582873e+00,5.165423317246162327e+01,9.618808102057618825e-02
9.162174410689608806e+00,5.157691000638411083e+01,1.081270957276288247e-01
8.987586894496228496e+00,5.182240507902493931e+01,1.212749423675277272e-01
9.373968163228306949e+00,5.166250882676688860e+01,1.374881148350558802e-01
9.259256447723499761e+00,5.162804655518185371e+01,1.493614232064761072e-01
9.057598276590280051e+00,5.167086504035094663e+01,1.626883251627469218e-01
9.035249965274545048e+00,5.153012330757820081e+01,1.740088199684152181e-01
9.404308402040006953e+00,5.182174191266899754e+01,1.867127339865600755e-01
