nan,nan,1.771569001542770416e-01
1.022289373013526159e+01,4.964101777866184051e+01,1.897780955539627445e-01
1.030024297567888247e+01,4.968641959060264668e+01,2.014602439506024412e-01
1.016916366864004750e+01,4.965674623256144571e+01,2.143885366920215696e-01
1.024548349337242925e+01,4.975896131021083590e+01,2.262469432402817171e-01
1.022933528399767944e+01,4.980006594939017361e+01,2.390678725115611136e-01
1.019848009410288192e+01,4.972936339640646963e+01,2.505769418456280095e-01
1.015293624650930759e+01,4.977174336505404284e+01,2.624604367933040527e-01
1.035538802234741595e+01,4.981657526829837224e+01,2.753720271473696912e-01
1.009183848793198734e+01,4.973217276879679360e+01,2.871357107534195374e-01
1.039697674230778723e+01,4.982240905675790543e+01,2.986155703832280017e-01
