nan,nan,2.158847769339466982e-01
9.199313417768280488e+00,4.807907933047531657e+01,2.275298400454521253e-01
9.002950160965331960e+00,4.810989511298029697e+01,2.390075240111127486e-01
9.196124334909638876e+00,4.791353837333721799e+01,2.498098024755806557e-01
9.298135345245242434e+00,4.802493841434277044e+01,2.622514797930869390e-01
9.163464519364424632e+00,4.799151157128643064e+01,2.737227640999600475e-01
9.413997569020974510e+00,4.794673969371170585e+01,2.844788999237856109e-01
9.201090388351744309e+00,4.800486644929419100e+01,2.964706206519214793e-01
9.270915493334225488e+00,4.823802907055057432e+01,3.071900337477835863e-01
9.006187054412823301e+00,4.806912983124387040e+01,3.190599519988931987e-01
8.969203499847491656e+00,4.805314163919591408e+01,3.305111935598724071e-01
