51.7012091,14.3072012039952,0.271412342777265
51.7012091,14.314395704994,0.259199978263454
51.7012091,14.3215902059928,0.259199978263454
51.7012091,14.3287847069916,0.259199978263454
51.7012091,14.3359792079904,0.259199978263454
51.7012091,14.3431737089892,0.259199978263454
51.7012091,14.350368209988,0.242817622651015
51.7012091,14.3575627109868,0.257296556756677
51.7012091,14.3647572119856,0.293642436304002
51.7012091,14.3719517129844,0.259199978263454
51.7058490419651,14.3072012039952,0.366199541268873
51.7058490419651,14.314395704994,0.273905317911717
51.7058490419651,14.3215902059928,0.259199978263454
51.7058490419651,14.3287847069916,0.259199978263454
51.7058490419651,14.3359792079904,0.259199978263454
51.7058490419651,14.3431737089892,0.259199978263454
51.7058490419651,14.350368209988,0.258758425193108
51.7058490419651,14.3575627109868,0.258189048995987
51.7058490419651,14.3647572119856,0.291980361303639
51.7058490419651,14.3719517129844,0.307230149035926
51.7058490419651,14.4007297169796,0.259199978263454
51.7058490419651,14.4079242179784,0.259199978263454
51.7058490419651,14.4151187189772,0.259199978263454
51.7058490419651,14.422313219976,0.259199978263454
51.7058490419651,14.4295077209748,0.259199978263454
51.7058490419651,14.4367022219736,0.259199978263454
51.7058490419651,14.4438967229724,0.259199978263454
51.7104889839303,14.314395704994,0.272015287451486
51.7104889839303,14.3215902059928,0.243467190587456
51.7104889839303,14.3287847069916,0.369434754566353
51.7104889839303,14.3359792079904,0.301445521476312
51.7104889839303,14.3431737089892,0.259199978263454
51.7104889839303,14.350368209988,0.256274193778173
51.7104889839303,14.3575627109868,0.281438234962424
51.7104889839303,14.3647572119856,0.256518154312701
51.7104889839303,14.3719517129844,0.272291779941589
51.7104889839303,14.3791462139832,0.259199978263454
51.7104889839303,14.3935352159808,0.259199978263454
51.7104889839303,14.4007297169796,0.259199978263454
51.7104889839303,14.4079242179784,0.259199978263454
51.7104889839303,14.4151187189772,0.259199978263454
51.7104889839303,14.422313219976,0.259199978263454
51.7104889839303,14.4295077209748,0.259199978263454
51.7104889839303,14.4367022219736,0.259199978263454
51.7104889839303,14.4438967229724,0.259199978263454
51.7151289258954,14.314395704994,0.401200743364958
51.7151289258954,14.3215902059928,0.385925031186172
51.7151289258954,14.3287847069916,0.394208307349739
51.7151289258954,14.3359792079904,0.28014898567038
51.7151289258954,14.3431737089892,0.263479322001504
51.7151289258954,14.350368209988,0.239445357987712
51.7151289258954,14.3575627109868,0.257328965928072
51.7151289258954,14.3647572119856,0.259199978263454
51.7151289258954,14.3719517129844,0.259199978263454
51.7151289258954,14.3791462139832,0.259199978263454
51.7151289258954,14.386340714982,0.259199978263454
51.7151289258954,14.3935352159808,0.259199978263454
51.7151289258954,14.4007297169796,0.259199978263454
51.7151289258954,14.4079242179784,0.259199978263454
51.7151289258954,14.4151187189772,0.278825504239831
51.7151289258954,14.422313219976,0.260826349400043
51.7151289258954,14.4295077209748,0.259199978263454
51.7151289258954,14.4367022219736,0.259199978263454
51.7151289258954,14.4438967229724,0.259199978263454
51.7197688678606,14.314395704994,0.435626694979786
51.7197688678606,14.3215902059928,0.416032380870492
51.7197688678606,14.3287847069916,0.322368016738767
51.7197688678606,14.3359792079904,0.233407611400535
51.7197688678606,14.3431737089892,0.198097728573971
51.7197688678606,14.350368209988,0.286093109151451
51.7197688678606,14.3575627109868,0.266943135093158
51.7197688678606,14.3647572119856,0.268809998822484
51.7197688678606,14.3719517129844,0.29331016735212
51.7197688678606,14.3791462139832,0.262863385205275
51.7197688678606,14.386340714982,0.286490379956351
51.7197688678606,14.3935352159808,0.254544102199265
51.7197688678606,14.4007297169796,0.259080761452663
51.7197688678606,14.4079242179784,0.295019575323099
51.7197688678606,14.4151187189772,0.327862961375681
51.7197688678606,14.422313219976,0.264868782665847
51.7197688678606,14.4295077209748,0.259199978263454
51.7197688678606,14.4367022219736,0.259199978263454
51.7197688678606,14.4438967229724,0.259199978263454
51.7244088098257,14.3072012039952,0.259199978263454
51.7244088098257,14.314395704994,0.336831011180977
51.7244088098257,14.3215902059928,0.416614859993045
51.7244088098257,14.3287847069916,0.3926862020627
51.7244088098257,14.3359792079904,0.248462907408219
51.7244088098257,14.3431737089892,0.62315374866939
51.7244088098257,14.350368209988,0.406704297305144
51.7244088098257,14.3575627109868,0.290712260400097
51.7244088098257,14.3647572119856,0.280380154240167
51.7244088098257,14.3719517129844,0.260088618787041
51.7244088098257,14.3791462139832,0.259199978263454
51.7244088098257,14.386340714982,0.271353179493717
51.7244088098257,14.3935352159808,0.240253186291361
51.7244088098257,14.4007297169796,0.247809878247243
51.7244088098257,14.4079242179784,0.249712610150696
51.7244088098257,14.4151187189772,0.290310339372151
51.7244088098257,14.422313219976,0.259199978263454
51.7244088098257,14.4295077209748,0.259199978263454
51.7244088098257,14.4367022219736,0.259199978263454
51.7244088098257,14.4438967229724,0.259199978263454
51.7290487517908,14.2928122019976,0.259199978263454
51.7290487517908,14.3000067029964,0.327662982253504
51.7290487517908,14.3072012039952,0.259199978263454
51.7290487517908,14.314395704994,0.316214370804973
51.7290487517908,14.3215902059928,0.441334461760329
51.7290487517908,14.3287847069916,0.509596435760757
51.7290487517908,14.3359792079904,0.361891714172978
51.7290487517908,14.3431737089892,0.352766242419135
51.7290487517908,14.350368209988,0.300821588154946
51.7290487517908,14.3575627109868,0.285348246787097
51.7290487517908,14.3647572119856,0.326809524193566
51.7290487517908,14.3719517129844,0.260213788139016
51.7290487517908,14.3791462139832,0.259199978263454
51.7290487517908,14.386340714982,0.259199978263454
51.7290487517908,14.3935352159808,0.259199978263454
51.7290487517908,14.4007297169796,0.259199978263454
51.7290487517908,14.4079242179784,0.259199978263454
51.7290487517908,14.4151187189772,0.259199978263454
51.7290487517908,14.422313219976,0.259199978263454
51.7290487517908,14.4295077209748,0.259199978263454
51.733688693756,14.2928122019976,0.259199978263454
51.733688693756,14.3000067029964,0.314081122441132
51.733688693756,14.3072012039952,0.259199978263454
51.733688693756,14.314395704994,0.311650856675635
51.733688693756,14.3215902059928,0.246653010568611
51.733688693756,14.3287847069916,0.363265584290738
51.733688693756,14.3359792079904,0.34158011475333
51.733688693756,14.3431737089892,0.316030780620439
51.733688693756,14.350368209988,0.305403555978429
51.733688693756,14.3575627109868,0.243246771884683
51.733688693756,14.3647572119856,0.283087777226662
51.733688693756,14.3719517129844,0.335535081062495
51.733688693756,14.3791462139832,0.253241388152951
51.733688693756,14.386340714982,0.259199978263454
51.733688693756,14.3935352159808,0.259199978263454
51.733688693756,14.4007297169796,0.259199978263454
51.733688693756,14.4079242179784,0.259199978263454
51.7383286357211,14.2784232,0.259199978263454
51.7383286357211,14.2856177009988,0.26599032314137
51.7383286357211,14.2928122019976,0.375069967453692
51.7383286357211,14.3000067029964,0.259199978263454
51.7383286357211,14.3072012039952,0.255014346486535
51.7383286357211,14.314395704994,0.267347081500452
51.7383286357211,14.3215902059928,0.525238737014827
51.7383286357211,14.3287847069916,0.439414758099059
51.7383286357211,14.3359792079904,0.354599887172269
51.7383286357211,14.3431737089892,0.363611968128567
51.7383286357211,14.350368209988,0.278981382542983
51.7383286357211,14.3575627109868,0.256751856596378
51.7383286357211,14.3647572119856,0.425835726920832
51.7383286357211,14.3719517129844,0.306904303788154
51.7383286357211,14.3791462139832,0.281163897118554
51.7383286357211,14.386340714982,0.259199978263454
51.7383286357211,14.3935352159808,0.259199978263454
51.7383286357211,14.4007297169796,0.259199978263454
51.7383286357211,14.4079242179784,0.259199978263454
51.7429685776862,14.2784232,0.342986615732315
51.7429685776862,14.2856177009988,0.331449468854819
51.7429685776862,14.2928122019976,0.347275278302752
51.7429685776862,14.3000067029964,0.29869791800947
51.7429685776862,14.3072012039952,0.355168390382907
51.7429685776862,14.314395704994,0.31896273491216
51.7429685776862,14.3215902059928,0.455350220972135
51.7429685776862,14.3287847069916,0.450405787368851
51.7429685776862,14.3359792079904,0.479946885805044
51.7429685776862,14.3431737089892,0.453556672359141
51.7429685776862,14.350368209988,0.376561944672593
51.7429685776862,14.3575627109868,0.337815970187721
51.7429685776862,14.3647572119856,0.421793300198237
51.7429685776862,14.3719517129844,0.309730098972802
51.7429685776862,14.3791462139832,0.268293293476886
51.7429685776862,14.386340714982,0.259199978263454
51.7429685776862,14.3935352159808,0.259199978263454
51.7476085196514,14.2784232,0.339635049479664
51.7476085196514,14.2856177009988,0.332169009428072
51.7476085196514,14.2928122019976,0.304265549898683
51.7476085196514,14.3000067029964,0.38115906124393
51.7476085196514,14.3072012039952,0.421977129744054
51.7476085196514,14.314395704994,0.297074724258672
51.7476085196514,14.3215902059928,0.433987919906411
51.7476085196514,14.3287847069916,0.496263033881516
51.7476085196514,14.3359792079904,0.422992232260895
51.7476085196514,14.3431737089892,0.530871364741161
51.7476085196514,14.350368209988,0.480948752082085
51.7476085196514,14.3575627109868,0.313963585444046
51.7476085196514,14.3647572119856,0.364551625620691
51.7476085196514,14.3719517129844,0.259199978263454
51.7476085196514,14.3791462139832,0.259199978263454
51.7476085196514,14.386340714982,0.259199978263454
51.7476085196514,14.3935352159808,0.259199978263454
51.7522484616165,14.2856177009988,0.265410064909095
51.7522484616165,14.2928122019976,0.278522411930959
51.7522484616165,14.3000067029964,0.352984100687529
51.7522484616165,14.3072012039952,0.41053978997876
51.7522484616165,14.314395704994,0.272513281395708
51.7522484616165,14.3215902059928,0.546772556708904
51.7522484616165,14.3287847069916,0.513914202641985
51.7522484616165,14.3359792079904,0.735703460384306
51.7522484616165,14.3431737089892,0.618196652482264
51.7522484616165,14.350368209988,0.421177013316933
51.7522484616165,14.3575627109868,0.290753064195813
51.7522484616165,14.3647572119856,0.295878866467727
51.7522484616165,14.3719517129844,0.272534032443796
51.7522484616165,14.3791462139832,0.259199978263454
51.7522484616165,14.386340714982,0.259199978263454
51.7522484616165,14.4367022219736,0.259199978263454
51.7522484616165,14.4438967229724,0.259199978263454
51.7568884035817,14.2856177009988,0.304923855702937
51.7568884035817,14.2928122019976,0.333497913499454
51.7568884035817,14.3000067029964,0.433904690204182
51.7568884035817,14.3072012039952,0.324654495405405
51.7568884035817,14.314395704994,0.503585421674718
51.7568884035817,14.3215902059928,0.78272659393662
51.7568884035817,14.3287847069916,0.74884413410792
51.7568884035817,14.3359792079904,0.64711308176285
51.7568884035817,14.3431737089892,0.49590881452393
51.7568884035817,14.350368209988,0.478763313931844
51.7568884035817,14.3575627109868,0.315323003348255
51.7568884035817,14.3647572119856,0.259199978263454
51.7568884035817,14.3719517129844,0.259199978263454
51.7568884035817,14.3791462139832,0.259199978263454
51.7568884035817,14.386340714982,0.259199978263454
51.7568884035817,14.3935352159808,0.259199978263454
51.7568884035817,14.4007297169796,0.259199978263454
51.7568884035817,14.4079242179784,0.259199978263454
51.7568884035817,14.4151187189772,0.259199978263454
51.7568884035817,14.422313219976,0.259199978263454
51.7568884035817,14.4295077209748,0.259199978263454
51.7568884035817,14.4367022219736,0.259199978263454
51.7568884035817,14.4438967229724,0.259199978263454
51.7615283455468,14.2856177009988,0.259199978263454
51.7615283455468,14.2928122019976,0.35396283964921
51.7615283455468,14.3000067029964,0.420462026824569
51.7615283455468,14.3072012039952,0.400074478717131
51.7615283455468,14.314395704994,0.442132235924938
51.7615283455468,14.3215902059928,0.464225842296953
51.7615283455468,14.3287847069916,0.661476971682049
51.7615283455468,14.3359792079904,0.759171665880781
51.7615283455468,14.3431737089892,0.476072020886618
51.7615283455468,14.350368209988,0.47225601714679
51.7615283455468,14.3575627109868,0.38828085482396
51.7615283455468,14.3647572119856,0.284267465255044
51.7615283455468,14.3719517129844,0.276459264645249
51.7615283455468,14.3791462139832,0.278626585832657
51.7615283455468,14.386340714982,0.267569883286213
51.7615283455468,14.3935352159808,0.332731616310273
51.7615283455468,14.4007297169796,0.254312474136321
51.7615283455468,14.4079242179784,0.259199978263454
51.7615283455468,14.4151187189772,0.259199978263454
51.7615283455468,14.422313219976,0.259199978263454
51.7615283455468,14.4295077209748,0.259199978263454
51.7615283455468,14.4367022219736,0.259199978263454
51.7615283455468,14.4438967229724,0.259199978263454
51.7661682875119,14.2784232,0.259199978263454
51.7661682875119,14.2856177009988,0.259199978263454
51.7661682875119,14.2928122019976,0.340789977962327
51.7661682875119,14.3000067029964,0.291018291189653
51.7661682875119,14.3072012039952,0.31019694219931
51.7661682875119,14.314395704994,0.303073008461532
51.7661682875119,14.3215902059928,0.523229583416466
51.7661682875119,14.3287847069916,0.60452963078245
51.7661682875119,14.3359792079904,0.583332950719919
51.7661682875119,14.3431737089892,0.375701048579339
51.7661682875119,14.350368209988,0.409161610490852
51.7661682875119,14.3575627109868,0.393974423789938
51.7661682875119,14.3647572119856,0.255605899426993
51.7661682875119,14.3719517129844,0.230254878396491
51.7661682875119,14.3791462139832,0.255964270653518
51.7661682875119,14.386340714982,0.300707101046608
51.7661682875119,14.3935352159808,0.340715224259179
51.7661682875119,14.4007297169796,0.254956520867121
51.7661682875119,14.4079242179784,0.259199978263454
51.7661682875119,14.4151187189772,0.259199978263454
51.7661682875119,14.422313219976,0.259199978263454
51.7661682875119,14.4295077209748,0.259199978263454
51.7661682875119,14.4367022219736,0.259199978263454
51.7661682875119,14.4438967229724,0.259199978263454
51.7708082294771,14.2928122019976,0.259199978263454
51.7708082294771,14.3000067029964,0.259199978263454
51.7708082294771,14.3072012039952,0.264951808099258
51.7708082294771,14.314395704994,0.328810623107296
51.7708082294771,14.3215902059928,0.354965540188191
51.7708082294771,14.3287847069916,0.393189589034702
51.7708082294771,14.3359792079904,0.591698269003875
51.7708082294771,14.3431737089892,0.427531701136529
51.7708082294771,14.350368209988,0.356890387818232
51.7708082294771,14.3575627109868,0.408465901332891
51.7708082294771,14.3647572119856,0.246312856594604
51.7708082294771,14.3719517129844,0.281305592411862
51.7708082294771,14.3791462139832,0.274972711840008
51.7708082294771,14.386340714982,0.270003959534069
51.7708082294771,14.3935352159808,0.259199978263454
51.7708082294771,14.4007297169796,0.259199978263454
51.7708082294771,14.4079242179784,0.259199978263454
51.7708082294771,14.4151187189772,0.259199978263454
51.7708082294771,14.422313219976,0.259199978263454
51.7708082294771,14.4295077209748,0.259199978263454
51.7708082294771,14.4367022219736,0.259199978263454
51.7708082294771,14.4438967229724,0.259199978263454
51.7754481714422,14.2856177009988,0.259199978263454
51.7754481714422,14.2928122019976,0.310985709944247
51.7754481714422,14.3000067029964,0.273308548655827
51.7754481714422,14.3072012039952,0.320978701294337
51.7754481714422,14.314395704994,0.420162551671242
51.7754481714422,14.3215902059928,0.330988633231305
51.7754481714422,14.3287847069916,0.246479493982007
51.7754481714422,14.3359792079904,0.273510280056279
51.7754481714422,14.3431737089892,0.400881740763296
51.7754481714422,14.350368209988,0.367601730711166
51.7754481714422,14.3575627109868,0.328727608181176
51.7754481714422,14.3647572119856,0.224531472414084
51.7754481714422,14.3719517129844,0.33921252732868
51.7754481714422,14.3791462139832,0.409742969792015
51.7754481714422,14.386340714982,0.317702934378559
51.7754481714422,14.3935352159808,0.259199978263454
51.7754481714422,14.4007297169796,0.259199978263454
51.7754481714422,14.4079242179784,0.259199978263454
51.7754481714422,14.4151187189772,0.259199978263454
51.7754481714422,14.422313219976,0.259199978263454
51.7754481714422,14.4295077209748,0.259199978263454
51.7754481714422,14.4367022219736,0.259199978263454
51.7754481714422,14.4438967229724,0.259199978263454
51.7800881134073,14.2856177009988,0.259199978263454
51.7800881134073,14.2928122019976,0.284666225293417
51.7800881134073,14.3000067029964,0.258707656897014
51.7800881134073,14.3072012039952,0.297115187373028
51.7800881134073,14.314395704994,0.329379071290866
51.7800881134073,14.3215902059928,0.309289202267854
51.7800881134073,14.3287847069916,0.241028622518464
51.7800881134073,14.3359792079904,0.255812211742362
51.7800881134073,14.3431737089892,0.303783022424681
51.7800881134073,14.350368209988,0.374403561287888
51.7800881134073,14.3575627109868,0.290047868058038
51.7800881134073,14.3647572119856,0.259199978263454
51.7800881134073,14.3719517129844,0.2807488832238
51.7800881134073,14.3791462139832,0.404922852125678
51.7800881134073,14.386340714982,0.29976214606177
51.7800881134073,14.3935352159808,0.267077830939926
51.7800881134073,14.4007297169796,0.259199978263454
51.7800881134073,14.4079242179784,0.259199978263454
51.7800881134073,14.4151187189772,0.259199978263454
51.7800881134073,14.422313219976,0.259199978263454
51.7800881134073,14.4295077209748,0.259199978263454
51.7800881134073,14.4367022219736,0.259199978263454
51.7800881134073,14.4438967229724,0.259199978263454
51.7847280553725,14.2856177009988,0.259199978263454
51.7847280553725,14.2928122019976,0.250826609417841
51.7847280553725,14.3000067029964,0.272571650606718
51.7847280553725,14.3072012039952,0.259199978263454
51.7847280553725,14.314395704994,0.311272601604052
51.7847280553725,14.3215902059928,0.320154258323207
51.7847280553725,14.3287847069916,0.37697611406379
51.7847280553725,14.3359792079904,0.232897130398726
51.7847280553725,14.3431737089892,0.4003308705255
51.7847280553725,14.350368209988,0.454106770090025
51.7847280553725,14.3575627109868,0.284202935890603
51.7847280553725,14.3647572119856,0.259199978263454
51.7847280553725,14.3719517129844,0.259199978263454
51.7847280553725,14.3791462139832,0.303790481638003
51.7847280553725,14.386340714982,0.264833889204289
51.7847280553725,14.3935352159808,0.259199978263454
51.7847280553725,14.4007297169796,0.259199978263454
51.7847280553725,14.4079242179784,0.259199978263454
51.7847280553725,14.4151187189772,0.259199978263454
51.7847280553725,14.422313219976,0.259199978263454
51.7847280553725,14.4295077209748,0.259199978263454
51.7847280553725,14.4367022219736,0.259199978263454
51.7847280553725,14.4438967229724,0.259199978263454
51.7893679973376,14.2784232,0.259199978263454
51.7893679973376,14.2856177009988,0.259199978263454
51.7893679973376,14.2928122019976,0.244014601897867
51.7893679973376,14.3000067029964,0.307259770857401
51.7893679973376,14.3072012039952,0.28371962282264
51.7893679973376,14.314395704994,0.259199978263454
51.7893679973376,14.3215902059928,0.259199978263454
51.7893679973376,14.3287847069916,0.34304242931473
51.7893679973376,14.3359792079904,0.264745236358012
51.7893679973376,14.3431737089892,0.316691586098695
51.7893679973376,14.350368209988,0.396086994492067
51.7893679973376,14.3575627109868,0.245047421632459
51.7893679973376,14.3647572119856,0.259199978263454
51.7893679973376,14.3719517129844,0.259199978263454
51.7893679973376,14.3791462139832,0.259199978263454
51.7893679973376,14.386340714982,0.259199978263454
51.7893679973376,14.3935352159808,0.259199978263454
51.7893679973376,14.4007297169796,0.259199978263454
51.7893679973376,14.4079242179784,0.259199978263454
51.7893679973376,14.4151187189772,0.259199978263454
51.7893679973376,14.422313219976,0.259199978263454
51.7893679973376,14.4295077209748,0.259199978263454
51.7893679973376,14.4367022219736,0.259199978263454
51.7893679973376,14.4438967229724,0.259199978263454
51.7940079393028,14.2784232,0.259199978263454
51.7940079393028,14.2856177009988,0.259199978263454
51.7940079393028,14.2928122019976,0.259199978263454
51.7940079393028,14.3000067029964,0.270185153551591
51.7940079393028,14.3072012039952,0.286231324229247
51.7940079393028,14.314395704994,0.259199978263454
51.7940079393028,14.3215902059928,0.259199978263454
51.7940079393028,14.3287847069916,0.298515367156738
51.7940079393028,14.3359792079904,0.259199978263454
51.7940079393028,14.3431737089892,0.259199978263454
51.7940079393028,14.350368209988,0.317960057486596
51.7940079393028,14.3575627109868,0.372610541565677
51.7940079393028,14.3647572119856,0.259199978263454
51.7940079393028,14.3719517129844,0.259199978263454
51.7940079393028,14.3791462139832,0.259199978263454
51.7940079393028,14.386340714982,0.259199978263454
51.7940079393028,14.3935352159808,0.259199978263454
51.7940079393028,14.4007297169796,0.259199978263454
51.7940079393028,14.4079242179784,0.259199978263454
51.7940079393028,14.4151187189772,0.259199978263454
51.7940079393028,14.422313219976,0.259199978263454
51.7940079393028,14.4295077209748,0.259199978263454
51.7940079393028,14.4367022219736,0.259199978263454
51.7940079393028,14.4438967229724,0.259199978263454
51.7986478812679,14.2784232,0.259199978263454
51.7986478812679,14.2856177009988,0.259199978263454
51.7986478812679,14.2928122019976,0.290406000349855
51.7986478812679,14.3000067029964,0.373427105726588
51.7986478812679,14.3072012039952,0.315557161037867
51.7986478812679,14.314395704994,0.283286980057086
51.7986478812679,14.3215902059928,0.259199978263454
51.7986478812679,14.3287847069916,0.259199978263454
51.7986478812679,14.3359792079904,0.259199978263454
51.7986478812679,14.3431737089892,0.259199978263454
51.7986478812679,14.350368209988,0.345062392608009
51.7986478812679,14.3575627109868,0.309246570945316
51.7986478812679,14.3647572119856,0.259199978263454
51.7986478812679,14.3719517129844,0.301793809230319
51.7986478812679,14.3791462139832,0.270006694661395
51.7986478812679,14.386340714982,0.259199978263454
51.7986478812679,14.3935352159808,0.259199978263454
51.7986478812679,14.4007297169796,0.259199978263454
51.7986478812679,14.4079242179784,0.259199978263454
51.7986478812679,14.4151187189772,0.259199978263454
51.7986478812679,14.422313219976,0.259199978263454
51.7986478812679,14.4295077209748,0.259199978263454
51.7986478812679,14.4367022219736,0.259199978263454
51.7986478812679,14.4438967229724,0.259199978263454
51.803287823233,14.2784232,0.259199978263454
51.803287823233,14.2856177009988,0.259199978263454
51.803287823233,14.2928122019976,0.294912266509321
51.803287823233,14.3000067029964,0.269899657605728
51.803287823233,14.3072012039952,0.340159408560148
51.803287823233,14.314395704994,0.29734087804453
51.803287823233,14.3215902059928,0.259199978263454
51.803287823233,14.3287847069916,0.259199978263454
51.803287823233,14.3359792079904,0.283533990987472
51.803287823233,14.3431737089892,0.259199978263454
51.803287823233,14.350368209988,0.278471527159236
51.803287823233,14.3575627109868,0.365814331269428
51.803287823233,14.3647572119856,0.259199978263454
51.803287823233,14.3719517129844,0.32113100710083
51.803287823233,14.3791462139832,0.33995225957005
51.803287823233,14.386340714982,0.259199978263454
51.803287823233,14.3935352159808,0.259199978263454
51.803287823233,14.4007297169796,0.259199978263454
51.803287823233,14.4295077209748,0.259199978263454
51.803287823233,14.4367022219736,0.259199978263454
51.803287823233,14.4438967229724,0.259199978263454
51.8079277651982,14.3000067029964,0.259199978263454
51.8079277651982,14.3072012039952,0.259199978263454
51.8079277651982,14.314395704994,0.259199978263454
51.8079277651982,14.3215902059928,0.327502997837513
51.8079277651982,14.3287847069916,0.280811621687809
51.8079277651982,14.3359792079904,0.357499113466692
51.8079277651982,14.3431737089892,0.259199978263454
51.8079277651982,14.350368209988,0.259199978263454
51.8079277651982,14.3575627109868,0.267321390741809
51.8079277651982,14.3647572119856,0.259199978263454
51.8079277651982,14.3719517129844,0.259199978263454
51.8079277651982,14.3791462139832,0.298695082670615
51.8079277651982,14.386340714982,0.259199978263454
51.8079277651982,14.3935352159808,0.259199978263454
51.8079277651982,14.4367022219736,0.259199978263454
51.8079277651982,14.4438967229724,0.259199978263454
51.8125677071633,14.3072012039952,0.259199978263454
51.8125677071633,14.314395704994,0.259199978263454
51.8125677071633,14.3215902059928,0.300314279156255
51.8125677071633,14.3287847069916,0.342836198726318
51.8125677071633,14.3359792079904,0.317117883621334
51.8125677071633,14.3431737089892,0.238381338195846
51.8125677071633,14.350368209988,0.259199978263454
51.8125677071633,14.3575627109868,0.259199978263454
51.8125677071633,14.3647572119856,0.259199978263454
51.8125677071633,14.3719517129844,0.259199978263454
51.8125677071633,14.3791462139832,0.259199978263454
51.8125677071633,14.386340714982,0.287670152534036
51.8125677071633,14.3935352159808,0.264006159028037
51.8125677071633,14.4438967229724,0.259199978263454
51.8172076491284,14.3072012039952,0.259199978263454
51.8172076491284,14.314395704994,0.259199978263454
51.8172076491284,14.3215902059928,0.363086138212122
51.8172076491284,14.3287847069916,0.313366826476353
51.8172076491284,14.3359792079904,0.249708060913024
51.8172076491284,14.3431737089892,0.189203236647591
51.8172076491284,14.350368209988,0.253034097255197
51.8172076491284,14.3575627109868,0.259199978263454
51.8172076491284,14.3647572119856,0.259199978263454
51.8172076491284,14.3719517129844,0.259199978263454
51.8172076491284,14.3791462139832,0.259199978263454
51.8172076491284,14.386340714982,0.275009753698709
51.8218475910936,14.314395704994,0.259199978263454
51.8218475910936,14.3215902059928,0.259199978263454
51.8218475910936,14.3287847069916,0.259199978263454
51.8218475910936,14.3359792079904,0.259199978263454
51.8218475910936,14.3431737089892,0.254929780927562
51.8218475910936,14.350368209988,0.259199978263454
51.8218475910936,14.3575627109868,0.259199978263454
51.8218475910936,14.3647572119856,0.259199978263454
51.8218475910936,14.3719517129844,0.259199978263454
51.8218475910936,14.3791462139832,0.259199978263454
51.8264875330587,14.3072012039952,0.259199978263454
51.8264875330587,14.314395704994,0.259199978263454
51.8264875330587,14.3215902059928,0.259199978263454
51.8264875330587,14.3287847069916,0.259199978263454
51.8264875330587,14.3359792079904,0.259199978263454
51.8264875330587,14.3431737089892,0.259199978263454
51.8264875330587,14.350368209988,0.259199978263454
51.8264875330587,14.3575627109868,0.259199978263454
51.8264875330587,14.3647572119856,0.259199978263454
51.8264875330587,14.3719517129844,0.259199978263454
51.8311274750239,14.3072012039952,0.259199978263454
51.8311274750239,14.314395704994,0.259199978263454
51.8311274750239,14.3215902059928,0.259199978263454
51.8311274750239,14.3287847069916,0.259199978263454
51.8311274750239,14.3359792079904,0.259199978263454
51.8311274750239,14.3431737089892,0.259199978263454
51.8311274750239,14.350368209988,0.259199978263454
51.8311274750239,14.3575627109868,0.259199978263454
51.8311274750239,14.3647572119856,0.259199978263454
51.835767416989,14.3072012039952,0.259199978263454
51.835767416989,14.314395704994,0.259199978263454
51.835767416989,14.3215902059928,0.259199978263454
51.835767416989,14.3287847069916,0.259199978263454
51.835767416989,14.3359792079904,0.259199978263454
51.835767416989,14.3431737089892,0.259199978263454
51.835767416989,14.350368209988,0.259199978263454
51.835767416989,14.3575627109868,0.259199978263454
51.835767416989,14.3647572119856,0.259199978263454
51.835767416989,14.3719517129844,0.259199978263454
51.8404073589541,14.3072012039952,0.259199978263454
51.8404073589541,14.314395704994,0.259199978263454
51.8404073589541,14.3215902059928,0.259199978263454
51.8404073589541,14.3287847069916,0.259199978263454
51.8404073589541,14.3359792079904,0.259199978263454
51.8404073589541,14.3431737089892,0.259199978263454
51.8404073589541,14.350368209988,0.259199978263454
51.8404073589541,14.3575627109868,0.259199978263454
51.8404073589541,14.3647572119856,0.259199978263454
51.8404073589541,14.3719517129844,0.259199978263454
51.8450473009193,14.3000067029964,0.259199978263454
51.8450473009193,14.3072012039952,0.259199978263454
51.8450473009193,14.314395704994,0.259199978263454
51.8450473009193,14.3215902059928,0.259199978263454
51.8450473009193,14.3287847069916,0.259199978263454
51.8450473009193,14.3359792079904,0.259199978263454
51.8450473009193,14.3431737089892,0.259199978263454
51.8450473009193,14.350368209988,0.259199978263454
51.8450473009193,14.3575627109868,0.259199978263454
51.8450473009193,14.3647572119856,0.259199978263454
51.8450473009193,14.3719517129844,0.259199978263454
51.8450473009193,14.3791462139832,0.259199978263454
51.8496872428844,14.3072012039952,0.259199978263454
51.8496872428844,14.314395704994,0.329476396044774
51.8496872428844,14.3215902059928,0.259199978263454
51.8496872428844,14.3287847069916,0.259199978263454
51.8496872428844,14.3359792079904,0.259199978263454
51.8496872428844,14.3431737089892,0.259199978263454
51.8496872428844,14.350368209988,0.259199978263454
51.8496872428844,14.3575627109868,0.259199978263454
51.8496872428844,14.3647572119856,0.259199978263454
51.8496872428844,14.3719517129844,0.259199978263454
51.8496872428844,14.3791462139832,0.259199978263454
51.8496872428844,14.386340714982,0.259199978263454
