nan,nan,1.069099231697875074e-01
1.040119815078003640e+01,4.813680530859133455e+01,1.203930600038956716e-01
1.012794459073766440e+01,4.790334459230434305e+01,1.333801322904819009e-01
1.045372114945094388e+01,4.811813178460032248e+01,1.471492464339342054e-01
1.033963461357347491e+01,4.803712579290515805e+01,1.593476357696356482e-01
1.059860442361442701e+01,4.799614637569816722e+01,1.710833202579736534e-01
1.057877727826366154e+01,4.799641151550287788e+01,1.830249122205186707e-01
1.027798875847364002e+01,4.808436895701147051e+01,1.942224709157345242e-01
1.024732680797918682e+01,4.788125012544524139e+01,2.056969512945532319e-01
1.026277462798871021e+01,4.814112672362891487e+01,2.179284166447069404e-01
1.036124706667074413e+01,4.797480351116779929e+01,2.292834888694268436e-01
