nan,nan,6.212106037274873344e-02
1.446977283831306593e+01,5.237179441278743042e+01,7.412913575853238846e-02
1.451339396847294161e+01,5.234726480836339135e+01,8.722453161206911165e-02
1.452338454986422889e+01,5.232850096449716659e+01,1.008053206572190746e-01
1.446274107601635350e+01,5.234926350217568114e+01,1.129671584615733332e-01
1.455102153463758974e+01,5.228605078928451633e+01,1.252337246186699671e-01
1.454889276203349979e+01,5.232443192555984268e+01,1.367667435730070546e-01
1.454663430469248020e+01,5.236138938938914578e+01,1.478774286529854487e-01
1.449728636719066266e+01,5.235617971213394384e+01,1.591758111162458189e-01
1.452828894266090565e+01,5.230864257383369420e+01,1.703354466183531202e-01
1.451034935274386051e+01,5.227991575757575049e+01,1.822826952877326934e-01
