nan,nan,1.051948834559386509e-01
1.010003937104294458e+01,5.066444348936268938e+01,1.175630939407251163e-01
1.040659217801819025e+01,5.092430812605770996e+01,1.292670468963653674e-01
9.948661093149256729e+00,5.071166718413167018e+01,1.419720319245189044e-01
1.006688151384364538e+01,5.096413809712824872e+01,1.541544336751918265e-01
1.015073138111411488e+01,5.098567281281567176e+01,1.674945821296318638e-01
1.040613007770662790e+01,5.099260640385412557e+01,1.793525375934657551e-01
1.017257172172212520e+01,5.114012392499499526e+01,1.905435936461017943e-01
1.033963780993723347e+01,5.093800854147348645e+01,2.028780452645647381e-01
1.051396742958391251e+01,5.102226529689104240e+01,2.159165556666802210e-01
1.037791246273559764e+01,5.092693574832116354e+01,2.283416592504810549e-01
