nan,nan,2.754141115513619731e-01
9.926701317134485336e+00,4.837638512263149693e+01,2.863199323173295507e-01
9.922630080225200544e+00,4.835596086743064603e+01,2.971720960643447484e-01
1.001217663061164487e+01,4.845005969772714138e+01,3.079130510235300600e-01
9.950563380377969835e+00,4.831837866171879625e+01,3.186502342759768847e-01
9.922356662759945323e+00,4.840158331766765798e+01,3.297822858074075936e-01
9.916673560711830149e+00,4.831971852290798353e+01,3.405438234712576118e-01
9.907680472944305095e+00,4.836623851064664592e+01,3.504112681051566591e-01
9.876818581228059557e+00,4.838925665961039613e+01,3.611404323783194981e-01
9.959249377042352691e+00,4.836670102418737116e+01,3.717471953074349411e-01
9.951994639107601515e+00,4.834736709994284354e+01,3.824817663359044162e-01
