nan,nan,2.148280096337457090e-01
6.248605459093045766e+00,5.092891813592971317e+01,2.271261865571616578e-01
6.406504135596677862e+00,5.080038819055467769e+01,2.392388777669443023e-01
6.450911333791575331e+00,5.079460693210523914e+01,2.510867313990273741e-01
6.574184933704154687e+00,5.068291939271011870e+01,2.629930904384685797e-01
6.478271259304904106e+00,5.062937904487156970e+01,2.754616990115266728e-01
6.307819454058609665e+00,5.094384241348944897e+01,2.867886072199950509e-01
6.477746586795364969e+00,5.076742384606814795e+01,2.996809677001335825e-01
6.419742275205958748e+00,5.084564087461519222e+01,3.116854337054806856e-01
6.512514629692544688e+00,5.072976033297519649e+01,3.247440607876445617e-01
6.572648824136504864e+00,5.079427086592725971e+01,3.362518523103979473e-01
