51.012144,6.9967943026695,0.25028312084712
51.0166734442642,6.97521068666884,0.259199978263454
51.0166734442642,6.98240522533573,0.278556589052911
51.0166734442642,6.98959976400261,0.366368220256995
51.0212028885284,6.97521068666884,0.259199978263454
51.0212028885284,6.98240522533573,0.259199978263454
51.0212028885284,6.98959976400261,0.246852539185786
51.0212028885284,6.9967943026695,0.310134578850675
51.0212028885284,7.00398884133638,0.211977144213697
51.0212028885284,7.01837791867015,0.272770882102238
51.0212028885284,7.02557245733704,0.259199978263454
51.0212028885284,7.03276699600392,0.34302222504361
51.0212028885284,7.0399615346708,0.378003942657399
51.0212028885284,7.04715607333769,0.456162181818078
51.0212028885284,7.05435061200457,0.348799478957968
51.0212028885284,7.06154515067146,0.325062822993994
51.0212028885284,7.06873968933834,0.275624261706852
51.0257323327926,6.97521068666884,0.259199978263454
51.0257323327926,6.98240522533573,0.304919240372238
51.0257323327926,6.98959976400261,0.458356315239993
51.0257323327926,6.9967943026695,0.377110452416515
51.0257323327926,7.00398884133638,0.255193853068228
51.0257323327926,7.01118338000327,0.261946644507368
51.0257323327926,7.01837791867015,0.292922264318495
51.0257323327926,7.02557245733704,0.31318060317855
51.0257323327926,7.03276699600392,0.352331446714111
51.0257323327926,7.0399615346708,0.354987020855289
51.0257323327926,7.04715607333769,0.456973806710658
51.0257323327926,7.05435061200457,0.32881550232121
51.0257323327926,7.06154515067146,0.278412084073908
51.0257323327926,7.06873968933834,0.259199978263454
51.0257323327926,7.07593422800523,0.259199978263454
51.0302617770569,6.96801614800196,0.390502205635768
51.0302617770569,6.97521068666884,0.59178131599933
51.0302617770569,6.98240522533573,0.802514772559239
51.0302617770569,6.98959976400261,0.671181308833256
51.0302617770569,6.9967943026695,0.526577885268461
51.0302617770569,7.00398884133638,0.511562709736233
51.0302617770569,7.01118338000327,0.589304603856621
51.0302617770569,7.01837791867015,0.493493698297658
51.0302617770569,7.02557245733704,0.328643804643655
51.0302617770569,7.03276699600392,0.32983214238521
51.0302617770569,7.0399615346708,0.357408872611243
51.0302617770569,7.04715607333769,0.414115881649791
51.0302617770569,7.05435061200457,0.320640343211285
51.0302617770569,7.06154515067146,0.265287469116286
51.0302617770569,7.06873968933834,0.259199978263454
51.0302617770569,7.07593422800523,0.259199978263454
51.0302617770569,7.08312876667211,0.259199978263454
51.0302617770569,7.09032330533899,0.259199978263454
51.0347912213211,6.96082160933507,0.331933978040965
51.0347912213211,6.96801614800196,0.588957957246473
51.0347912213211,6.97521068666884,0.415806864296177
51.0347912213211,6.98240522533573,0.544493984708522
51.0347912213211,6.98959976400261,0.604604956724563
51.0347912213211,6.9967943026695,0.549999783161547
51.0347912213211,7.00398884133638,0.561215083755575
51.0347912213211,7.01118338000327,0.421629373610103
51.0347912213211,7.01837791867015,0.377080809426185
51.0347912213211,7.02557245733704,0.295624375405034
51.0347912213211,7.03276699600392,0.338708241246974
51.0347912213211,7.0399615346708,0.473139040059429
51.0347912213211,7.04715607333769,0.677479502233494
51.0347912213211,7.05435061200457,0.682278060341104
51.0347912213211,7.06154515067146,0.236143453015807
51.0347912213211,7.06873968933834,0.259199978263454
51.0347912213211,7.07593422800523,0.259199978263454
51.0347912213211,7.08312876667211,0.259199978263454
51.0347912213211,7.09032330533899,0.259199978263454
51.0393206655853,6.95362707066819,0.28633779459099
51.0393206655853,6.96082160933507,0.259199978263454
51.0393206655853,6.96801614800196,0.283731253950998
51.0393206655853,6.97521068666884,0.302253292258961
51.0393206655853,6.98240522533573,0.37055723888692
51.0393206655853,6.98959976400261,0.342974316187096
51.0393206655853,6.9967943026695,0.194212528365908
51.0393206655853,7.00398884133638,0.489890083586973
51.0393206655853,7.01118338000327,0.364975456535279
51.0393206655853,7.01837791867015,0.338592421796018
51.0393206655853,7.02557245733704,0.495914755888067
51.0393206655853,7.03276699600392,0.611626905828432
51.0393206655853,7.0399615346708,0.247813715636608
51.0393206655853,7.04715607333769,0.280177954573435
51.0393206655853,7.05435061200457,0.376634447934896
51.0393206655853,7.06154515067146,0.294108323920276
51.0393206655853,7.06873968933834,0.337298224141153
51.0393206655853,7.07593422800523,0.251290070980565
51.0393206655853,7.08312876667211,0.255560519345672
51.0393206655853,7.09032330533899,0.259199978263454
51.0393206655853,7.09751784400588,0.259199978263454
51.0438501098495,6.94643253200131,0.286254936095748
51.0438501098495,6.95362707066819,0.278610911547118
51.0438501098495,6.96082160933507,0.259199978263454
51.0438501098495,6.96801614800196,0.259199978263454
51.0438501098495,6.97521068666884,0.270380241621651
51.0438501098495,6.98240522533573,0.481752050495285
51.0438501098495,6.98959976400261,0.424614575694703
51.0438501098495,6.9967943026695,0.373682568874035
51.0438501098495,7.00398884133638,0.316081655022651
51.0438501098495,7.01118338000327,0.380800101258522
51.0438501098495,7.01837791867015,0.231642152488738
51.0438501098495,7.02557245733704,0.231278841551461
51.0438501098495,7.03276699600392,0.404771492150929
51.0438501098495,7.0399615346708,0.259199978263454
51.0438501098495,7.04715607333769,0.308090524902627
51.0438501098495,7.05435061200457,0.474664811256532
51.0438501098495,7.06154515067146,0.28306841910503
51.0438501098495,7.06873968933834,0.447386908617382
51.0438501098495,7.07593422800523,0.472065278775457
51.0438501098495,7.08312876667211,0.269750813515445
51.0438501098495,7.09032330533899,0.255717155891423
51.0438501098495,7.09751784400588,0.237168430254548
51.0483795541137,6.93204345466754,0.259199978263454
51.0483795541137,6.93923799333442,0.25151315569345
51.0483795541137,6.94643253200131,0.616826040201692
51.0483795541137,6.95362707066819,0.39311712940548
51.0483795541137,6.96082160933507,0.259199978263454
51.0483795541137,6.96801614800196,0.259199978263454
51.0483795541137,6.97521068666884,0.265861452183494
51.0483795541137,6.98240522533573,0.445156794030259
51.0483795541137,6.98959976400261,0.425438724403568
51.0483795541137,6.9967943026695,0.577358087988231
51.0483795541137,7.00398884133638,0.383307866087859
51.0483795541137,7.01118338000327,0.272078153487356
51.0483795541137,7.01837791867015,0.312967085212697
51.0483795541137,7.02557245733704,0.307405269987935
51.0483795541137,7.03276699600392,0.269248064393658
51.0483795541137,7.0399615346708,0.259199978263454
51.0483795541137,7.04715607333769,0.273075485518258
51.0483795541137,7.05435061200457,0.392591632131341
51.0483795541137,7.06154515067146,0.378426901602208
51.0483795541137,7.06873968933834,0.253469387601522
51.0483795541137,7.07593422800523,0.377326965501429
51.0483795541137,7.08312876667211,0.266282501988008
51.0483795541137,7.09032330533899,0.260115566643031
51.0483795541137,7.09751784400588,0.244008021346161
51.0529089983779,6.92484891600065,0.259199978263454
51.0529089983779,6.93204345466754,0.260184447845672
51.0529089983779,6.93923799333442,0.237364833411103
51.0529089983779,6.94643253200131,0.427844945848158
51.0529089983779,6.95362707066819,0.398549046047081
51.0529089983779,6.96082160933507,0.289182353663291
51.0529089983779,6.96801614800196,0.259199978263454
51.0529089983779,6.97521068666884,0.273000975403681
51.0529089983779,6.98240522533573,0.404055472741353
51.0529089983779,6.98959976400261,0.350297269694438
51.0529089983779,6.9967943026695,0.516239507109449
51.0529089983779,7.00398884133638,0.365149793211016
51.0529089983779,7.01118338000327,0.283563461095289
51.0529089983779,7.01837791867015,0.544571515839404
51.0529089983779,7.02557245733704,0.327350693963319
51.0529089983779,7.03276699600392,0.259199978263454
51.0529089983779,7.0399615346708,0.259199978263454
51.0529089983779,7.04715607333769,0.259199978263454
51.0529089983779,7.05435061200457,0.264044808651276
51.0529089983779,7.06154515067146,0.329950928415016
51.0529089983779,7.06873968933834,0.301758130986598
51.0529089983779,7.07593422800523,0.278966414931258
51.0529089983779,7.08312876667211,0.275124582881331
51.0529089983779,7.09032330533899,0.305760401364616
51.0529089983779,7.09751784400588,0.246292778653067
51.0574384426421,6.91765437733377,0.517496080130228
51.0574384426421,6.92484891600065,0.159707603939604
51.0574384426421,6.93204345466754,0.252582392572054
51.0574384426421,6.93923799333442,0.289825760390828
51.0574384426421,6.94643253200131,0.257335312082893
51.0574384426421,6.95362707066819,0.204261918099104
51.0574384426421,6.96082160933507,0.399671820066176
51.0574384426421,6.96801614800196,0.262917098364955
51.0574384426421,6.97521068666884,0.259199978263454
51.0574384426421,6.98240522533573,0.288351551127361
51.0574384426421,6.98959976400261,0.284207291508517
51.0574384426421,6.9967943026695,0.536241640081845
51.0574384426421,7.00398884133638,0.544146185578504
51.0574384426421,7.01118338000327,0.30710009206334
51.0574384426421,7.01837791867015,0.515623982857773
51.0574384426421,7.02557245733704,0.294118082378665
51.0574384426421,7.03276699600392,0.246466762233282
51.0574384426421,7.0399615346708,0.259199978263454
51.0574384426421,7.04715607333769,0.277751589690709
51.0574384426421,7.05435061200457,0.23722401813588
51.0574384426421,7.06154515067146,0.299364838955331
51.0574384426421,7.06873968933834,0.261644253930648
51.0574384426421,7.07593422800523,0.255128009455306
51.0574384426421,7.08312876667211,0.259199978263454
51.0574384426421,7.09032330533899,0.259199978263454
51.0574384426421,7.09751784400588,0.275184497471041
51.0619678869064,6.91045983866688,0.556407755867762
51.0619678869064,6.91765437733377,0.62604558364756
51.0619678869064,6.92484891600065,0.306991676340652
51.0619678869064,6.93204345466754,0.259199978263454
51.0619678869064,6.93923799333442,0.271694246749718
51.0619678869064,6.94643253200131,0.266646447997879
51.0619678869064,6.95362707066819,0.393007163139858
51.0619678869064,6.96082160933507,0.362140070183763
51.0619678869064,6.96801614800196,0.259199978263454
51.0619678869064,6.97521068666884,0.259199978263454
51.0619678869064,6.98240522533573,0.245385405335388
51.0619678869064,6.98959976400261,0.280934741214387
51.0619678869064,6.9967943026695,0.418865799419154
51.0619678869064,7.00398884133638,0.686339001886681
51.0619678869064,7.01118338000327,0.553434072248331
51.0619678869064,7.01837791867015,0.651599046505117
51.0619678869064,7.02557245733704,0.455227264784326
51.0619678869064,7.03276699600392,0.38769707015079
51.0619678869064,7.0399615346708,0.287680546344846
51.0619678869064,7.04715607333769,0.328416817476229
51.0619678869064,7.05435061200457,0.447937062914869
51.0619678869064,7.06154515067146,0.380404096784008
51.0619678869064,7.06873968933834,0.262584414801437
51.0619678869064,7.07593422800523,0.27783121517368
51.0619678869064,7.08312876667211,0.253965926875132
51.0619678869064,7.09032330533899,0.259199978263454
51.0619678869064,7.09751784400588,0.259199978263454
51.0664973311706,6.9032653,0.363300293191389
51.0664973311706,6.91045983866688,0.313546446443845
51.0664973311706,6.91765437733377,0.380811820497426
51.0664973311706,6.92484891600065,0.200984364940425
51.0664973311706,6.93204345466754,0.267896214122506
51.0664973311706,6.93923799333442,0.259199978263454
51.0664973311706,6.94643253200131,0.293679753978886
51.0664973311706,6.95362707066819,0.331069896980858
51.0664973311706,6.96082160933507,0.282360582920464
51.0664973311706,6.96801614800196,0.259199978263454
51.0664973311706,6.97521068666884,0.259199978263454
51.0664973311706,6.98240522533573,0.26344409066102
51.0664973311706,6.98959976400261,0.296241577844877
51.0664973311706,6.9967943026695,0.519656986719365
51.0664973311706,7.00398884133638,0.72799758725384
51.0664973311706,7.01118338000327,0.455035420400449
51.0664973311706,7.01837791867015,0.543102216369162
51.0664973311706,7.02557245733704,0.230593042200649
51.0664973311706,7.03276699600392,0.373160773825266
51.0664973311706,7.0399615346708,0.340054817914119
51.0664973311706,7.04715607333769,0.368549124946654
51.0664973311706,7.05435061200457,0.648572497408766
51.0664973311706,7.06154515067146,0.413147260390123
51.0664973311706,7.06873968933834,0.25894636631427
51.0664973311706,7.07593422800523,0.259532927380836
51.0664973311706,7.08312876667211,0.242746619574638
51.0664973311706,7.09032330533899,0.259199978263454
51.0710267754348,6.91045983866688,0.259199978263454
51.0710267754348,6.91765437733377,0.264064642671973
51.0710267754348,6.92484891600065,0.289571376867281
51.0710267754348,6.93204345466754,0.297601091054648
51.0710267754348,6.93923799333442,0.259199978263454
51.0710267754348,6.94643253200131,0.288519280725305
51.0710267754348,6.95362707066819,0.272833221941801
51.0710267754348,6.96082160933507,0.259199978263454
51.0710267754348,6.98240522533573,0.259199978263454
51.0710267754348,6.98959976400261,0.256197022905535
51.0710267754348,6.9967943026695,0.592424332785081
51.0710267754348,7.00398884133638,0.574735881815916
51.0710267754348,7.01118338000327,0.427607561971924
51.0710267754348,7.01837791867015,0.38498540662184
51.0710267754348,7.02557245733704,0.257027806518579
51.0710267754348,7.03276699600392,0.262774833715614
51.0710267754348,7.0399615346708,0.294683651678249
51.0710267754348,7.04715607333769,0.259199978263454
51.0710267754348,7.05435061200457,0.318370901756167
51.0710267754348,7.06154515067146,0.295732006084118
51.075556219699,6.91765437733377,0.259199978263454
51.075556219699,6.92484891600065,0.258934285591643
51.075556219699,6.93204345466754,0.255266487231282
51.075556219699,6.9967943026695,0.475256354420771
51.075556219699,7.00398884133638,0.459715475255804
51.075556219699,7.01118338000327,0.306791383968539
51.075556219699,7.01837791867015,0.272803495118966
51.075556219699,7.02557245733704,0.305159329801531
51.075556219699,7.03276699600392,0.476900642015145
51.075556219699,7.0399615346708,0.273310451734356
51.075556219699,7.04715607333769,0.259199978263454
51.075556219699,7.05435061200457,0.323927472804911
51.0800856639632,6.92484891600065,0.259199978263454
51.0800856639632,6.9967943026695,0.308571656486172
51.0800856639632,7.00398884133638,0.314408639998793
51.0800856639632,7.01118338000327,0.257911700449072
51.0800856639632,7.01837791867015,0.261059942418191
51.0800856639632,7.02557245733704,0.350172060387357
51.0800856639632,7.03276699600392,0.418420915714586
51.0800856639632,7.0399615346708,0.248760591045861
51.0800856639632,7.04715607333769,0.246020825762932
51.0800856639632,7.05435061200457,0.336831212004997
51.0800856639632,7.06154515067146,0.266945040863454
51.0846151082274,6.9967943026695,0.40036571222599
51.0846151082274,7.00398884133638,0.260925004963743
51.0846151082274,7.02557245733704,0.272811422233054
51.0846151082274,7.03276699600392,0.274899788112447
51.0846151082274,7.0399615346708,0.252971620812758
51.0846151082274,7.04715607333769,0.249568270117566
51.0846151082274,7.05435061200457,0.260473434396119
51.0846151082274,7.06154515067146,0.259199978263454
51.0891445524916,7.03276699600392,0.259199978263454
51.0891445524916,7.0399615346708,0.260592176562844
51.0891445524916,7.04715607333769,0.276732374788904
51.0891445524916,7.05435061200457,0.293287615589228
51.0891445524916,7.06154515067146,0.280038665491936
51.0891445524916,7.06873968933834,0.274213470000895
