nan,nan,1.116339017529555805e-01
1.168876296788615221e+01,4.945083959754957448e+01,1.229787715030341427e-01
1.191739072471947658e+01,4.926935652861178028e+01,1.345055608230474598e-01
1.194434653041077432e+01,4.954322520129825591e+01,1.480152071132341263e-01
1.177033214103970415e+01,4.962798775872961698e+01,1.600238510459777719e-01
1.206194918180017162e+01,4.950868208849371399e+01,1.724146511041718677e-01
1.172188875632026495e+01,4.957828899757446095e+01,1.844540679579868281e-01
1.158622585729736798e+01,4.952762711095468262e+01,1.961165988017790907e-01
1.168971660980955285e+01,4.958003200376375474e+01,2.077516548089071435e-01
1.160126727784088274e+01,4.958775250441117066e+01,2.194917182370875186e-01
1.197957101415758174e+01,4.947516873750682720e+01,2.305284527994433119e-01
