nan,nan,8.905190257542114352e-02
1.100167649358805555e+01,4.834648241420967452e+01,1.005949719426806610e-01
1.097840282932717670e+01,4.830273873082569480e+01,1.122284727157465412e-01
1.110609615286257501e+01,4.858832442509375937e+01,1.240165676664131134e-01
1.093454105534893905e+01,4.825475850047365611e+01,1.350354157093367480e-01
1.105658712437813485e+01,4.844412012653970123e+01,1.461048523569098978e-01
1.093039710880729665e+01,4.847790267772244022e+01,1.572324751631414552e-01
1.098363401356747282e+01,4.845403285196634613e+01,1.709479526697789964e-01
1.099563755502417983e+01,4.853393143299899748e+01,1.825560796259389496e-01
1.108971947126766189e+01,4.858052561855285489e+01,1.953829218836630188e-01
1.104450332093119336e+01,4.838545323027920375e+01,2.084326500986271036e-01
