nan,nan,1.046409976363490285e-01
1.208531106743192396e+01,5.082891944596382672e+01,1.169054175083544672e-01
1.205299933042475580e+01,5.092155484346402261e+01,1.298976671449985631e-01
1.205830605241478537e+01,5.086586304071912679e+01,1.416804588095007256e-01
1.208874816231898386e+01,5.090508537230950026e+01,1.537871152478255954e-01
1.201311403061006722e+01,5.087773650129353342e+01,1.656888019590387340e-01
1.213497551877365943e+01,5.081377157379608889e+01,1.778747793910853414e-01
1.211875955566254248e+01,5.084580421934673211e+01,1.900418685941867303e-01
1.209201513970677766e+01,5.095383890076873001e+01,2.024061295328966337e-01
1.209870636797277044e+01,5.086398593508892674e+01,2.130595302709423211e-01
1.203981362324149984e+01,5.089960091407301945e+01,2.251299540805548061e-01
