53.0233544,8.81859828063269,0.276951475426901
53.0233544,8.82579281131342,0.259199978263454
53.0233544,8.83298734199415,0.254725707091503
53.0233544,8.84018187267487,0.259199978263454
53.0233544,8.8473764033556,0.259199978263454
53.0233544,8.85457093403633,0.261323388458737
53.0233544,8.86176546471705,0.250815329794252
53.0233544,8.89054358743996,0.26126634844589
53.0233544,8.89773811812069,0.259199978263454
53.0233544,8.90493264880141,0.259199978263454
53.0233544,8.91212717948214,0.259199978263454
53.0233544,8.91932171016286,0.259199978263454
53.0233544,8.92651624084359,0.259199978263454
53.0233544,8.93371077152432,0.259199978263454
53.0279008868107,8.81859828063269,0.437828459363814
53.0279008868107,8.82579281131342,0.353013632248965
53.0279008868107,8.83298734199415,0.418584972381181
53.0279008868107,8.84018187267487,0.299611570223009
53.0279008868107,8.8473764033556,0.373058080620529
53.0279008868107,8.85457093403633,0.380218580626249
53.0279008868107,8.86176546471705,0.270854971528808
53.0279008868107,8.88334905675923,0.334084277073276
53.0279008868107,8.89054358743996,0.283103286397229
53.0279008868107,8.89773811812069,0.259199978263454
53.0279008868107,8.90493264880141,0.259199978263454
53.0279008868107,8.91212717948214,0.259199978263454
53.0279008868107,8.91932171016286,0.259199978263454
53.0279008868107,8.92651624084359,0.259199978263454
53.0279008868107,8.93371077152432,0.259199978263454
53.0279008868107,8.94090530220504,0.246731771015034
53.0324473736214,8.81140374995197,0.355948992209503
53.0324473736214,8.81859828063269,0.358222701615496
53.0324473736214,8.82579281131342,0.551665390692623
53.0324473736214,8.83298734199415,0.437466766330682
53.0324473736214,8.84018187267487,0.431066392401666
53.0324473736214,8.8473764033556,0.417393145806525
53.0324473736214,8.85457093403633,0.367692543941473
53.0324473736214,8.86176546471705,0.284853080770866
53.0324473736214,8.86895999539778,0.259199978263454
53.0324473736214,8.8761545260785,0.263265544178626
53.0324473736214,8.88334905675923,0.280530920094585
53.0324473736214,8.89054358743996,0.270155687477243
53.0324473736214,8.89773811812069,0.262528876279926
53.0324473736214,8.90493264880141,0.259199978263454
53.0324473736214,8.91212717948214,0.259199978263454
53.0324473736214,8.91932171016286,0.264307510747212
53.0324473736214,8.92651624084359,0.259199978263454
53.0324473736214,8.93371077152432,0.256368317537168
53.0324473736214,8.94090530220504,0.247159057246962
53.0324473736214,8.94809983288577,0.353767316889007
53.0369938604321,8.73226391246398,0.543007161732554
53.0369938604321,8.79701468859051,0.259199978263454
53.0369938604321,8.80420921927124,0.259199978263454
53.0369938604321,8.81140374995197,0.384563271982025
53.0369938604321,8.81859828063269,0.477841301698186
53.0369938604321,8.82579281131342,0.743107992385339
53.0369938604321,8.83298734199415,0.399177197259414
53.0369938604321,8.84018187267487,0.443130436794074
53.0369938604321,8.8473764033556,0.346101314301334
53.0369938604321,8.85457093403633,0.323832827829706
53.0369938604321,8.86176546471705,0.346020896256822
53.0369938604321,8.86895999539778,0.412587845631787
53.0369938604321,8.8761545260785,0.293993369478711
53.0369938604321,8.88334905675923,0.24793480972573
53.0369938604321,8.89054358743996,0.246703415182745
53.0369938604321,8.89773811812069,0.270921062574415
53.0369938604321,8.90493264880141,0.342240926061749
53.0369938604321,8.91212717948214,0.299342756328686
53.0369938604321,8.91932171016286,0.375159415970634
53.0369938604321,8.92651624084359,0.281671843173402
53.0369938604321,8.93371077152432,0.304656251203549
53.0369938604321,8.94090530220504,0.416892134210957
53.0369938604321,8.94809983288577,0.412850605134801
53.0369938604321,8.9552943635665,0.407423881148607
53.0369938604321,8.96248889424722,0.267575728158184
53.0415403472428,8.71787485110252,0.338567549561639
53.0415403472428,8.72506938178325,0.473519287134672
53.0415403472428,8.73226391246398,0.695689471476086
53.0415403472428,8.7394584431447,0.484906854969026
53.0415403472428,8.74665297382543,0.370073665363741
53.0415403472428,8.75384750450615,0.288725295183668
53.0415403472428,8.78262562722906,0.259199978263454
53.0415403472428,8.78982015790979,0.259199978263454
53.0415403472428,8.79701468859051,0.259199978263454
53.0415403472428,8.80420921927124,0.331235382244662
53.0415403472428,8.81140374995197,0.438112867581017
53.0415403472428,8.81859828063269,0.499929179970486
53.0415403472428,8.82579281131342,0.357087597915646
53.0415403472428,8.83298734199415,0.280018535572724
53.0415403472428,8.84018187267487,0.350344562538766
53.0415403472428,8.8473764033556,0.411480840808358
53.0415403472428,8.85457093403633,0.361221655114138
53.0415403472428,8.86176546471705,0.331183475112667
53.0415403472428,8.86895999539778,0.25990225246736
53.0415403472428,8.8761545260785,0.259199978263454
53.0415403472428,8.88334905675923,0.198679659422298
53.0415403472428,8.89054358743996,0.257501754958196
53.0415403472428,8.89773811812069,0.427023150972993
53.0415403472428,8.90493264880141,0.388529264739998
53.0415403472428,8.91212717948214,0.393348520669327
53.0415403472428,8.91932171016286,0.465423125026604
53.0415403472428,8.92651624084359,0.442928786707538
53.0415403472428,8.93371077152432,0.379650047017924
53.0415403472428,8.94090530220504,0.308581505736351
53.0415403472428,8.94809983288577,0.391787706807876
53.0415403472428,8.9552943635665,0.361923889628129
53.0415403472428,8.96248889424722,0.287445355803817
53.0415403472428,8.96968342492795,0.255720876458426
53.0460868340534,8.7106803204218,0.358332414246164
53.0460868340534,8.71787485110252,0.601383484216895
53.0460868340534,8.72506938178325,0.411451256281997
53.0460868340534,8.73226391246398,0.456698466039774
53.0460868340534,8.7394584431447,0.601033773904052
53.0460868340534,8.74665297382543,0.456878718406938
53.0460868340534,8.75384750450615,0.259199978263454
53.0460868340534,8.76104203518688,0.259199978263454
53.0460868340534,8.77543109654833,0.259199978263454
53.0460868340534,8.78262562722906,0.259199978263454
53.0460868340534,8.78982015790979,0.236697200644131
53.0460868340534,8.79701468859051,0.259199978263454
53.0460868340534,8.80420921927124,0.259199978263454
53.0460868340534,8.81140374995197,0.273142696100049
53.0460868340534,8.81859828063269,0.591168839632068
53.0460868340534,8.82579281131342,0.365696342288915
53.0460868340534,8.83298734199415,0.397285462182927
53.0460868340534,8.84018187267487,0.434925511655101
53.0460868340534,8.8473764033556,0.387244655782472
53.0460868340534,8.85457093403633,0.359536964236792
53.0460868340534,8.86176546471705,0.363997970636657
53.0460868340534,8.86895999539778,0.334286644027297
53.0460868340534,8.8761545260785,0.494104836790045
53.0460868340534,8.88334905675923,0.321627073686937
53.0460868340534,8.89054358743996,0.364501885242513
53.0460868340534,8.89773811812069,0.673855703252691
53.0460868340534,8.90493264880141,0.441720589894717
53.0460868340534,8.91212717948214,0.375268711607097
53.0460868340534,8.91932171016286,0.302607992495124
53.0460868340534,8.92651624084359,0.267810428258747
53.0460868340534,8.93371077152432,0.259199978263454
53.0460868340534,8.94090530220504,0.267986962808021
53.0460868340534,8.94809983288577,0.346313983882832
53.0460868340534,8.9552943635665,0.336247554606592
53.0460868340534,8.96248889424722,0.290432373428531
53.0460868340534,8.96968342492795,0.259199978263454
53.0460868340534,8.97687795560868,0.259199978263454
53.0506333208641,8.7106803204218,0.392981538648897
53.0506333208641,8.71787485110252,0.402238828485346
53.0506333208641,8.72506938178325,0.35910189600316
53.0506333208641,8.73226391246398,0.327580255122425
53.0506333208641,8.7394584431447,0.659237794968787
53.0506333208641,8.74665297382543,0.377917539666516
53.0506333208641,8.75384750450615,0.259199978263454
53.0506333208641,8.76104203518688,0.259199978263454
53.0506333208641,8.77543109654833,0.29964818064567
53.0506333208641,8.78262562722906,0.38823472422555
53.0506333208641,8.78982015790979,0.448975254717198
53.0506333208641,8.79701468859051,0.250733836472352
53.0506333208641,8.80420921927124,0.201614556384518
53.0506333208641,8.81140374995197,0.234775002186128
53.0506333208641,8.81859828063269,0.645158369080493
53.0506333208641,8.82579281131342,0.398701910935178
53.0506333208641,8.83298734199415,0.282695448600658
53.0506333208641,8.84018187267487,0.415336850261506
53.0506333208641,8.8473764033556,0.594975801763771
53.0506333208641,8.85457093403633,0.484039783876135
53.0506333208641,8.86176546471705,0.362885264260963
53.0506333208641,8.86895999539778,0.321550920883557
53.0506333208641,8.8761545260785,0.341457710342908
53.0506333208641,8.88334905675923,0.313084844509757
53.0506333208641,8.89054358743996,0.465486833208798
53.0506333208641,8.89773811812069,0.465538765235943
53.0506333208641,8.90493264880141,0.3826110218022
53.0506333208641,8.91212717948214,0.397546287192481
53.0506333208641,8.91932171016286,0.305683595019685
53.0506333208641,8.92651624084359,0.259199978263454
53.0506333208641,8.93371077152432,0.259199978263454
53.0506333208641,8.94090530220504,0.259199978263454
53.0506333208641,8.94809983288577,0.325251491942204
53.0506333208641,8.9552943635665,0.507539452349449
53.0506333208641,8.96248889424722,0.605906581509844
53.0506333208641,8.96968342492795,0.347960095474327
53.0506333208641,8.97687795560868,0.259199978263454
53.0551798076748,8.7106803204218,0.357021849585257
53.0551798076748,8.71787485110252,0.374158185445747
53.0551798076748,8.72506938178325,0.394373133658664
53.0551798076748,8.73226391246398,0.432733866133946
53.0551798076748,8.7394584431447,0.478174937999336
53.0551798076748,8.74665297382543,0.324720367477327
53.0551798076748,8.75384750450615,0.260333540764495
53.0551798076748,8.76104203518688,0.34450223390867
53.0551798076748,8.76823656586761,0.27918845823932
53.0551798076748,8.77543109654833,0.310542477727141
53.0551798076748,8.78262562722906,0.38178748500394
53.0551798076748,8.78982015790979,0.434563145791814
53.0551798076748,8.79701468859051,0.28472922485779
53.0551798076748,8.80420921927124,0.398866376519071
53.0551798076748,8.81140374995197,0.56071738822245
53.0551798076748,8.81859828063269,0.445963145750123
53.0551798076748,8.82579281131342,0.263240140415366
53.0551798076748,8.83298734199415,0.258213678608986
53.0551798076748,8.84018187267487,0.265588375019356
53.0551798076748,8.8473764033556,0.345551917938281
53.0551798076748,8.85457093403633,0.321833292258358
53.0551798076748,8.86176546471705,0.282799470409235
53.0551798076748,8.86895999539778,0.428756675154216
53.0551798076748,8.8761545260785,0.305557052445545
53.0551798076748,8.88334905675923,0.563384291334272
53.0551798076748,8.89054358743996,0.555377283062748
53.0551798076748,8.89773811812069,0.431872584271229
53.0551798076748,8.90493264880141,0.373904914804958
53.0551798076748,8.91212717948214,0.393024972847692
53.0551798076748,8.91932171016286,0.352353266334015
53.0551798076748,8.92651624084359,0.28823118303834
53.0551798076748,8.93371077152432,0.329088371886938
53.0551798076748,8.94090530220504,0.305573083782837
53.0551798076748,8.94809983288577,0.343484449145491
53.0551798076748,8.9552943635665,0.571536249836869
53.0551798076748,8.96248889424722,0.510270294256159
53.0551798076748,8.96968342492795,0.26571249625391
53.0597262944855,8.7106803204218,0.275599138254489
53.0597262944855,8.71787485110252,0.288538105559976
53.0597262944855,8.72506938178325,0.274267523067969
53.0597262944855,8.73226391246398,0.313920601453825
53.0597262944855,8.7394584431447,0.430776817319978
53.0597262944855,8.74665297382543,0.292420120572118
53.0597262944855,8.75384750450615,0.279824703731839
53.0597262944855,8.76104203518688,0.406812083433863
53.0597262944855,8.76823656586761,0.413075794453832
53.0597262944855,8.77543109654833,0.33377191288119
53.0597262944855,8.78262562722906,0.416184941842955
53.0597262944855,8.78982015790979,0.328170665950339
53.0597262944855,8.79701468859051,0.716960315190434
53.0597262944855,8.80420921927124,0.730670754119391
53.0597262944855,8.81140374995197,0.680471989159188
53.0597262944855,8.81859828063269,0.325427517749666
53.0597262944855,8.82579281131342,0.253606508634833
53.0597262944855,8.83298734199415,0.323370241121697
53.0597262944855,8.84018187267487,0.365166152754485
53.0597262944855,8.8473764033556,0.323230828692501
53.0597262944855,8.85457093403633,0.315580710293962
53.0597262944855,8.86176546471705,0.287355826610129
53.0597262944855,8.86895999539778,0.382769028810932
53.0597262944855,8.8761545260785,0.426916172547075
53.0597262944855,8.88334905675923,0.524238954672207
53.0597262944855,8.89054358743996,0.572856588303336
53.0597262944855,8.89773811812069,0.764498418584334
53.0597262944855,8.90493264880141,0.358977155057364
53.0597262944855,8.91212717948214,0.272805524607336
53.0597262944855,8.91932171016286,0.541982861001488
53.0597262944855,8.92651624084359,0.461832296094367
53.0597262944855,8.93371077152432,0.430585836945909
53.0597262944855,8.94090530220504,0.376833812372735
53.0597262944855,8.94809983288577,0.451321004585788
53.0597262944855,8.9552943635665,0.29232877690457
53.0597262944855,8.96248889424722,0.351769911856991
53.0642727812962,8.7106803204218,0.259199978263454
53.0642727812962,8.71787485110252,0.259199978263454
53.0642727812962,8.72506938178325,0.259199978263454
53.0642727812962,8.73226391246398,0.259199978263454
53.0642727812962,8.7394584431447,0.274417386839983
53.0642727812962,8.74665297382543,0.269026388051382
53.0642727812962,8.75384750450615,0.28459338340032
53.0642727812962,8.76104203518688,0.382022841944294
53.0642727812962,8.76823656586761,0.388794176136328
53.0642727812962,8.77543109654833,0.338637624445834
53.0642727812962,8.78262562722906,0.447286633788297
53.0642727812962,8.78982015790979,0.592944576723734
53.0642727812962,8.79701468859051,0.746371155423339
53.0642727812962,8.80420921927124,0.792408945368178
53.0642727812962,8.81140374995197,0.670608531800234
53.0642727812962,8.81859828063269,0.458026892352348
53.0642727812962,8.82579281131342,0.358629482038263
53.0642727812962,8.83298734199415,0.360775851280131
53.0642727812962,8.84018187267487,0.303032541908273
53.0642727812962,8.8473764033556,0.329484624797263
53.0642727812962,8.85457093403633,0.537871127477967
53.0642727812962,8.86176546471705,0.687440279054605
53.0642727812962,8.86895999539778,0.631999059469669
53.0642727812962,8.8761545260785,0.703783029780863
53.0642727812962,8.88334905675923,0.587565231431384
53.0642727812962,8.89054358743996,0.28050290805472
53.0642727812962,8.89773811812069,0.405777370006583
53.0642727812962,8.90493264880141,0.366435990794647
53.0642727812962,8.91212717948214,0.32406202124687
53.0642727812962,8.91932171016286,0.279405757816135
53.0642727812962,8.92651624084359,0.614314305235689
53.0642727812962,8.93371077152432,0.604507176625694
53.0642727812962,8.94090530220504,0.421853742403567
53.0642727812962,8.94809983288577,0.730203493551528
53.0642727812962,8.9552943635665,0.521581934207575
53.0642727812962,8.96248889424722,0.449697622434979
53.0688192681069,8.7106803204218,0.259199978263454
53.0688192681069,8.71787485110252,0.259199978263454
53.0688192681069,8.72506938178325,0.259199978263454
53.0688192681069,8.73226391246398,0.259199978263454
53.0688192681069,8.7394584431447,0.259199978263454
53.0688192681069,8.74665297382543,0.259199978263454
53.0688192681069,8.75384750450615,0.285234221849393
53.0688192681069,8.76104203518688,0.333594203618821
53.0688192681069,8.76823656586761,0.32690737830862
53.0688192681069,8.77543109654833,0.362410812266263
53.0688192681069,8.78262562722906,0.668980210864456
53.0688192681069,8.78982015790979,0.826880227480741
53.0688192681069,8.79701468859051,0.700131763843829
53.0688192681069,8.80420921927124,0.671695006130078
53.0688192681069,8.81140374995197,0.624514712935118
53.0688192681069,8.81859828063269,0.702693220811433
53.0688192681069,8.82579281131342,0.774547180383884
53.0688192681069,8.83298734199415,0.819684934449798
53.0688192681069,8.84018187267487,0.700554565748421
53.0688192681069,8.8473764033556,0.843958207622535
53.0688192681069,8.85457093403633,0.753723875628234
53.0688192681069,8.86176546471705,0.595121360428848
53.0688192681069,8.86895999539778,0.62224088134095
53.0688192681069,8.8761545260785,0.557644538673395
53.0688192681069,8.88334905675923,0.552319999895781
53.0688192681069,8.89054358743996,0.505588872273528
53.0688192681069,8.89773811812069,0.469757757153723
53.0688192681069,8.90493264880141,0.442975876150569
53.0688192681069,8.91212717948214,0.315525029160866
53.0688192681069,8.91932171016286,0.286905096296841
53.0688192681069,8.92651624084359,0.340756634260629
53.0688192681069,8.93371077152432,0.560359661641015
53.0688192681069,8.94090530220504,0.494504253660722
53.0688192681069,8.94809983288577,0.584445639873559
53.0688192681069,8.9552943635665,0.5299629771932
53.0688192681069,8.96248889424722,0.40677879665765
53.0733657549176,8.7106803204218,0.259199978263454
53.0733657549176,8.71787485110252,0.259199978263454
53.0733657549176,8.72506938178325,0.259199978263454
53.0733657549176,8.73226391246398,0.259199978263454
53.0733657549176,8.7394584431447,0.259199978263454
53.0733657549176,8.74665297382543,0.259199978263454
53.0733657549176,8.75384750450615,0.315033675843241
53.0733657549176,8.76104203518688,0.490222095888837
53.0733657549176,8.76823656586761,0.371025102226329
53.0733657549176,8.77543109654833,0.423865987582773
53.0733657549176,8.78262562722906,0.442056535800679
53.0733657549176,8.78982015790979,0.764270714965105
53.0733657549176,8.79701468859051,0.720726431469133
53.0733657549176,8.80420921927124,0.689348524653487
53.0733657549176,8.81140374995197,0.800001437448694
53.0733657549176,8.81859828063269,0.844543301471305
53.0733657549176,8.82579281131342,0.92035841989342
53.0733657549176,8.83298734199415,0.754095111751237
53.0733657549176,8.84018187267487,0.653116864203751
53.0733657549176,8.8473764033556,0.687511642086092
53.0733657549176,8.85457093403633,0.574530398443996
53.0733657549176,8.86176546471705,0.429870805027606
53.0733657549176,8.86895999539778,0.427342606622497
53.0733657549176,8.8761545260785,0.570531966841512
53.0733657549176,8.88334905675923,0.340116013432849
53.0733657549176,8.89054358743996,0.384078829188351
53.0733657549176,8.89773811812069,0.376417322307638
53.0733657549176,8.90493264880141,0.349712824336823
53.0733657549176,8.91212717948214,0.318258467346864
53.0733657549176,8.91932171016286,0.451658195528002
53.0733657549176,8.92651624084359,0.880288151614874
53.0733657549176,8.93371077152432,0.533336010501579
53.0733657549176,8.94090530220504,0.366311037964319
53.0733657549176,8.94809983288577,0.412881882740839
53.0733657549176,8.9552943635665,0.51388213501784
53.0733657549176,8.96248889424722,0.322415295493273
53.0779122417283,8.7106803204218,0.219064042912574
53.0779122417283,8.71787485110252,0.255943370334817
53.0779122417283,8.72506938178325,0.259199978263454
53.0779122417283,8.73226391246398,0.259199978263454
53.0779122417283,8.7394584431447,0.259199978263454
53.0779122417283,8.74665297382543,0.259199978263454
53.0779122417283,8.75384750450615,0.219281366485645
53.0779122417283,8.76104203518688,0.344833082431968
53.0779122417283,8.76823656586761,0.554069397299164
53.0779122417283,8.77543109654833,0.400124393663453
53.0779122417283,8.78262562722906,0.534282959047508
53.0779122417283,8.78982015790979,0.47075387843007
53.0779122417283,8.79701468859051,0.737845125155119
53.0779122417283,8.80420921927124,0.819407325022539
53.0779122417283,8.81140374995197,0.867922330106442
53.0779122417283,8.81859828063269,0.743436839328549
53.0779122417283,8.82579281131342,0.756538543732844
53.0779122417283,8.83298734199415,0.699028611593439
53.0779122417283,8.84018187267487,0.62158894986736
53.0779122417283,8.8473764033556,0.697906452600541
53.0779122417283,8.85457093403633,0.536530715418092
53.0779122417283,8.86176546471705,0.345226518082994
53.0779122417283,8.86895999539778,0.476674151068474
53.0779122417283,8.8761545260785,0.52233110568512
53.0779122417283,8.88334905675923,0.584288781201725
53.0779122417283,8.89054358743996,0.609566513536368
53.0779122417283,8.89773811812069,0.534313662644812
53.0779122417283,8.90493264880141,0.611809918543384
53.0779122417283,8.91212717948214,0.374878958709493
53.0779122417283,8.91932171016286,0.352721147572792
53.0779122417283,8.92651624084359,0.38651115868357
53.0779122417283,8.93371077152432,0.401000211792039
53.0779122417283,8.94090530220504,0.391655375164636
53.0779122417283,8.94809983288577,0.326603528205223
53.0779122417283,8.9552943635665,0.335936767924435
53.0779122417283,8.96248889424722,0.259199978263454
53.082458728539,8.70348578974107,0.306258746674129
53.082458728539,8.7106803204218,0.238034280518697
53.082458728539,8.71787485110252,0.3412208837744
53.082458728539,8.72506938178325,0.313713356968176
53.082458728539,8.73226391246398,0.259199978263454
53.082458728539,8.7394584431447,0.259199978263454
53.082458728539,8.74665297382543,0.259199978263454
53.082458728539,8.75384750450615,0.331666345686259
53.082458728539,8.76104203518688,0.446537347974148
53.082458728539,8.76823656586761,0.701597991085816
53.082458728539,8.77543109654833,0.520505213852914
53.082458728539,8.78262562722906,0.620512169741416
53.082458728539,8.78982015790979,0.910982500010173
53.082458728539,8.79701468859051,0.700141389286014
53.082458728539,8.80420921927124,0.646554436284893
53.082458728539,8.81140374995197,0.828440609499199
53.082458728539,8.81859828063269,0.855810467892591
53.082458728539,8.82579281131342,0.534293106189777
53.082458728539,8.83298734199415,0.565273128887661
53.082458728539,8.84018187267487,0.66183696504169
53.082458728539,8.8473764033556,0.491672463018233
53.082458728539,8.85457093403633,0.611244549133399
53.082458728539,8.86176546471705,0.469091212778392
53.082458728539,8.86895999539778,0.470997141361269
53.082458728539,8.8761545260785,0.584192267672348
53.082458728539,8.88334905675923,0.503616009701755
53.082458728539,8.89054358743996,0.566041373451663
53.082458728539,8.89773811812069,0.597663524905981
53.082458728539,8.90493264880141,0.514570543947074
53.082458728539,8.91212717948214,0.304949788942848
53.082458728539,8.91932171016286,0.278110382928813
53.082458728539,8.92651624084359,0.311360130480382
53.082458728539,8.93371077152432,0.430982314248769
53.082458728539,8.94090530220504,0.28343022818177
53.082458728539,8.94809983288577,0.317263111315431
53.082458728539,8.9552943635665,0.259199978263454
53.082458728539,8.96248889424722,0.259199978263454
53.0870052153496,8.67470766701816,0.339709656859139
53.0870052153496,8.68190219769889,0.259199978263454
53.0870052153496,8.68909672837962,0.259199978263454
53.0870052153496,8.69629125906034,0.24933312810051
53.0870052153496,8.70348578974107,0.261959431431052
53.0870052153496,8.7106803204218,0.199339552321972
53.0870052153496,8.71787485110252,0.239438436726922
53.0870052153496,8.72506938178325,0.280617572473728
53.0870052153496,8.73226391246398,0.259199978263454
53.0870052153496,8.7394584431447,0.259199978263454
53.0870052153496,8.74665297382543,0.28285402181965
53.0870052153496,8.75384750450615,0.399338361889075
53.0870052153496,8.76104203518688,0.511407178383719
53.0870052153496,8.76823656586761,0.416187588674257
53.0870052153496,8.77543109654833,0.594222243133025
53.0870052153496,8.78262562722906,0.589428250474792
53.0870052153496,8.78982015790979,0.490017437805408
53.0870052153496,8.79701468859051,0.552145530590831
53.0870052153496,8.80420921927124,0.524883258523183
53.0870052153496,8.81140374995197,0.698478132052038
53.0870052153496,8.81859828063269,0.560551769063116
53.0870052153496,8.82579281131342,0.401390636981705
53.0870052153496,8.83298734199415,0.528064066810336
53.0870052153496,8.84018187267487,0.51157030955395
53.0870052153496,8.8473764033556,0.443838794033022
53.0870052153496,8.85457093403633,0.555884957452958
53.0870052153496,8.86176546471705,0.532584264957734
53.0870052153496,8.86895999539778,0.380332279262245
53.0870052153496,8.8761545260785,0.54412339000482
53.0870052153496,8.88334905675923,0.568875916298606
53.0870052153496,8.89054358743996,0.58570735873527
53.0870052153496,8.89773811812069,0.548261830585361
53.0870052153496,8.90493264880141,0.481898634434598
53.0870052153496,8.91212717948214,0.363634035952513
53.0870052153496,8.91932171016286,0.249201805900629
53.0870052153496,8.92651624084359,0.378132572429902
53.0870052153496,8.93371077152432,0.390601488516763
53.0870052153496,8.94090530220504,0.314514470985664
53.0870052153496,8.94809983288577,0.252358760283276
53.0870052153496,8.9552943635665,0.259199978263454
53.0870052153496,8.96248889424722,0.259199978263454
53.0915517021603,8.66751313633744,0.303005754991378
53.0915517021603,8.67470766701816,0.289913384481761
53.0915517021603,8.68190219769889,0.259199978263454
53.0915517021603,8.68909672837962,0.259199978263454
53.0915517021603,8.69629125906034,0.284479001530434
53.0915517021603,8.70348578974107,0.413959361945669
53.0915517021603,8.7106803204218,0.244339407434837
53.0915517021603,8.71787485110252,0.259199978263454
53.0915517021603,8.72506938178325,0.259199978263454
53.0915517021603,8.73226391246398,0.259199978263454
53.0915517021603,8.7394584431447,0.259199978263454
53.0915517021603,8.74665297382543,0.468325902665153
53.0915517021603,8.75384750450615,0.508421723079293
53.0915517021603,8.76104203518688,0.41360670825207
53.0915517021603,8.76823656586761,0.396502263793091
53.0915517021603,8.77543109654833,0.70516378535485
53.0915517021603,8.78262562722906,0.661072847724861
53.0915517021603,8.78982015790979,0.73205856712338
53.0915517021603,8.79701468859051,0.415479746372002
53.0915517021603,8.80420921927124,0.803039487957925
53.0915517021603,8.81140374995197,0.828083202532706
53.0915517021603,8.81859828063269,0.511132982857924
53.0915517021603,8.82579281131342,0.402473817652539
53.0915517021603,8.83298734199415,0.322527152751154
53.0915517021603,8.84018187267487,0.403315624108145
53.0915517021603,8.8473764033556,0.638665750423802
53.0915517021603,8.85457093403633,0.644791599613099
53.0915517021603,8.86176546471705,0.478071567974047
53.0915517021603,8.86895999539778,0.435252680069369
53.0915517021603,8.8761545260785,0.352733972387071
53.0915517021603,8.88334905675923,0.445242276019181
53.0915517021603,8.89054358743996,0.314638533857923
53.0915517021603,8.89773811812069,0.377921524119778
53.0915517021603,8.90493264880141,0.295979479104395
53.0915517021603,8.91212717948214,0.301113415825033
53.0915517021603,8.91932171016286,0.259199978263454
53.0915517021603,8.92651624084359,0.300940022150768
53.0915517021603,8.93371077152432,0.508599872261652
53.0915517021603,8.94090530220504,0.417187868868798
53.0915517021603,8.94809983288577,0.279177492339423
53.0915517021603,8.9552943635665,0.259199978263454
53.0915517021603,8.96248889424722,0.259199978263454
53.0915517021603,8.96968342492795,0.259199978263454
53.096098188971,8.66751313633744,0.376569895631108
53.096098188971,8.67470766701816,0.259199978263454
53.096098188971,8.68190219769889,0.259199978263454
53.096098188971,8.68909672837962,0.259199978263454
53.096098188971,8.69629125906034,0.259199978263454
53.096098188971,8.70348578974107,0.259199978263454
53.096098188971,8.7106803204218,0.259199978263454
53.096098188971,8.71787485110252,0.259199978263454
53.096098188971,8.72506938178325,0.259199978263454
53.096098188971,8.73226391246398,0.259199978263454
53.096098188971,8.7394584431447,0.259199978263454
53.096098188971,8.74665297382543,0.281980610533485
53.096098188971,8.75384750450615,0.356856890844368
53.096098188971,8.76104203518688,0.449856957562863
53.096098188971,8.76823656586761,0.424405084785474
53.096098188971,8.77543109654833,0.678136730166835
53.096098188971,8.78262562722906,0.752820801767919
53.096098188971,8.78982015790979,0.751163080392577
53.096098188971,8.79701468859051,0.628151071528091
53.096098188971,8.80420921927124,0.662317708095392
53.096098188971,8.81140374995197,0.85676995953672
53.096098188971,8.81859828063269,0.441602297318461
53.096098188971,8.82579281131342,0.300984967448567
53.096098188971,8.83298734199415,0.243734365718748
53.096098188971,8.84018187267487,0.394891794418476
53.096098188971,8.8473764033556,0.559980420149582
53.096098188971,8.85457093403633,0.3883453641955
53.096098188971,8.86176546471705,0.297900391737984
53.096098188971,8.86895999539778,0.511632929949261
53.096098188971,8.8761545260785,0.470405004692426
53.096098188971,8.88334905675923,0.509211528680032
53.096098188971,8.89054358743996,0.359009483545499
53.096098188971,8.89773811812069,0.435151148288896
53.096098188971,8.90493264880141,0.354788970543935
53.096098188971,8.91212717948214,0.259199978263454
53.096098188971,8.91932171016286,0.260511533303242
53.096098188971,8.92651624084359,0.30492439807855
53.096098188971,8.93371077152432,0.357868847982887
53.096098188971,8.94090530220504,0.342597509049607
53.096098188971,8.94809983288577,0.259199978263454
53.096098188971,8.9552943635665,0.259199978263454
53.096098188971,8.96248889424722,0.259199978263454
53.096098188971,8.96968342492795,0.259199978263454
53.096098188971,8.97687795560868,0.259199978263454
53.1006446757817,8.67470766701816,0.259199978263454
53.1006446757817,8.68190219769889,0.259199978263454
53.1006446757817,8.68909672837962,0.259199978263454
53.1006446757817,8.69629125906034,0.259199978263454
53.1006446757817,8.70348578974107,0.259199978263454
53.1006446757817,8.7106803204218,0.259199978263454
53.1006446757817,8.71787485110252,0.259199978263454
53.1006446757817,8.72506938178325,0.259199978263454
53.1006446757817,8.73226391246398,0.259199978263454
53.1006446757817,8.7394584431447,0.259199978263454
53.1006446757817,8.74665297382543,0.344809336967182
53.1006446757817,8.75384750450615,0.300497288094451
53.1006446757817,8.76104203518688,0.347971461046011
53.1006446757817,8.76823656586761,0.363407847462334
53.1006446757817,8.77543109654833,0.600277104618373
53.1006446757817,8.78262562722906,0.667127550212358
53.1006446757817,8.78982015790979,0.733288669902496
53.1006446757817,8.79701468859051,0.561854013983816
53.1006446757817,8.80420921927124,0.651516197552368
53.1006446757817,8.81140374995197,0.523261252110519
53.1006446757817,8.81859828063269,0.571770133221692
53.1006446757817,8.82579281131342,0.458661480165154
53.1006446757817,8.83298734199415,0.307943045981738
53.1006446757817,8.84018187267487,0.310121725762239
53.1006446757817,8.8473764033556,0.383588203622959
53.1006446757817,8.85457093403633,0.379686528773694
53.1006446757817,8.86176546471705,0.492553276236862
53.1006446757817,8.86895999539778,0.431937674616555
53.1006446757817,8.8761545260785,0.596244763883808
53.1006446757817,8.88334905675923,0.579081192675639
53.1006446757817,8.89054358743996,0.574088031916537
53.1006446757817,8.89773811812069,0.432892151167776
53.1006446757817,8.90493264880141,0.379318644450834
53.1006446757817,8.91212717948214,0.381309164042792
53.1006446757817,8.91932171016286,0.378950204286129
53.1006446757817,8.92651624084359,0.301870638392982
53.1006446757817,8.93371077152432,0.260669234362184
53.1006446757817,8.94090530220504,0.265360213440918
53.1006446757817,8.94809983288577,0.259199978263454
53.1006446757817,8.9552943635665,0.259199978263454
53.1006446757817,8.96248889424722,0.259199978263454
53.1006446757817,8.96968342492795,0.259199978263454
53.1051911625924,8.66751313633744,0.259199978263454
53.1051911625924,8.67470766701816,0.259199978263454
53.1051911625924,8.68190219769889,0.259199978263454
53.1051911625924,8.68909672837962,0.259199978263454
53.1051911625924,8.69629125906034,0.259199978263454
53.1051911625924,8.70348578974107,0.259199978263454
53.1051911625924,8.7106803204218,0.259199978263454
53.1051911625924,8.71787485110252,0.259199978263454
53.1051911625924,8.72506938178325,0.259199978263454
53.1051911625924,8.73226391246398,0.259199978263454
53.1051911625924,8.7394584431447,0.259199978263454
53.1051911625924,8.74665297382543,0.327956336801114
53.1051911625924,8.75384750450615,0.308890156518953
53.1051911625924,8.76104203518688,0.283302919086194
53.1051911625924,8.76823656586761,0.317434504758965
53.1051911625924,8.77543109654833,0.507313358235673
53.1051911625924,8.78262562722906,0.694897562016839
53.1051911625924,8.78982015790979,0.568393209816661
53.1051911625924,8.79701468859051,0.334016697916338
53.1051911625924,8.80420921927124,0.542622076649429
53.1051911625924,8.81140374995197,0.360339856333954
53.1051911625924,8.81859828063269,0.324631142357736
53.1051911625924,8.82579281131342,0.316343056183749
53.1051911625924,8.83298734199415,0.359330357932582
53.1051911625924,8.84018187267487,0.394489086018005
53.1051911625924,8.8473764033556,0.713137945198683
53.1051911625924,8.85457093403633,0.629186398602036
53.1051911625924,8.86176546471705,0.62484881676842
53.1051911625924,8.86895999539778,0.545799364337582
53.1051911625924,8.8761545260785,0.431671236520164
53.1051911625924,8.88334905675923,0.355080196393492
53.1051911625924,8.89054358743996,0.385736330840609
53.1051911625924,8.89773811812069,0.367267219251188
53.1051911625924,8.90493264880141,0.321318035582202
53.1051911625924,8.91212717948214,0.366989436054615
53.1051911625924,8.91932171016286,0.283320363916515
53.1051911625924,8.92651624084359,0.245802538225167
53.1051911625924,8.93371077152432,0.259199978263454
53.1051911625924,8.94090530220504,0.259199978263454
53.1051911625924,8.94809983288577,0.259199978263454
53.1051911625924,8.9552943635665,0.259199978263454
53.1097376494031,8.66031860565671,0.259199978263454
53.1097376494031,8.66751313633744,0.259199978263454
53.1097376494031,8.67470766701816,0.259199978263454
53.1097376494031,8.68190219769889,0.259199978263454
53.1097376494031,8.68909672837962,0.259199978263454
53.1097376494031,8.69629125906034,0.259199978263454
53.1097376494031,8.70348578974107,0.275329625100694
53.1097376494031,8.7106803204218,0.292411723822829
53.1097376494031,8.71787485110252,0.259199978263454
53.1097376494031,8.72506938178325,0.259199978263454
53.1097376494031,8.73226391246398,0.259199978263454
53.1097376494031,8.7394584431447,0.261908272869245
53.1097376494031,8.74665297382543,0.443357330273878
53.1097376494031,8.75384750450615,0.418568482661747
53.1097376494031,8.76104203518688,0.428321646306362
53.1097376494031,8.76823656586761,0.465686715237947
53.1097376494031,8.77543109654833,0.412161143469712
53.1097376494031,8.78262562722906,0.270047697436446
53.1097376494031,8.78982015790979,0.318593735099974
53.1097376494031,8.79701468859051,0.350754310864819
53.1097376494031,8.80420921927124,0.344311737643195
53.1097376494031,8.81140374995197,0.275125622247771
53.1097376494031,8.81859828063269,0.339498475698184
53.1097376494031,8.82579281131342,0.306681009894094
53.1097376494031,8.83298734199415,0.260129827443562
53.1097376494031,8.84018187267487,0.266754417780613
53.1097376494031,8.8473764033556,0.47967642625704
53.1097376494031,8.85457093403633,0.527445320500383
53.1097376494031,8.86176546471705,0.43731874840269
53.1097376494031,8.86895999539778,0.303781651215835
53.1097376494031,8.8761545260785,0.324220144718009
53.1097376494031,8.88334905675923,0.3299091792009
53.1097376494031,8.89054358743996,0.473387775637444
53.1097376494031,8.89773811812069,0.402992503712521
53.1097376494031,8.90493264880141,0.364748664946363
53.1097376494031,8.91212717948214,0.259199978263454
53.1097376494031,8.91932171016286,0.259199978263454
53.1097376494031,8.92651624084359,0.259199978263454
53.1097376494031,8.93371077152432,0.259199978263454
53.1097376494031,8.94090530220504,0.259199978263454
53.1097376494031,8.94809983288577,0.259199978263454
53.1097376494031,8.9552943635665,0.259199978263454
53.1142841362138,8.66031860565671,0.259199978263454
53.1142841362138,8.66751313633744,0.259199978263454
53.1142841362138,8.67470766701816,0.259199978263454
53.1142841362138,8.68190219769889,0.259199978263454
53.1142841362138,8.68909672837962,0.259199978263454
53.1142841362138,8.69629125906034,0.254911782181338
53.1142841362138,8.70348578974107,0.275893432143332
53.1142841362138,8.7106803204218,0.269759702979856
53.1142841362138,8.71787485110252,0.259199978263454
53.1142841362138,8.72506938178325,0.259199978263454
53.1142841362138,8.73226391246398,0.259199978263454
53.1142841362138,8.7394584431447,0.272827889628861
53.1142841362138,8.74665297382543,0.332246112622035
53.1142841362138,8.75384750450615,0.656946635235659
53.1142841362138,8.76104203518688,0.758600602129928
53.1142841362138,8.76823656586761,0.572966106770706
53.1142841362138,8.77543109654833,0.403531058009115
53.1142841362138,8.78262562722906,0.288677520967634
53.1142841362138,8.78982015790979,0.260996205877643
53.1142841362138,8.79701468859051,0.283738452584351
53.1142841362138,8.80420921927124,0.500344859057309
53.1142841362138,8.81140374995197,0.40970708167513
53.1142841362138,8.81859828063269,0.315270703006965
53.1142841362138,8.82579281131342,0.267716929025125
53.1142841362138,8.83298734199415,0.336405556931699
53.1142841362138,8.84018187267487,0.263281682921231
53.1142841362138,8.8473764033556,0.429219040562756
53.1142841362138,8.85457093403633,0.419395598878644
53.1142841362138,8.86176546471705,0.279977973470298
53.1142841362138,8.86895999539778,0.259199978263454
53.1142841362138,8.8761545260785,0.250607177939177
53.1142841362138,8.88334905675923,0.256067069763391
53.1142841362138,8.89054358743996,0.570122190457919
53.1142841362138,8.89773811812069,0.461287752809923
53.1142841362138,8.90493264880141,0.304812070404642
53.1142841362138,8.91212717948214,0.259199978263454
53.1142841362138,8.91932171016286,0.259199978263454
53.1142841362138,8.92651624084359,0.259199978263454
53.1142841362138,8.93371077152432,0.259199978263454
53.1142841362138,8.94090530220504,0.259199978263454
53.1142841362138,8.94809983288577,0.259199978263454
53.1188306230245,8.65312407497598,0.259199978263454
53.1188306230245,8.66031860565671,0.263145124110841
53.1188306230245,8.66751313633744,0.275104410745283
53.1188306230245,8.67470766701816,0.259199978263454
53.1188306230245,8.68190219769889,0.259199978263454
53.1188306230245,8.68909672837962,0.259199978263454
53.1188306230245,8.69629125906034,0.247157969923663
53.1188306230245,8.70348578974107,0.264368338882739
53.1188306230245,8.7106803204218,0.259199978263454
53.1188306230245,8.71787485110252,0.259199978263454
53.1188306230245,8.72506938178325,0.259199978263454
53.1188306230245,8.73226391246398,0.259199978263454
53.1188306230245,8.7394584431447,0.264584901487727
53.1188306230245,8.74665297382543,0.29369775312264
53.1188306230245,8.75384750450615,0.692885949857479
53.1188306230245,8.76104203518688,0.598762332994141
53.1188306230245,8.76823656586761,0.521509881267039
53.1188306230245,8.77543109654833,0.250697016947331
53.1188306230245,8.78262562722906,0.365983429248004
53.1188306230245,8.78982015790979,0.338586288155561
53.1188306230245,8.79701468859051,0.338997211316502
53.1188306230245,8.80420921927124,0.259199978263454
53.1188306230245,8.81140374995197,0.259199978263454
53.1188306230245,8.81859828063269,0.351401733230446
53.1188306230245,8.82579281131342,0.267382528159684
53.1188306230245,8.83298734199415,0.264518468380889
53.1188306230245,8.84018187267487,0.259199978263454
53.1188306230245,8.8473764033556,0.259199978263454
53.1188306230245,8.85457093403633,0.259199978263454
53.1188306230245,8.86176546471705,0.259199978263454
53.1188306230245,8.86895999539778,0.259199978263454
53.1188306230245,8.8761545260785,0.259199978263454
53.1188306230245,8.88334905675923,0.259199978263454
53.1188306230245,8.89054358743996,0.344269610048556
53.1188306230245,8.89773811812069,0.355156221555165
53.1188306230245,8.90493264880141,0.415243138029881
53.1188306230245,8.91212717948214,0.297287136012213
53.1188306230245,8.91932171016286,0.259199978263454
53.1188306230245,8.92651624084359,0.259199978263454
53.1188306230245,8.93371077152432,0.259199978263454
53.1188306230245,8.94090530220504,0.259199978263454
53.1188306230245,8.94809983288577,0.259199978263454
53.1233771098352,8.65312407497598,0.259199978263454
53.1233771098352,8.66031860565671,0.297722291307654
53.1233771098352,8.66751313633744,0.404059079566268
53.1233771098352,8.67470766701816,0.259199978263454
53.1233771098352,8.68190219769889,0.259199978263454
53.1233771098352,8.68909672837962,0.259199978263454
53.1233771098352,8.69629125906034,0.259199978263454
53.1233771098352,8.70348578974107,0.259199978263454
53.1233771098352,8.7106803204218,0.260723266629078
53.1233771098352,8.71787485110252,0.322485463757709
53.1233771098352,8.72506938178325,0.259199978263454
53.1233771098352,8.73226391246398,0.259199978263454
53.1233771098352,8.7394584431447,0.320292081409337
53.1233771098352,8.74665297382543,0.457621478595422
53.1233771098352,8.75384750450615,0.545887955334909
53.1233771098352,8.76104203518688,0.441501865093921
53.1233771098352,8.76823656586761,0.356933841941282
53.1233771098352,8.77543109654833,0.259199978263454
53.1233771098352,8.78262562722906,0.259199978263454
53.1233771098352,8.78982015790979,0.259199978263454
53.1233771098352,8.79701468859051,0.259199978263454
53.1233771098352,8.80420921927124,0.259199978263454
53.1233771098352,8.81140374995197,0.259199978263454
53.1233771098352,8.81859828063269,0.259199978263454
53.1233771098352,8.82579281131342,0.259199978263454
53.1233771098352,8.83298734199415,0.259199978263454
53.1233771098352,8.84018187267487,0.259199978263454
53.1233771098352,8.8473764033556,0.259199978263454
53.1233771098352,8.85457093403633,0.259199978263454
53.1233771098352,8.86176546471705,0.259199978263454
53.1233771098352,8.86895999539778,0.255545429678874
53.1233771098352,8.8761545260785,0.245727678704622
53.1233771098352,8.88334905675923,0.259199978263454
53.1233771098352,8.89054358743996,0.350443754066152
53.1233771098352,8.89773811812069,0.616821239014939
53.1233771098352,8.90493264880141,0.509189058624708
53.1233771098352,8.91212717948214,0.266227975806539
53.1233771098352,8.91932171016286,0.246319227143439
53.1233771098352,8.92651624084359,0.259199978263454
53.1233771098352,8.93371077152432,0.259199978263454
53.1233771098352,8.94090530220504,0.259199978263454
53.1233771098352,8.94809983288577,0.259199978263454
53.1233771098352,8.9552943635665,0.259199978263454
53.1233771098352,8.96248889424722,0.259199978263454
53.1233771098352,8.96968342492795,0.259511244620379
53.1279235966459,8.64592954429526,0.259694417465032
53.1279235966459,8.65312407497598,0.307142045374663
53.1279235966459,8.66031860565671,0.262044950837703
53.1279235966459,8.66751313633744,0.259199978263454
53.1279235966459,8.67470766701816,0.259199978263454
53.1279235966459,8.68190219769889,0.259199978263454
53.1279235966459,8.68909672837962,0.259199978263454
53.1279235966459,8.69629125906034,0.259199978263454
53.1279235966459,8.70348578974107,0.258600819941888
53.1279235966459,8.7106803204218,0.248157664741227
53.1279235966459,8.71787485110252,0.298704886800004
53.1279235966459,8.72506938178325,0.259199978263454
53.1279235966459,8.73226391246398,0.270939526303247
53.1279235966459,8.7394584431447,0.491668941405421
53.1279235966459,8.74665297382543,0.413935345531662
53.1279235966459,8.75384750450615,0.415923346573572
53.1279235966459,8.76104203518688,0.440914148566508
53.1279235966459,8.76823656586761,0.301176166210388
53.1279235966459,8.77543109654833,0.341751729871282
53.1279235966459,8.78262562722906,0.289097318203609
53.1279235966459,8.78982015790979,0.2436406074227
53.1279235966459,8.79701468859051,0.259199978263454
53.1279235966459,8.80420921927124,0.259199978263454
53.1279235966459,8.81140374995197,0.259199978263454
53.1279235966459,8.81859828063269,0.259199978263454
53.1279235966459,8.82579281131342,0.25625029748997
53.1279235966459,8.83298734199415,0.241968270867343
53.1279235966459,8.84018187267487,0.259199978263454
53.1279235966459,8.8473764033556,0.259199978263454
53.1279235966459,8.85457093403633,0.259199978263454
53.1279235966459,8.86176546471705,0.36797813475964
53.1279235966459,8.86895999539778,0.265987353260935
53.1279235966459,8.8761545260785,0.2333165705907
53.1279235966459,8.88334905675923,0.343462751428224
53.1279235966459,8.89054358743996,0.316998418582703
53.1279235966459,8.89773811812069,0.402045964060611
53.1279235966459,8.90493264880141,0.598770597581079
53.1279235966459,8.91212717948214,0.357437425032269
53.1279235966459,8.91932171016286,0.259199978263454
53.1279235966459,8.92651624084359,0.259199978263454
53.1279235966459,8.93371077152432,0.259199978263454
53.1279235966459,8.94090530220504,0.259199978263454
53.1279235966459,8.94809983288577,0.259199978263454
53.1279235966459,8.9552943635665,0.259199978263454
53.1279235966459,8.96248889424722,0.259199978263454
53.1279235966459,8.96968342492795,0.259199978263454
53.1279235966459,8.97687795560868,0.284513735683754
53.1324700834565,8.63873501361453,0.259199978263454
53.1324700834565,8.64592954429526,0.259199978263454
53.1324700834565,8.65312407497598,0.268497426117248
53.1324700834565,8.66031860565671,0.259199978263454
53.1324700834565,8.66751313633744,0.259199978263454
53.1324700834565,8.67470766701816,0.259199978263454
53.1324700834565,8.68190219769889,0.259199978263454
53.1324700834565,8.68909672837962,0.259199978263454
53.1324700834565,8.69629125906034,0.259199978263454
53.1324700834565,8.70348578974107,0.259143849441931
53.1324700834565,8.7106803204218,0.258451734955171
53.1324700834565,8.71787485110252,0.236257888467942
53.1324700834565,8.72506938178325,0.364363854037428
53.1324700834565,8.73226391246398,0.739308756353639
53.1324700834565,8.7394584431447,0.686466142751415
53.1324700834565,8.74665297382543,0.282657239996713
53.1324700834565,8.75384750450615,0.269019076894272
53.1324700834565,8.76104203518688,0.309417959682842
53.1324700834565,8.76823656586761,0.293476857839921
53.1324700834565,8.77543109654833,0.262399277811722
53.1324700834565,8.78262562722906,0.259199978263454
53.1324700834565,8.78982015790979,0.259199978263454
53.1324700834565,8.79701468859051,0.259199978263454
53.1324700834565,8.80420921927124,0.259199978263454
53.1324700834565,8.81140374995197,0.259199978263454
53.1324700834565,8.81859828063269,0.259199978263454
53.1324700834565,8.82579281131342,0.257677534284279
53.1324700834565,8.83298734199415,0.244465028884351
53.1324700834565,8.84018187267487,0.259199978263454
53.1324700834565,8.8473764033556,0.259199978263454
53.1324700834565,8.85457093403633,0.26706749518986
53.1324700834565,8.86176546471705,0.277974526231348
53.1324700834565,8.86895999539778,0.263072918753713
53.1324700834565,8.8761545260785,0.259199978263454
53.1324700834565,8.88334905675923,0.307101180441064
53.1324700834565,8.89054358743996,0.307839839322039
53.1324700834565,8.89773811812069,0.295429996910585
53.1324700834565,8.90493264880141,0.312340615945389
53.1324700834565,8.91212717948214,0.259199978263454
53.1324700834565,8.91932171016286,0.259199978263454
53.1324700834565,8.92651624084359,0.259199978263454
53.1324700834565,8.93371077152432,0.259199978263454
53.1324700834565,8.94090530220504,0.259199978263454
53.1324700834565,8.94809983288577,0.259199978263454
53.1324700834565,8.9552943635665,0.259199978263454
53.1324700834565,8.96248889424722,0.259199978263454
53.1324700834565,8.96968342492795,0.259199978263454
53.1370165702672,8.63873501361453,0.259199978263454
53.1370165702672,8.64592954429526,0.259199978263454
53.1370165702672,8.65312407497598,0.259199978263454
53.1370165702672,8.66031860565671,0.259199978263454
53.1370165702672,8.66751313633744,0.259199978263454
53.1370165702672,8.67470766701816,0.259199978263454
53.1370165702672,8.68190219769889,0.290350147856134
53.1370165702672,8.68909672837962,0.259199978263454
53.1370165702672,8.69629125906034,0.259199978263454
53.1370165702672,8.70348578974107,0.274796017090317
53.1370165702672,8.7106803204218,0.263417244480538
53.1370165702672,8.71787485110252,0.21996551333166
53.1370165702672,8.72506938178325,0.3180326653221
53.1370165702672,8.73226391246398,0.434663617267965
53.1370165702672,8.7394584431447,0.499710049518541
53.1370165702672,8.74665297382543,0.442351524610631
53.1370165702672,8.75384750450615,0.248518180043826
53.1370165702672,8.76104203518688,0.259199978263454
53.1370165702672,8.76823656586761,0.259199978263454
53.1370165702672,8.77543109654833,0.259199978263454
53.1370165702672,8.78262562722906,0.259199978263454
53.1370165702672,8.78982015790979,0.259199978263454
53.1370165702672,8.79701468859051,0.259199978263454
53.1370165702672,8.80420921927124,0.259199978263454
53.1370165702672,8.81140374995197,0.259199978263454
53.1370165702672,8.81859828063269,0.259199978263454
53.1370165702672,8.82579281131342,0.259199978263454
53.1370165702672,8.83298734199415,0.259199978263454
53.1370165702672,8.84018187267487,0.259199978263454
53.1370165702672,8.8473764033556,0.259199978263454
53.1370165702672,8.85457093403633,0.279581667095438
53.1370165702672,8.86176546471705,0.293747325480079
53.1370165702672,8.90493264880141,0.272106134412442
53.1370165702672,8.91932171016286,0.259199978263454
53.1370165702672,8.92651624084359,0.245882486257768
53.1370165702672,8.93371077152432,0.259199978263454
53.1370165702672,8.94090530220504,0.259199978263454
53.1370165702672,8.94809983288577,0.259199978263454
53.1370165702672,8.9552943635665,0.259199978263454
53.1370165702672,8.96248889424722,0.259199978263454
53.1415630570779,8.6315404829338,0.259199978263454
53.1415630570779,8.63873501361453,0.259199978263454
53.1415630570779,8.64592954429526,0.259199978263454
53.1415630570779,8.65312407497598,0.259199978263454
53.1415630570779,8.66031860565671,0.259199978263454
53.1415630570779,8.66751313633744,0.259199978263454
53.1415630570779,8.67470766701816,0.259199978263454
53.1415630570779,8.68190219769889,0.289386625195096
53.1415630570779,8.68909672837962,0.259199978263454
53.1415630570779,8.69629125906034,0.259199978263454
53.1415630570779,8.70348578974107,0.233757375129254
53.1415630570779,8.7106803204218,0.284758771317023
53.1415630570779,8.71787485110252,0.341085803653755
53.1415630570779,8.72506938178325,0.340060882791818
53.1415630570779,8.73226391246398,0.273391533171944
53.1415630570779,8.7394584431447,0.254974849175838
53.1415630570779,8.74665297382543,0.272999113749008
53.1415630570779,8.75384750450615,0.250312920662371
53.1415630570779,8.76104203518688,0.259199978263454
53.1415630570779,8.76823656586761,0.259199978263454
53.1415630570779,8.77543109654833,0.259199978263454
53.1415630570779,8.78262562722906,0.259199978263454
53.1415630570779,8.78982015790979,0.259199978263454
53.1415630570779,8.79701468859051,0.259199978263454
53.1415630570779,8.80420921927124,0.259199978263454
53.1415630570779,8.81140374995197,0.259199978263454
53.1415630570779,8.81859828063269,0.259199978263454
53.1415630570779,8.82579281131342,0.259199978263454
53.1415630570779,8.83298734199415,0.259199978263454
53.1415630570779,8.84018187267487,0.260920872813419
53.1415630570779,8.8473764033556,0.294856470574533
53.1415630570779,8.85457093403633,0.259199978263454
53.1415630570779,8.92651624084359,0.244573635917981
53.1415630570779,8.93371077152432,0.297102780815396
53.1415630570779,8.94090530220504,0.259199978263454
53.1415630570779,8.94809983288577,0.259199978263454
53.1415630570779,8.9552943635665,0.259199978263454
53.1461095438886,8.6315404829338,0.259199978263454
53.1461095438886,8.63873501361453,0.259199978263454
53.1461095438886,8.64592954429526,0.259199978263454
53.1461095438886,8.65312407497598,0.259199978263454
53.1461095438886,8.66031860565671,0.259199978263454
53.1461095438886,8.66751313633744,0.259199978263454
53.1461095438886,8.67470766701816,0.259199978263454
53.1461095438886,8.68190219769889,0.259199978263454
53.1461095438886,8.68909672837962,0.259199978263454
53.1461095438886,8.69629125906034,0.252665473373993
53.1461095438886,8.70348578974107,0.283593824385974
53.1461095438886,8.7106803204218,0.321146842456092
53.1461095438886,8.71787485110252,0.308038917045309
53.1461095438886,8.72506938178325,0.246378351775045
53.1461095438886,8.73226391246398,0.259199978263454
53.1461095438886,8.7394584431447,0.259199978263454
53.1461095438886,8.74665297382543,0.259199978263454
53.1461095438886,8.75384750450615,0.259199978263454
53.1461095438886,8.76104203518688,0.259199978263454
53.1461095438886,8.76823656586761,0.259199978263454
53.1461095438886,8.77543109654833,0.259199978263454
53.1461095438886,8.78262562722906,0.259199978263454
53.1461095438886,8.78982015790979,0.259199978263454
53.1461095438886,8.79701468859051,0.259199978263454
53.1461095438886,8.80420921927124,0.259199978263454
53.1461095438886,8.81140374995197,0.259199978263454
53.1461095438886,8.81859828063269,0.259199978263454
53.1461095438886,8.82579281131342,0.259199978263454
53.1461095438886,8.83298734199415,0.259199978263454
53.1461095438886,8.84018187267487,0.261814334539102
53.1461095438886,8.92651624084359,0.259199978263454
53.1461095438886,8.93371077152432,0.269973671648443
53.1461095438886,8.94090530220504,0.259199978263454
53.1461095438886,8.94809983288577,0.259199978263454
53.1461095438886,8.9552943635665,0.259199978263454
53.1506560306993,8.6315404829338,0.259199978263454
53.1506560306993,8.63873501361453,0.259199978263454
53.1506560306993,8.64592954429526,0.259199978263454
53.1506560306993,8.65312407497598,0.259199978263454
53.1506560306993,8.66031860565671,0.259199978263454
53.1506560306993,8.66751313633744,0.259199978263454
53.1506560306993,8.67470766701816,0.259199978263454
53.1506560306993,8.68190219769889,0.259199978263454
53.1506560306993,8.68909672837962,0.250253051508993
53.1506560306993,8.69629125906034,0.233270435591669
53.1506560306993,8.70348578974107,0.284317574689846
53.1506560306993,8.7106803204218,0.428095469909918
53.1506560306993,8.71787485110252,0.379324898578822
53.1506560306993,8.72506938178325,0.258466869232114
53.1506560306993,8.73226391246398,0.259199978263454
53.1506560306993,8.7394584431447,0.259199978263454
53.1506560306993,8.74665297382543,0.259199978263454
53.1506560306993,8.75384750450615,0.259199978263454
53.1506560306993,8.76104203518688,0.259199978263454
53.1506560306993,8.76823656586761,0.259199978263454
53.1506560306993,8.77543109654833,0.259199978263454
53.1506560306993,8.78262562722906,0.315867946855443
53.1506560306993,8.78982015790979,0.267236107365184
53.1506560306993,8.79701468859051,0.259199978263454
53.1506560306993,8.80420921927124,0.259199978263454
53.1506560306993,8.81140374995197,0.259199978263454
53.1506560306993,8.81859828063269,0.259199978263454
53.1506560306993,8.82579281131342,0.259199978263454
53.1506560306993,8.83298734199415,0.259199978263454
53.1506560306993,8.84018187267487,0.270010750196115
53.1506560306993,8.94090530220504,0.259199978263454
53.15520251751,8.6315404829338,0.259199978263454
53.15520251751,8.63873501361453,0.259199978263454
53.15520251751,8.64592954429526,0.259199978263454
53.15520251751,8.65312407497598,0.243486725127928
53.15520251751,8.66031860565671,0.261525673983827
53.15520251751,8.66751313633744,0.261657310906361
53.15520251751,8.67470766701816,0.259199978263454
53.15520251751,8.68190219769889,0.259199978263454
53.15520251751,8.68909672837962,0.302830875937726
53.15520251751,8.69629125906034,0.40446980006308
53.15520251751,8.70348578974107,0.458290496872735
53.15520251751,8.7106803204218,0.418097018002812
53.15520251751,8.71787485110252,0.45921364323799
53.15520251751,8.72506938178325,0.254356490798529
53.15520251751,8.73226391246398,0.259199978263454
53.15520251751,8.7394584431447,0.259199978263454
53.15520251751,8.74665297382543,0.259199978263454
53.15520251751,8.75384750450615,0.259199978263454
53.15520251751,8.76104203518688,0.259199978263454
53.15520251751,8.76823656586761,0.259199978263454
53.15520251751,8.77543109654833,0.262138543050505
53.15520251751,8.78262562722906,0.25703266580502
53.15520251751,8.78982015790979,0.259199978263454
53.15520251751,8.79701468859051,0.259199978263454
53.15520251751,8.80420921927124,0.259199978263454
53.15520251751,8.81140374995197,0.259199978263454
53.15520251751,8.81859828063269,0.259199978263454
53.15520251751,8.82579281131342,0.259199978263454
53.15520251751,8.83298734199415,0.276378980086995
53.15520251751,8.84018187267487,0.310142887004721
53.1597490043207,8.62434595225308,0.259199978263454
53.1597490043207,8.6315404829338,0.253473200102831
53.1597490043207,8.63873501361453,0.368479969612233
53.1597490043207,8.64592954429526,0.294055959484934
53.1597490043207,8.65312407497598,0.270816340601503
53.1597490043207,8.66031860565671,0.351879064122657
53.1597490043207,8.66751313633744,0.395332563978217
53.1597490043207,8.67470766701816,0.339277537838038
53.1597490043207,8.68190219769889,0.345169794281101
53.1597490043207,8.68909672837962,0.317719111253983
53.1597490043207,8.69629125906034,0.401321527603245
53.1597490043207,8.70348578974107,0.305727154547207
53.1597490043207,8.7106803204218,0.331097034317392
53.1597490043207,8.71787485110252,0.268349988979838
53.1597490043207,8.72506938178325,0.259199978263454
53.1597490043207,8.73226391246398,0.259199978263454
53.1597490043207,8.7394584431447,0.260478870421499
53.1597490043207,8.74665297382543,0.259199978263454
53.1597490043207,8.75384750450615,0.259199978263454
53.1597490043207,8.76104203518688,0.259199978263454
53.1597490043207,8.76823656586761,0.25923610365858
53.1597490043207,8.78262562722906,0.251060539661278
53.1597490043207,8.78982015790979,0.266665263420524
53.1597490043207,8.79701468859051,0.30542404582238
53.1597490043207,8.80420921927124,0.259199978263454
53.1597490043207,8.81140374995197,0.259199978263454
53.1597490043207,8.81859828063269,0.259199978263454
53.1597490043207,8.82579281131342,0.259199978263454
53.1642954911314,8.62434595225308,0.346787671176443
53.1642954911314,8.6315404829338,0.563485989759665
53.1642954911314,8.63873501361453,0.473679775881742
53.1642954911314,8.64592954429526,0.388036029675741
53.1642954911314,8.65312407497598,0.352977631853341
53.1642954911314,8.66031860565671,0.310390394082218
53.1642954911314,8.66751313633744,0.454298736806481
53.1642954911314,8.67470766701816,0.34893667316877
53.1642954911314,8.68190219769889,0.358272268381242
53.1642954911314,8.68909672837962,0.389040183537903
53.1642954911314,8.69629125906034,0.344265632289045
53.1642954911314,8.70348578974107,0.313685623629957
53.1642954911314,8.7106803204218,0.276359429429464
53.1642954911314,8.71787485110252,0.259199978263454
53.1642954911314,8.72506938178325,0.259199978263454
53.1642954911314,8.73226391246398,0.259518275905088
53.1642954911314,8.7394584431447,0.27077149490178
53.1642954911314,8.74665297382543,0.260311499835361
53.1642954911314,8.76104203518688,0.259199978263454
53.1688419779421,8.61715142157235,0.425673289613899
53.1688419779421,8.62434595225308,0.942135642887224
53.1688419779421,8.6315404829338,0.654443745973603
53.1688419779421,8.63873501361453,0.440163245792017
53.1688419779421,8.64592954429526,0.520589933074961
53.1688419779421,8.65312407497598,0.595047765599402
53.1688419779421,8.66031860565671,0.417101411751107
53.1688419779421,8.66751313633744,0.355779407250104
53.1688419779421,8.67470766701816,0.359828015698759
53.1688419779421,8.68190219769889,0.294934328238468
53.1688419779421,8.68909672837962,0.62281431319255
53.1688419779421,8.69629125906034,0.535311160047033
53.1688419779421,8.70348578974107,0.529186926775109
53.1688419779421,8.7106803204218,0.322950312749031
53.1688419779421,8.71787485110252,0.294806916735255
53.1688419779421,8.72506938178325,0.276828572168333
53.1688419779421,8.73226391246398,0.259199978263454
53.1688419779421,8.7394584431447,0.259199978263454
53.1733884647527,8.58837329884945,0.268143245085565
53.1733884647527,8.59556782953017,0.213997842614457
53.1733884647527,8.6027623602109,0.321965930262407
53.1733884647527,8.60995689089162,0.578213133201303
53.1733884647527,8.61715142157235,0.81487570937181
53.1733884647527,8.62434595225308,0.609988538204191
53.1733884647527,8.6315404829338,0.372245496135991
53.1733884647527,8.63873501361453,0.216045060846569
53.1733884647527,8.64592954429526,0.391070912569162
53.1733884647527,8.65312407497598,0.256045652365632
53.1733884647527,8.66031860565671,0.427465364146732
53.1733884647527,8.66751313633744,0.308265535534226
53.1733884647527,8.67470766701816,0.507415873981948
53.1733884647527,8.68190219769889,0.475217862003011
53.1733884647527,8.68909672837962,0.454549236472373
53.1733884647527,8.69629125906034,0.385933446671117
53.1733884647527,8.70348578974107,0.38179643507515
53.1733884647527,8.7106803204218,0.405931121693405
53.1733884647527,8.71787485110252,0.411471351994888
53.1733884647527,8.72506938178325,0.350838064300676
53.1733884647527,8.73226391246398,0.305872718629901
53.1779349515634,8.57398423748799,0.296266766297906
53.1779349515634,8.58117876816872,0.260051710832966
53.1779349515634,8.58837329884945,0.403619980871109
53.1779349515634,8.59556782953017,0.408704406530649
53.1779349515634,8.6027623602109,0.508494674486978
53.1779349515634,8.60995689089162,0.527724779727892
53.1779349515634,8.61715142157235,0.524659124758735
53.1779349515634,8.62434595225308,0.440899511748076
53.1779349515634,8.6315404829338,0.407495107237516
53.1779349515634,8.63873501361453,0.30717793702818
53.1779349515634,8.64592954429526,0.298284365109552
53.1779349515634,8.65312407497598,0.305588508611251
53.1779349515634,8.67470766701816,0.415030084655276
53.1779349515634,8.68190219769889,0.412420853744896
53.1779349515634,8.68909672837962,0.430651264352558
53.1779349515634,8.69629125906034,0.371574215571204
53.1779349515634,8.7106803204218,0.345965502362108
53.1779349515634,8.71787485110252,0.499509968699373
53.1779349515634,8.72506938178325,0.411581828331476
53.1824814383741,8.55959517612654,0.47020962545131
53.1824814383741,8.56678970680727,0.473035886830403
53.1824814383741,8.57398423748799,0.450879545007168
53.1824814383741,8.58117876816872,0.263543563137593
53.1824814383741,8.58837329884945,0.352412972596342
53.1824814383741,8.59556782953017,0.321034986474493
53.1824814383741,8.6027623602109,0.474144105720935
53.1824814383741,8.60995689089162,0.599401471653159
53.1824814383741,8.61715142157235,0.451278618340384
53.1824814383741,8.62434595225308,0.436072273957323
53.1824814383741,8.6315404829338,0.282978324116354
53.1824814383741,8.63873501361453,0.359520286002859
53.1824814383741,8.64592954429526,0.367509099523486
53.1824814383741,8.65312407497598,0.305758607763074
53.1824814383741,8.69629125906034,0.371477891015676
53.1870279251848,8.53801158408436,0.259224058275988
53.1870279251848,8.54520611476508,0.400301260079249
53.1870279251848,8.55240064544581,0.434586010851988
53.1870279251848,8.55959517612654,0.365773744181188
53.1870279251848,8.56678970680727,0.346060112687722
53.1870279251848,8.57398423748799,0.420102065827705
53.1870279251848,8.58117876816872,0.207733028576023
53.1870279251848,8.58837329884945,0.229938034979976
53.1870279251848,8.60995689089162,0.421478304030783
53.1870279251848,8.61715142157235,0.324794216658041
53.1870279251848,8.62434595225308,0.259891818554954
53.1870279251848,8.6315404829338,0.448688360151786
53.1870279251848,8.63873501361453,0.40008565420568
53.1870279251848,8.64592954429526,0.471710139992865
53.1870279251848,8.65312407497598,0.366798000678172
53.1915744119955,8.53081705340363,0.312900554355156
53.1915744119955,8.53801158408436,0.423206429505298
53.1915744119955,8.54520611476508,0.363175323793517
53.1915744119955,8.55240064544581,0.28767845923617
53.1915744119955,8.55959517612654,0.286942495666563
53.1915744119955,8.56678970680727,0.333386155670797
53.1915744119955,8.57398423748799,0.327277798818969
53.1915744119955,8.58117876816872,0.274132309198478
53.1915744119955,8.60995689089162,0.281435130481486
53.1915744119955,8.61715142157235,0.318358878001217
53.1915744119955,8.62434595225308,0.294882443103838
53.1915744119955,8.6315404829338,0.353439537348805
53.1961208988062,8.52362252272291,0.276110857103643
53.1961208988062,8.53081705340363,0.343165649167102
53.1961208988062,8.53801158408436,0.347095968140959
53.1961208988062,8.54520611476508,0.303613607105572
53.1961208988062,8.55240064544581,0.299552712847954
53.1961208988062,8.55959517612654,0.442601344463715
53.1961208988062,8.56678970680727,0.319884121179769
53.1961208988062,8.57398423748799,0.430323644416043
53.1961208988062,8.58117876816872,0.217772316737367
53.1961208988062,8.62434595225308,0.259199978263454
53.2006673856169,8.50923346136145,0.259199978263454
53.2006673856169,8.51642799204218,0.27348171277547
53.2006673856169,8.52362252272291,0.377635511564546
53.2006673856169,8.53081705340363,0.298148160077031
53.2006673856169,8.53801158408436,0.274751054026618
53.2006673856169,8.54520611476508,0.375413173489013
53.2006673856169,8.55240064544581,0.26827310754605
53.2006673856169,8.55959517612654,0.324610196894359
53.2006673856169,8.56678970680727,0.333238878604407
53.2006673856169,8.57398423748799,0.426382087770281
53.2006673856169,8.58117876816872,0.279230907179634
53.2052138724276,8.50203893068073,0.259199978263454
53.2052138724276,8.50923346136145,0.262312669699687
53.2052138724276,8.51642799204218,0.317033058078728
53.2052138724276,8.52362252272291,0.510995040430076
53.2052138724276,8.53081705340363,0.305583709724442
53.2052138724276,8.53801158408436,0.259199978263454
53.2052138724276,8.54520611476508,0.268148343427346
53.2052138724276,8.55240064544581,0.259199978263454
53.2052138724276,8.55959517612654,0.282208027013347
53.2052138724276,8.56678970680727,0.298797170474919
53.2052138724276,8.57398423748799,0.426372273423499
53.2052138724276,8.58117876816872,0.408505826125918
53.2052138724276,8.58837329884945,0.298454654891745
53.2097603592383,8.50203893068073,0.259199978263454
53.2097603592383,8.50923346136145,0.288441937838603
53.2097603592383,8.51642799204218,0.384117423573072
53.2097603592383,8.52362252272291,0.256292361371101
53.2097603592383,8.53081705340363,0.259199978263454
53.2097603592383,8.53801158408436,0.259199978263454
53.2097603592383,8.54520611476508,0.259199978263454
53.2097603592383,8.55959517612654,0.259199978263454
53.2097603592383,8.56678970680727,0.261375151876134
53.2097603592383,8.57398423748799,0.413810098331615
53.2097603592383,8.58117876816872,0.32906811204839
53.2097603592383,8.58837329884945,0.256089530471296
53.2097603592383,8.59556782953017,0.336472360785185
53.2143068460489,8.4948444,0.259199978263454
53.2143068460489,8.50203893068073,0.285833674366944
53.2143068460489,8.50923346136145,0.384793969807771
53.2143068460489,8.51642799204218,0.351685164135319
53.2143068460489,8.52362252272291,0.270547882277264
53.2143068460489,8.53081705340363,0.259199978263454
53.2143068460489,8.53801158408436,0.259199978263454
53.2143068460489,8.58117876816872,0.286358879669661
53.2143068460489,8.58837329884945,0.268858337902811
53.2188533328596,8.4948444,0.26308637240635
53.2188533328596,8.50203893068073,0.325404928623115
53.2188533328596,8.50923346136145,0.443594245508261
53.2188533328596,8.51642799204218,0.262040126131535
53.2188533328596,8.52362252272291,0.259199978263454
53.2233998196703,8.4948444,0.262202470680856
53.2233998196703,8.50203893068073,0.259199978263454
53.2233998196703,8.50923346136145,0.259199978263454
53.2233998196703,8.51642799204218,0.259199978263454
53.227946306481,8.50203893068073,0.259199978263454
53.227946306481,8.51642799204218,0.259199978263454
53.5507468700399,8.56678970680727,0.250612209933964
53.5552933568506,8.55959517612654,0.329098670431259
53.5598398436613,8.55240064544581,0.320265128646812
53.5598398436613,8.55959517612654,0.284830699241771
53.564386330472,8.55240064544581,0.272832952616095
53.564386330472,8.55959517612654,0.259199978263454
53.564386330472,8.56678970680727,0.245699472807476
53.5689328172827,8.54520611476508,0.269252191009357
53.5689328172827,8.55240064544581,0.328046260351776
53.5689328172827,8.55959517612654,0.383417123385536
53.5689328172827,8.56678970680727,0.319620036651104
53.5734793040934,8.54520611476508,0.264094125186064
53.5734793040934,8.55240064544581,0.318835261834492
53.5734793040934,8.55959517612654,0.259199978263454
53.5734793040934,8.56678970680727,0.259199978263454
53.5780257909041,8.53801158408436,0.259199978263454
53.5780257909041,8.54520611476508,0.229801637202023
53.5780257909041,8.55240064544581,0.236790617772129
53.5780257909041,8.55959517612654,0.259199978263454
53.5780257909041,8.56678970680727,0.259199978263454
53.5780257909041,8.57398423748799,0.259199978263454
53.5825722777148,8.53801158408436,0.259199978263454
53.5825722777148,8.54520611476508,0.2421672670436
53.5825722777148,8.55240064544581,0.248534008780919
53.5825722777148,8.56678970680727,0.259199978263454
53.5871187645254,8.53081705340363,0.259199978263454
53.5871187645254,8.53801158408436,0.259199978263454
53.5916652513361,8.52362252272291,0.259199978263454
53.5916652513361,8.53081705340363,0.259199978263454
53.5916652513361,8.53801158408436,0.172734424356233
