nan,nan,2.142763297073275175e-01
1.058828223367659760e+01,4.960877201800326475e+01,2.257317867011737755e-01
1.034019873355049590e+01,4.959188591640012334e+01,2.368694374851672835e-01
1.029123010493356638e+01,4.955751214407217020e+01,2.483954473542057673e-01
1.026039170311357651e+01,4.959522290899279540e+01,2.604822807455117184e-01
1.042013487292929597e+01,4.968748750148252924e+01,2.716062050937331773e-01
1.065602436989445678e+01,4.961949349912230645e+01,2.831964451744260480e-01
1.060297402318848725e+01,4.973213905125417966e+01,2.948933721688258291e-01
1.026696719291349247e+01,4.957527136622636732e+01,3.060436127831762110e-01
1.063381334200572681e+01,4.957625969712427150e+01,3.171432106831135189e-01
1.053689594542692021e+01,4.955639272573711906e+01,3.286569613552235980e-01
