nan,nan,7.344059526248085390e-02
1.222665198000091102e+01,5.080049716128028336e+01,8.509313290599658519e-02
1.199421347356721590e+01,5.094892421158319706e+01,9.694539381605402073e-02
1.196241560003005411e+01,5.061499956142269241e+01,1.087203855746668862e-01
1.189847149482390698e+01,5.069999441609446222e+01,1.224941563460741761e-01
1.205629802741529666e+01,5.076980570879210575e+01,1.347153768536147878e-01
1.224254467209357422e+01,5.079292145394128966e+01,1.468517547450908234e-01
1.212183027363974830e+01,5.078826136473523434e+01,1.586528590112617210e-01
1.195263928102518136e+01,5.063565105428673974e+01,1.711525163552277129e-01
1.193213640523656416e+01,5.065524919415298655e+01,1.836154572650163797e-01
1.223969153831362888e+01,5.077312437194946426e+01,1.960740279691122745e-01
