nan,nan,3.208124657179135808e-02
8.222902114755752834e+00,4.961750249710790683e+01,4.469704145859751399e-02
8.113915386717927447e+00,4.984172572564627046e+01,5.798970762209793711e-02
8.339798768875715140e+00,4.976781715433003228e+01,6.973714960035802546e-02
8.193844488030833872e+00,4.978468004513018030e+01,8.418765722458504408e-02
8.331588392558449740e+00,4.969613198723548919e+01,9.581643527617636491e-02
8.021570417582145396e+00,4.983614371983565405e+01,1.087463181386244537e-01
8.119216670505101874e+00,4.972262950667629156e+01,1.202455593055834215e-01
8.241509186694532474e+00,4.960610407907928021e+01,1.339511676440837407e-01
8.244409479935017160e+00,4.970275310073559183e+01,1.467909296613092718e-01
8.215137277735601984e+00,4.973986634690990627e+01,1.598190508466784676e-01
