nan,nan,7.440282118379207277e-02
1.134817937927846820e+01,5.094779094091385474e+01,8.707956931989199734e-02
1.133701683442556707e+01,5.101291836376486799e+01,9.943747934809027411e-02
1.129530854606402990e+01,5.093051163399999837e+01,1.116953350042431958e-01
1.136246453960702851e+01,5.096782181779868637e+01,1.239507898931120067e-01
1.127956818145839435e+01,5.094049822292109297e+01,1.363484214218865509e-01
1.138495262575340305e+01,5.098194902566255848e+01,1.479699299679651525e-01
1.132465260195244738e+01,5.096159625903882073e+01,1.593628354278157355e-01
1.127902776166216547e+01,5.098361391203748383e+01,1.711558252913374656e-01
1.130109114253541946e+01,5.095212447444594517e+01,1.838896753750641488e-01
1.136717830943087115e+01,5.099192755681715283e+01,1.951346520344396374e-01
