52.0612578,8.63097723246396,0.259199978263454
52.0612578,8.63817176354609,0.269815601664211
52.0612578,8.64536629462823,0.355594296532884
52.0612578,8.65256082571036,0.259626089490183
52.0658033467783,8.63097723246396,0.259199978263454
52.0658033467783,8.63817176354609,0.259587378489875
52.0658033467783,8.64536629462823,0.281936756079485
52.0658033467783,8.65256082571036,0.259199978263454
52.0703488935565,8.62378270138183,0.259199978263454
52.0703488935565,8.63097723246396,0.259199978263454
52.0703488935565,8.63817176354609,0.259199978263454
52.0703488935565,8.64536629462823,0.259199978263454
52.0703488935565,8.65256082571036,0.259199978263454
52.0748944403348,8.62378270138183,0.259199978263454
52.0748944403348,8.63097723246396,0.259199978263454
52.0748944403348,8.63817176354609,0.259199978263454
52.0748944403348,8.64536629462823,0.259610675014415
52.0748944403348,8.65256082571036,0.251812248733983
52.0748944403348,8.65975535679249,0.259199978263454
52.079439987113,8.5734209838069,0.261098289919033
52.079439987113,8.58061551488904,0.299037095679491
52.079439987113,8.60939363921756,0.302733285748123
52.079439987113,8.6165881702997,0.259199978263454
52.079439987113,8.62378270138183,0.259199978263454
52.079439987113,8.63097723246396,0.259199978263454
52.079439987113,8.63817176354609,0.260168790260441
52.079439987113,8.64536629462823,0.308154910229747
52.079439987113,8.65256082571036,0.450874161667187
52.079439987113,8.65975535679249,0.298988459664996
52.079439987113,8.66694988787462,0.259199978263454
52.0839855338913,8.5734209838069,0.259199978263454
52.0839855338913,8.58061551488904,0.254036711696251
52.0839855338913,8.58781004597117,0.259199978263454
52.0839855338913,8.60939363921756,0.378627622615858
52.0839855338913,8.6165881702997,0.311410643051684
52.0839855338913,8.62378270138183,0.246606082107224
52.0839855338913,8.63097723246396,0.259199978263454
52.0839855338913,8.63817176354609,0.261805337038014
52.0839855338913,8.64536629462823,0.282321077896921
52.0839855338913,8.65256082571036,0.432806929681088
52.0839855338913,8.65975535679249,0.400682419698623
52.0839855338913,8.66694988787462,0.397102161868428
52.0885310806696,8.56622645272477,0.259199978263454
52.0885310806696,8.5734209838069,0.259199978263454
52.0885310806696,8.58061551488904,0.259199978263454
52.0885310806696,8.58781004597117,0.246064004388234
52.0885310806696,8.5950045770533,0.250607657927501
52.0885310806696,8.60939363921756,0.27423208350743
52.0885310806696,8.6165881702997,0.287360861481561
52.0885310806696,8.62378270138183,0.259192437188005
52.0885310806696,8.63097723246396,0.259199978263454
52.0885310806696,8.63817176354609,0.259199978263454
52.0885310806696,8.64536629462823,0.259199978263454
52.0885310806696,8.65256082571036,0.36219221824065
52.0885310806696,8.65975535679249,0.391423630765822
52.0885310806696,8.66694988787462,0.318510587085114
52.0885310806696,8.67414441895675,0.259199978263454
52.0930766274478,8.5734209838069,0.259199978263454
52.0930766274478,8.58061551488904,0.259199978263454
52.0930766274478,8.58781004597117,0.234584419494092
52.0930766274478,8.5950045770533,0.240520036130805
52.0930766274478,8.60219910813543,0.26125599776597
52.0930766274478,8.60939363921756,0.295795108868566
52.0930766274478,8.6165881702997,0.259199978263454
52.0930766274478,8.62378270138183,0.259199978263454
52.0930766274478,8.63097723246396,0.259199978263454
52.0930766274478,8.63817176354609,0.259199978263454
52.0930766274478,8.64536629462823,0.259199978263454
52.0930766274478,8.65256082571036,0.259199978263454
52.0930766274478,8.65975535679249,0.2738280909884
52.0930766274478,8.66694988787462,0.254164862671999
52.0930766274478,8.67414441895675,0.252800066590502
52.0930766274478,8.68133895003889,0.346206816124518
52.0930766274478,8.68853348112102,0.262064985090401
52.0930766274478,8.71011707436741,0.259199978263454
52.0930766274478,8.71731160544955,0.259199978263454
52.0976221742261,8.5734209838069,0.259199978263454
52.0976221742261,8.58061551488904,0.259199978263454
52.0976221742261,8.58781004597117,0.259199978263454
52.0976221742261,8.5950045770533,0.259199978263454
52.0976221742261,8.60219910813543,0.285340161403103
52.0976221742261,8.60939363921756,0.356208633166654
52.0976221742261,8.6165881702997,0.302554661705765
52.0976221742261,8.62378270138183,0.291324838527741
52.0976221742261,8.63097723246396,0.306741217661525
52.0976221742261,8.63817176354609,0.257909725679182
52.0976221742261,8.64536629462823,0.270625094627992
52.0976221742261,8.65256082571036,0.382472626850612
52.0976221742261,8.65975535679249,0.259199978263454
52.0976221742261,8.66694988787462,0.282880556048229
52.0976221742261,8.67414441895675,0.392092852524348
52.0976221742261,8.68133895003889,0.298961277512691
52.0976221742261,8.68853348112102,0.348625067405838
52.0976221742261,8.69572801220315,0.308444177232411
52.0976221742261,8.70292254328528,0.262277322161082
52.0976221742261,8.71011707436741,0.259199978263454
52.0976221742261,8.71731160544955,0.259199978263454
52.1021677210043,8.47269754865706,0.259199978263454
52.1021677210043,8.5734209838069,0.259199978263454
52.1021677210043,8.58061551488904,0.259602759417048
52.1021677210043,8.58781004597117,0.305261073237347
52.1021677210043,8.5950045770533,0.260152955988889
52.1021677210043,8.60219910813543,0.259199978263454
52.1021677210043,8.60939363921756,0.259199978263454
52.1021677210043,8.6165881702997,0.2715466706329
52.1021677210043,8.62378270138183,0.294682879150019
52.1021677210043,8.63097723246396,0.31441922682731
52.1021677210043,8.63817176354609,0.213127920154901
52.1021677210043,8.64536629462823,0.259199978263454
52.1021677210043,8.65256082571036,0.338598723823794
52.1021677210043,8.65975535679249,0.38302750745092
52.1021677210043,8.66694988787462,0.419443136808266
52.1021677210043,8.67414441895675,0.32390877366362
52.1021677210043,8.68133895003889,0.429494856695463
52.1021677210043,8.68853348112102,0.366922751803055
52.1021677210043,8.69572801220315,0.412175472391927
52.1021677210043,8.70292254328528,0.408379076459733
52.1021677210043,8.71011707436741,0.290669670435283
52.1021677210043,8.71731160544955,0.257529083375901
52.1021677210043,8.72450613653168,0.259199978263454
52.1067132677826,8.42953036216426,0.259199978263454
52.1067132677826,8.4367248932464,0.259199978263454
52.1067132677826,8.44391942432853,0.259199978263454
52.1067132677826,8.45830848649279,0.259199978263454
52.1067132677826,8.46550301757492,0.259199978263454
52.1067132677826,8.47269754865706,0.259199978263454
52.1067132677826,8.47989207973919,0.259199978263454
52.1067132677826,8.55183739056051,0.257024366716025
52.1067132677826,8.56622645272477,0.259199978263454
52.1067132677826,8.5734209838069,0.257254092070959
52.1067132677826,8.58061551488904,0.277812424416769
52.1067132677826,8.58781004597117,0.274850648983792
52.1067132677826,8.5950045770533,0.259199978263454
52.1067132677826,8.60219910813543,0.259199978263454
52.1067132677826,8.60939363921756,0.265632001379891
52.1067132677826,8.6165881702997,0.280949918055892
52.1067132677826,8.62378270138183,0.256707217753857
52.1067132677826,8.63097723246396,0.259199978263454
52.1067132677826,8.63817176354609,0.241981731811119
52.1067132677826,8.64536629462823,0.259199978263454
52.1067132677826,8.65256082571036,0.260282805462179
52.1067132677826,8.65975535679249,0.311353093431612
52.1067132677826,8.66694988787462,0.528542489853638
52.1067132677826,8.67414441895675,0.475573370956066
52.1067132677826,8.68133895003889,0.451792007663214
52.1067132677826,8.68853348112102,0.250194029313684
52.1067132677826,8.69572801220315,0.391168177019118
52.1067132677826,8.70292254328528,0.439286958472597
52.1067132677826,8.71011707436741,0.35666206214073
52.1067132677826,8.71731160544955,0.323179173906324
52.1067132677826,8.83961863384579,0.259199978263454
52.1067132677826,8.84681316492792,0.259199978263454
52.1067132677826,8.85400769601005,0.259199978263454
52.1067132677826,8.86120222709219,0.259199978263454
52.1067132677826,8.86839675817432,0.259199978263454
52.1112588145609,8.4151413,0.259199978263454
52.1112588145609,8.42233583108213,0.259199978263454
52.1112588145609,8.42953036216426,0.259199978263454
52.1112588145609,8.4367248932464,0.259199978263454
52.1112588145609,8.44391942432853,0.259199978263454
52.1112588145609,8.45111395541066,0.259199978263454
52.1112588145609,8.45830848649279,0.259199978263454
52.1112588145609,8.46550301757492,0.259199978263454
52.1112588145609,8.47269754865706,0.259199978263454
52.1112588145609,8.47989207973919,0.259199978263454
52.1112588145609,8.48708661082132,0.259199978263454
52.1112588145609,8.49428114190345,0.259199978263454
52.1112588145609,8.50147567298558,0.259199978263454
52.1112588145609,8.50867020406772,0.259199978263454
52.1112588145609,8.52305926623198,0.259199978263454
52.1112588145609,8.53025379731411,0.259199978263454
52.1112588145609,8.53744832839624,0.259199978263454
52.1112588145609,8.54464285947838,0.264094572019922
52.1112588145609,8.55183739056051,0.260442195041488
52.1112588145609,8.55903192164264,0.259199978263454
52.1112588145609,8.56622645272477,0.258075514673553
52.1112588145609,8.5734209838069,0.236254041614647
52.1112588145609,8.58061551488904,0.365726086822666
52.1112588145609,8.58781004597117,0.343574533079372
52.1112588145609,8.5950045770533,0.259199978263454
52.1112588145609,8.60219910813543,0.280991208463501
52.1112588145609,8.60939363921756,0.279860965825319
52.1112588145609,8.6165881702997,0.292971632590829
52.1112588145609,8.62378270138183,0.290850099178552
52.1112588145609,8.63097723246396,0.259199978263454
52.1112588145609,8.63817176354609,0.259199978263454
52.1112588145609,8.64536629462823,0.29322896450413
52.1112588145609,8.65256082571036,0.400375748654819
52.1112588145609,8.65975535679249,0.374928537412398
52.1112588145609,8.66694988787462,0.482594535607
52.1112588145609,8.67414441895675,0.577109047869042
52.1112588145609,8.68133895003889,0.388777682055626
52.1112588145609,8.68853348112102,0.209992453168056
52.1112588145609,8.69572801220315,0.432934234010562
52.1112588145609,8.70292254328528,0.427382581761148
52.1112588145609,8.71011707436741,0.341207142285002
52.1112588145609,8.71731160544955,0.259199978263454
52.1112588145609,8.72450613653168,0.259199978263454
52.1112588145609,8.73170066761381,0.259199978263454
52.1112588145609,8.83242410276366,0.259199978263454
52.1112588145609,8.83961863384579,0.259199978263454
52.1112588145609,8.84681316492792,0.259199978263454
52.1112588145609,8.85400769601005,0.259199978263454
52.1112588145609,8.86120222709219,0.259199978263454
52.1112588145609,8.86839675817432,0.259199978263454
52.1112588145609,8.87559128925645,0.259199978263454
52.1112588145609,8.88278582033858,0.259199978263454
52.1112588145609,8.88998035142071,0.259199978263454
52.1158043613391,8.4151413,0.259199978263454
52.1158043613391,8.42233583108213,0.259199978263454
52.1158043613391,8.42953036216426,0.259199978263454
52.1158043613391,8.4367248932464,0.259199978263454
52.1158043613391,8.44391942432853,0.259199978263454
52.1158043613391,8.45111395541066,0.259199978263454
52.1158043613391,8.45830848649279,0.259199978263454
52.1158043613391,8.46550301757492,0.259199978263454
52.1158043613391,8.47269754865706,0.257941975305975
52.1158043613391,8.47989207973919,0.230941534982365
52.1158043613391,8.48708661082132,0.217289330569995
52.1158043613391,8.49428114190345,0.259199978263454
52.1158043613391,8.50147567298558,0.259199978263454
52.1158043613391,8.50867020406772,0.259199978263454
52.1158043613391,8.51586473514985,0.259199978263454
52.1158043613391,8.52305926623198,0.259199978263454
52.1158043613391,8.53025379731411,0.259199978263454
52.1158043613391,8.53744832839624,0.28694584418
52.1158043613391,8.54464285947838,0.319778474097504
52.1158043613391,8.55183739056051,0.279898299934361
52.1158043613391,8.55903192164264,0.259199978263454
52.1158043613391,8.56622645272477,0.272501236826287
52.1158043613391,8.5734209838069,0.316478662069283
52.1158043613391,8.58061551488904,0.295735805310539
52.1158043613391,8.58781004597117,0.259199978263454
52.1158043613391,8.5950045770533,0.259199978263454
52.1158043613391,8.60219910813543,0.290820054219019
52.1158043613391,8.60939363921756,0.347818202857832
52.1158043613391,8.6165881702997,0.266833254409624
52.1158043613391,8.62378270138183,0.261611563896697
52.1158043613391,8.63097723246396,0.259199978263454
52.1158043613391,8.63817176354609,0.282622791950265
52.1158043613391,8.64536629462823,0.411767119327406
52.1158043613391,8.65256082571036,0.290764725248512
52.1158043613391,8.65975535679249,0.523993251272776
52.1158043613391,8.66694988787462,0.736786547024819
52.1158043613391,8.67414441895675,0.709638623819255
52.1158043613391,8.68133895003889,0.469911880473592
52.1158043613391,8.68853348112102,0.419504220228537
52.1158043613391,8.69572801220315,0.345334498639966
52.1158043613391,8.70292254328528,0.391172274523726
52.1158043613391,8.71011707436741,0.403461264525132
52.1158043613391,8.71731160544955,0.269591970616798
52.1158043613391,8.72450613653168,0.259199978263454
52.1158043613391,8.73170066761381,0.259199978263454
52.1158043613391,8.76767332302447,0.259199978263454
52.1158043613391,8.81803504059939,0.259199978263454
52.1158043613391,8.82522957168153,0.259199978263454
52.1158043613391,8.83242410276366,0.259199978263454
52.1158043613391,8.83961863384579,0.259199978263454
52.1158043613391,8.84681316492792,0.259199978263454
52.1158043613391,8.85400769601005,0.259199978263454
52.1158043613391,8.86120222709219,0.257016212543516
52.1158043613391,8.86839675817432,0.259199978263454
52.1158043613391,8.87559128925645,0.259199978263454
52.1158043613391,8.88278582033858,0.259199978263454
52.1158043613391,8.88998035142071,0.259199978263454
52.1203499081174,8.4151413,0.259199978263454
52.1203499081174,8.42233583108213,0.262090189604295
52.1203499081174,8.42953036216426,0.276981975922185
52.1203499081174,8.4367248932464,0.259199978263454
52.1203499081174,8.44391942432853,0.259199978263454
52.1203499081174,8.45111395541066,0.259199978263454
52.1203499081174,8.45830848649279,0.259199978263454
52.1203499081174,8.46550301757492,0.259199978263454
52.1203499081174,8.47269754865706,0.257144020517869
52.1203499081174,8.47989207973919,0.246861123929879
52.1203499081174,8.48708661082132,0.238534365055396
52.1203499081174,8.49428114190345,0.235855198581024
52.1203499081174,8.50147567298558,0.252406180865319
52.1203499081174,8.50867020406772,0.259199978263454
52.1203499081174,8.51586473514985,0.259199978263454
52.1203499081174,8.52305926623198,0.259199978263454
52.1203499081174,8.53025379731411,0.259199978263454
52.1203499081174,8.53744832839624,0.252558969966435
52.1203499081174,8.54464285947838,0.25805597498178
52.1203499081174,8.55183739056051,0.263920850091425
52.1203499081174,8.55903192164264,0.262789677666088
52.1203499081174,8.56622645272477,0.371579922578099
52.1203499081174,8.5734209838069,0.302982680221586
52.1203499081174,8.58061551488904,0.259199978263454
52.1203499081174,8.58781004597117,0.259199978263454
52.1203499081174,8.5950045770533,0.259199978263454
52.1203499081174,8.60219910813543,0.31470182021526
52.1203499081174,8.60939363921756,0.439461169576288
52.1203499081174,8.6165881702997,0.27886523024343
52.1203499081174,8.62378270138183,0.258181755235481
52.1203499081174,8.63097723246396,0.249306370772614
52.1203499081174,8.63817176354609,0.271323286663768
52.1203499081174,8.64536629462823,0.316375126156561
52.1203499081174,8.65256082571036,0.315538959890427
52.1203499081174,8.65975535679249,0.446260500164871
52.1203499081174,8.66694988787462,0.732708930126604
52.1203499081174,8.67414441895675,0.620389372933924
52.1203499081174,8.68133895003889,0.482210558746778
52.1203499081174,8.68853348112102,0.340892261934659
52.1203499081174,8.69572801220315,0.470839747315551
52.1203499081174,8.70292254328528,0.325140176595407
52.1203499081174,8.71011707436741,0.29523551990187
52.1203499081174,8.71731160544955,0.261435426532512
52.1203499081174,8.72450613653168,0.259199978263454
52.1203499081174,8.73170066761381,0.259199978263454
52.1203499081174,8.73889519869594,0.249314879782965
52.1203499081174,8.74608972977807,0.246604740251012
52.1203499081174,8.76047879194234,0.259199978263454
52.1203499081174,8.76767332302447,0.259199978263454
52.1203499081174,8.7748678541066,0.259199978263454
52.1203499081174,8.78925691627087,0.259199978263454
52.1203499081174,8.81803504059939,0.259199978263454
52.1203499081174,8.82522957168153,0.259199978263454
52.1203499081174,8.83242410276366,0.259199978263454
52.1203499081174,8.83961863384579,0.259199978263454
52.1203499081174,8.84681316492792,0.259199978263454
52.1203499081174,8.85400769601005,0.259199978263454
52.1203499081174,8.86120222709219,0.232528401189073
52.1203499081174,8.86839675817432,0.251859424969903
52.1203499081174,8.87559128925645,0.259199978263454
52.1203499081174,8.88278582033858,0.259199978263454
52.1203499081174,8.88998035142071,0.259199978263454
52.1248954548956,8.4151413,0.288934055546354
52.1248954548956,8.42233583108213,0.259765386485892
52.1248954548956,8.42953036216426,0.240479148303543
52.1248954548956,8.4367248932464,0.259199978263454
52.1248954548956,8.44391942432853,0.259199978263454
52.1248954548956,8.45111395541066,0.259199978263454
52.1248954548956,8.45830848649279,0.259199978263454
52.1248954548956,8.46550301757492,0.259199978263454
52.1248954548956,8.47269754865706,0.259199978263454
52.1248954548956,8.47989207973919,0.311946231098062
52.1248954548956,8.48708661082132,0.323733239667192
52.1248954548956,8.49428114190345,0.266461891655951
52.1248954548956,8.50147567298558,0.259199978263454
52.1248954548956,8.50867020406772,0.259199978263454
52.1248954548956,8.51586473514985,0.259199978263454
52.1248954548956,8.52305926623198,0.259199978263454
52.1248954548956,8.53025379731411,0.259199978263454
52.1248954548956,8.53744832839624,0.259199978263454
52.1248954548956,8.54464285947838,0.268218822104503
52.1248954548956,8.55183739056051,0.334207723050645
52.1248954548956,8.55903192164264,0.261236010712216
52.1248954548956,8.56622645272477,0.259227126241864
52.1248954548956,8.5734209838069,0.259199978263454
52.1248954548956,8.58061551488904,0.259199978263454
52.1248954548956,8.58781004597117,0.259199978263454
52.1248954548956,8.5950045770533,0.259199978263454
52.1248954548956,8.60219910813543,0.266341178949586
52.1248954548956,8.60939363921756,0.336795047773627
52.1248954548956,8.6165881702997,0.341893007484311
52.1248954548956,8.62378270138183,0.405424605134564
52.1248954548956,8.63097723246396,0.310134962900229
52.1248954548956,8.63817176354609,0.363135536350787
52.1248954548956,8.64536629462823,0.371234617061111
52.1248954548956,8.65256082571036,0.407269693722818
52.1248954548956,8.65975535679249,0.378243650958887
52.1248954548956,8.66694988787462,0.357283695762514
52.1248954548956,8.67414441895675,0.392162088261136
52.1248954548956,8.68133895003889,0.453158955889188
52.1248954548956,8.68853348112102,0.425521829596427
52.1248954548956,8.69572801220315,0.418968773828198
52.1248954548956,8.70292254328528,0.46623954931356
52.1248954548956,8.71011707436741,0.258823001644262
52.1248954548956,8.71731160544955,0.291693122542969
52.1248954548956,8.72450613653168,0.28272494307172
52.1248954548956,8.73170066761381,0.259199978263454
52.1248954548956,8.73889519869594,0.251508273064425
52.1248954548956,8.74608972977807,0.249045212944646
52.1248954548956,8.75328426086021,0.259199978263454
52.1248954548956,8.76047879194234,0.259199978263454
52.1248954548956,8.76767332302447,0.259199978263454
52.1248954548956,8.7748678541066,0.259199978263454
52.1248954548956,8.78206238518873,0.259199978263454
52.1248954548956,8.78925691627087,0.259199978263454
52.1248954548956,8.796451447353,0.259199978263454
52.1248954548956,8.80364597843513,0.259199978263454
52.1248954548956,8.81084050951726,0.259199978263454
52.1248954548956,8.81803504059939,0.259199978263454
52.1248954548956,8.82522957168153,0.259199978263454
52.1248954548956,8.83242410276366,0.259199978263454
52.1248954548956,8.83961863384579,0.260425785030366
52.1248954548956,8.84681316492792,0.266252523314573
52.1248954548956,8.85400769601005,0.247494659444256
52.1248954548956,8.86120222709219,0.259199978263454
52.1248954548956,8.86839675817432,0.259199978263454
52.1248954548956,8.87559128925645,0.288645615957334
52.1248954548956,8.88278582033858,0.282291103567939
52.1248954548956,8.88998035142071,0.259199978263454
52.1248954548956,8.89717488250285,0.259199978263454
52.1294410016739,8.4151413,0.369292977037777
52.1294410016739,8.42233583108213,0.337778270215177
52.1294410016739,8.42953036216426,0.259199978263454
52.1294410016739,8.4367248932464,0.259199978263454
52.1294410016739,8.44391942432853,0.259199978263454
52.1294410016739,8.45111395541066,0.259199978263454
52.1294410016739,8.45830848649279,0.259199978263454
52.1294410016739,8.46550301757492,0.259199978263454
52.1294410016739,8.47269754865706,0.259199978263454
52.1294410016739,8.47989207973919,0.262293691054811
52.1294410016739,8.48708661082132,0.326616534288466
52.1294410016739,8.49428114190345,0.259199978263454
52.1294410016739,8.50147567298558,0.259199978263454
52.1294410016739,8.50867020406772,0.259199978263454
52.1294410016739,8.51586473514985,0.253910480115252
52.1294410016739,8.52305926623198,0.259199978263454
52.1294410016739,8.53025379731411,0.259199978263454
52.1294410016739,8.53744832839624,0.259199978263454
52.1294410016739,8.54464285947838,0.259199978263454
52.1294410016739,8.55183739056051,0.258509938861371
52.1294410016739,8.55903192164264,0.273986084093032
52.1294410016739,8.56622645272477,0.259199978263454
52.1294410016739,8.5734209838069,0.259199978263454
52.1294410016739,8.58061551488904,0.259199978263454
52.1294410016739,8.58781004597117,0.259199978263454
52.1294410016739,8.5950045770533,0.259199978263454
52.1294410016739,8.60219910813543,0.259199978263454
52.1294410016739,8.60939363921756,0.359254179409063
52.1294410016739,8.6165881702997,0.355207370487706
52.1294410016739,8.62378270138183,0.361777564686995
52.1294410016739,8.63097723246396,0.359700659667668
52.1294410016739,8.63817176354609,0.276502290354315
52.1294410016739,8.64536629462823,0.23595594187088
52.1294410016739,8.65256082571036,0.369035245452801
52.1294410016739,8.65975535679249,0.364202343495975
52.1294410016739,8.66694988787462,0.432881992901035
52.1294410016739,8.67414441895675,0.453097654135554
52.1294410016739,8.68133895003889,0.341725539388947
52.1294410016739,8.68853348112102,0.301861154444194
52.1294410016739,8.69572801220315,0.499824435374972
52.1294410016739,8.70292254328528,0.435215254703977
52.1294410016739,8.71011707436741,0.300928186608996
52.1294410016739,8.71731160544955,0.259199978263454
52.1294410016739,8.72450613653168,0.259199978263454
52.1294410016739,8.73170066761381,0.260367741029409
52.1294410016739,8.73889519869594,0.259199978263454
52.1294410016739,8.74608972977807,0.259199978263454
52.1294410016739,8.75328426086021,0.259199978263454
52.1294410016739,8.76047879194234,0.259199978263454
52.1294410016739,8.76767332302447,0.259199978263454
52.1294410016739,8.7748678541066,0.259199978263454
52.1294410016739,8.78206238518873,0.259199978263454
52.1294410016739,8.78925691627087,0.264560392362913
52.1294410016739,8.796451447353,0.241545789259968
52.1294410016739,8.80364597843513,0.253254473564764
52.1294410016739,8.81084050951726,0.259199978263454
52.1294410016739,8.81803504059939,0.259199978263454
52.1294410016739,8.82522957168153,0.260043619016214
52.1294410016739,8.83242410276366,0.27576234872156
52.1294410016739,8.83961863384579,0.263750479086724
52.1294410016739,8.84681316492792,0.262545060620217
52.1294410016739,8.85400769601005,0.245776445397885
52.1294410016739,8.86120222709219,0.259199978263454
52.1294410016739,8.86839675817432,0.259199978263454
52.1294410016739,8.87559128925645,0.263362314649396
52.1294410016739,8.88278582033858,0.259199978263454
52.1294410016739,8.88998035142071,0.259199978263454
52.1294410016739,8.89717488250285,0.259199978263454
52.1339865484522,8.4151413,0.259199978263454
52.1339865484522,8.42233583108213,0.259199978263454
52.1339865484522,8.42953036216426,0.259199978263454
52.1339865484522,8.4367248932464,0.259199978263454
52.1339865484522,8.44391942432853,0.259199978263454
52.1339865484522,8.45111395541066,0.259199978263454
52.1339865484522,8.45830848649279,0.259199978263454
52.1339865484522,8.46550301757492,0.259199978263454
52.1339865484522,8.47269754865706,0.261197338212839
52.1339865484522,8.47989207973919,0.305278472506345
52.1339865484522,8.48708661082132,0.259684017939006
52.1339865484522,8.49428114190345,0.259199978263454
52.1339865484522,8.50147567298558,0.259199978263454
52.1339865484522,8.50867020406772,0.249311892706857
52.1339865484522,8.51586473514985,0.224683766803705
52.1339865484522,8.52305926623198,0.259199978263454
52.1339865484522,8.53025379731411,0.259199978263454
52.1339865484522,8.53744832839624,0.259199978263454
52.1339865484522,8.54464285947838,0.268959362523617
52.1339865484522,8.55183739056051,0.360661104557658
52.1339865484522,8.55903192164264,0.306326143510514
52.1339865484522,8.56622645272477,0.259383876071505
52.1339865484522,8.5734209838069,0.256883624520996
52.1339865484522,8.58061551488904,0.259199978263454
52.1339865484522,8.58781004597117,0.259199978263454
52.1339865484522,8.5950045770533,0.259199978263454
52.1339865484522,8.60219910813543,0.273487224315485
52.1339865484522,8.60939363921756,0.266664872221636
52.1339865484522,8.6165881702997,0.259199978263454
52.1339865484522,8.62378270138183,0.259199978263454
52.1339865484522,8.63097723246396,0.259199978263454
52.1339865484522,8.63817176354609,0.243071544227016
52.1339865484522,8.64536629462823,0.296393495205748
52.1339865484522,8.65256082571036,0.327398315834498
52.1339865484522,8.65975535679249,0.389930034158938
52.1339865484522,8.66694988787462,0.419307591202587
52.1339865484522,8.67414441895675,0.314125692885511
52.1339865484522,8.68133895003889,0.348862736103242
52.1339865484522,8.68853348112102,0.299851459268543
52.1339865484522,8.69572801220315,0.421784664657981
52.1339865484522,8.70292254328528,0.406996870057857
52.1339865484522,8.71011707436741,0.287439592907051
52.1339865484522,8.71731160544955,0.259199978263454
52.1339865484522,8.72450613653168,0.266269740989759
52.1339865484522,8.73170066761381,0.279110611397144
52.1339865484522,8.73889519869594,0.25724701711812
52.1339865484522,8.74608972977807,0.259199978263454
52.1339865484522,8.75328426086021,0.259199978263454
52.1339865484522,8.76047879194234,0.259199978263454
52.1339865484522,8.76767332302447,0.259199978263454
52.1339865484522,8.7748678541066,0.327051138323326
52.1339865484522,8.78206238518873,0.309656208884716
52.1339865484522,8.78925691627087,0.275540739973463
52.1339865484522,8.796451447353,0.242487065774032
52.1339865484522,8.80364597843513,0.244442418534785
52.1339865484522,8.81084050951726,0.259199978263454
52.1339865484522,8.81803504059939,0.259199978263454
52.1339865484522,8.82522957168153,0.264397492234849
52.1339865484522,8.83242410276366,0.282174595214583
52.1339865484522,8.83961863384579,0.259199978263454
52.1339865484522,8.84681316492792,0.259199978263454
52.1339865484522,8.85400769601005,0.302104134460913
52.1339865484522,8.86120222709219,0.288356336107683
52.1339865484522,8.86839675817432,0.259199978263454
52.1339865484522,8.87559128925645,0.261927856092154
52.1339865484522,8.88278582033858,0.260131452738949
52.1339865484522,8.88998035142071,0.259199978263454
52.1385320952304,8.4151413,0.259199978263454
52.1385320952304,8.42233583108213,0.259199978263454
52.1385320952304,8.42953036216426,0.259199978263454
52.1385320952304,8.4367248932464,0.259199978263454
52.1385320952304,8.44391942432853,0.259199978263454
52.1385320952304,8.45111395541066,0.259199978263454
52.1385320952304,8.45830848649279,0.259199978263454
52.1385320952304,8.46550301757492,0.259199978263454
52.1385320952304,8.47269754865706,0.303113812530751
52.1385320952304,8.47989207973919,0.440950272124932
52.1385320952304,8.48708661082132,0.398269285899343
52.1385320952304,8.49428114190345,0.27154900931148
52.1385320952304,8.50147567298558,0.389962440144882
52.1385320952304,8.50867020406772,0.260090437364499
52.1385320952304,8.51586473514985,0.272690970962492
52.1385320952304,8.52305926623198,0.259199978263454
52.1385320952304,8.53025379731411,0.259199978263454
52.1385320952304,8.53744832839624,0.259199978263454
52.1385320952304,8.54464285947838,0.270155084518591
52.1385320952304,8.55183739056051,0.442023416188748
52.1385320952304,8.55903192164264,0.703244840087394
52.1385320952304,8.56622645272477,0.416321963269965
52.1385320952304,8.5734209838069,0.290152219959044
52.1385320952304,8.58061551488904,0.259199978263454
52.1385320952304,8.58781004597117,0.259199978263454
52.1385320952304,8.5950045770533,0.259199978263454
52.1385320952304,8.60219910813543,0.283285612038555
52.1385320952304,8.60939363921756,0.279089202323789
52.1385320952304,8.6165881702997,0.26176188794181
52.1385320952304,8.62378270138183,0.259199978263454
52.1385320952304,8.63097723246396,0.259199978263454
52.1385320952304,8.63817176354609,0.259199978263454
52.1385320952304,8.64536629462823,0.362347155182996
52.1385320952304,8.65256082571036,0.407922251793466
52.1385320952304,8.65975535679249,0.345844971535622
52.1385320952304,8.66694988787462,0.274604788814184
52.1385320952304,8.67414441895675,0.257513397289673
52.1385320952304,8.68133895003889,0.295685068694287
52.1385320952304,8.68853348112102,0.262050946297204
52.1385320952304,8.69572801220315,0.338858691657584
52.1385320952304,8.70292254328528,0.341465654146758
52.1385320952304,8.71011707436741,0.259199978263454
52.1385320952304,8.71731160544955,0.259199978263454
52.1385320952304,8.72450613653168,0.259199978263454
52.1385320952304,8.73170066761381,0.257331604195604
52.1385320952304,8.73889519869594,0.201305463352637
52.1385320952304,8.74608972977807,0.25779620020057
52.1385320952304,8.75328426086021,0.259199978263454
52.1385320952304,8.76047879194234,0.259199978263454
52.1385320952304,8.76767332302447,0.259199978263454
52.1385320952304,8.7748678541066,0.235031029979573
52.1385320952304,8.78206238518873,0.385149539659996
52.1385320952304,8.78925691627087,0.263560485446753
52.1385320952304,8.796451447353,0.259199978263454
52.1385320952304,8.80364597843513,0.259199978263454
52.1385320952304,8.81084050951726,0.259199978263454
52.1385320952304,8.81803504059939,0.234959956040898
52.1385320952304,8.82522957168153,0.259199978263454
52.1385320952304,8.83242410276366,0.262546832148587
52.1385320952304,8.83961863384579,0.277897747403044
52.1385320952304,8.84681316492792,0.259199978263454
52.1385320952304,8.85400769601005,0.274814730688164
52.1385320952304,8.86120222709219,0.318513213163209
52.1385320952304,8.86839675817432,0.259199978263454
52.1385320952304,8.87559128925645,0.259199978263454
52.1385320952304,8.88278582033858,0.293192939117596
52.1385320952304,8.88998035142071,0.268185839309046
52.1430776420087,8.42953036216426,0.259199978263454
52.1430776420087,8.4367248932464,0.250204345509157
52.1430776420087,8.44391942432853,0.234428656587948
52.1430776420087,8.45111395541066,0.259199978263454
52.1430776420087,8.45830848649279,0.259199978263454
52.1430776420087,8.46550301757492,0.259199978263454
52.1430776420087,8.47269754865706,0.268702556024426
52.1430776420087,8.47989207973919,0.36502928414623
52.1430776420087,8.48708661082132,0.327351401037757
52.1430776420087,8.49428114190345,0.245491869666465
52.1430776420087,8.50147567298558,0.318734515528105
52.1430776420087,8.50867020406772,0.246053709623651
52.1430776420087,8.51586473514985,0.261483268759807
52.1430776420087,8.52305926623198,0.259199978263454
52.1430776420087,8.53025379731411,0.259199978263454
52.1430776420087,8.53744832839624,0.259199978263454
52.1430776420087,8.54464285947838,0.270454055424188
52.1430776420087,8.55183739056051,0.241804059662248
52.1430776420087,8.55903192164264,0.410640033646588
52.1430776420087,8.56622645272477,0.27595146747999
52.1430776420087,8.5734209838069,0.259199978263454
52.1430776420087,8.58061551488904,0.259199978263454
52.1430776420087,8.58781004597117,0.259199978263454
52.1430776420087,8.5950045770533,0.259199978263454
52.1430776420087,8.60219910813543,0.259199978263454
52.1430776420087,8.60939363921756,0.303167351997776
52.1430776420087,8.6165881702997,0.413423468507592
52.1430776420087,8.62378270138183,0.330077311989355
52.1430776420087,8.63097723246396,0.308926556399526
52.1430776420087,8.63817176354609,0.269636146063595
52.1430776420087,8.64536629462823,0.258067749597448
52.1430776420087,8.65256082571036,0.291302409393535
52.1430776420087,8.65975535679249,0.259199978263454
52.1430776420087,8.66694988787462,0.259199978263454
52.1430776420087,8.67414441895675,0.259199978263454
52.1430776420087,8.68133895003889,0.259199978263454
52.1430776420087,8.68853348112102,0.25537940865773
52.1430776420087,8.69572801220315,0.257584623808678
52.1430776420087,8.70292254328528,0.270729366829621
52.1430776420087,8.71011707436741,0.259199978263454
52.1430776420087,8.71731160544955,0.259199978263454
52.1430776420087,8.72450613653168,0.259199978263454
52.1430776420087,8.73170066761381,0.259176581688634
52.1430776420087,8.73889519869594,0.212289711420303
52.1430776420087,8.74608972977807,0.254189016530366
52.1430776420087,8.75328426086021,0.259199978263454
52.1430776420087,8.76047879194234,0.259199978263454
52.1430776420087,8.76767332302447,0.259199978263454
52.1430776420087,8.7748678541066,0.259489100189973
52.1430776420087,8.78206238518873,0.263652769833537
52.1430776420087,8.78925691627087,0.259199978263454
52.1430776420087,8.796451447353,0.259199978263454
52.1430776420087,8.80364597843513,0.259199978263454
52.1430776420087,8.81084050951726,0.259199978263454
52.1430776420087,8.81803504059939,0.249451512474651
52.1430776420087,8.82522957168153,0.259199978263454
52.1430776420087,8.83242410276366,0.263064129777492
52.1430776420087,8.83961863384579,0.278755260766128
52.1430776420087,8.84681316492792,0.256601593906576
52.1430776420087,8.85400769601005,0.235091476086219
52.1430776420087,8.86120222709219,0.251560231308496
52.1430776420087,8.86839675817432,0.259199978263454
52.1430776420087,8.87559128925645,0.259199978263454
52.1430776420087,8.88278582033858,0.259199978263454
52.1430776420087,8.88998035142071,0.259199978263454
52.1430776420087,8.89717488250285,0.259199978263454
52.1476231887869,8.4367248932464,0.259199978263454
52.1476231887869,8.44391942432853,0.260340595680083
52.1476231887869,8.45111395541066,0.259199978263454
52.1476231887869,8.45830848649279,0.277086606630294
52.1476231887869,8.46550301757492,0.259199978263454
52.1476231887869,8.47269754865706,0.245535130632144
52.1476231887869,8.47989207973919,0.236136531408115
52.1476231887869,8.48708661082132,0.323118673084549
52.1476231887869,8.49428114190345,0.305884387434909
52.1476231887869,8.50147567298558,0.263031076382671
52.1476231887869,8.50867020406772,0.270197985761998
52.1476231887869,8.51586473514985,0.259199978263454
52.1476231887869,8.52305926623198,0.252412129305507
52.1476231887869,8.53025379731411,0.274472592654992
52.1476231887869,8.53744832839624,0.298206820782314
52.1476231887869,8.54464285947838,0.259199978263454
52.1476231887869,8.55183739056051,0.259199978263454
52.1476231887869,8.55903192164264,0.221509234818899
52.1476231887869,8.56622645272477,0.205044728461699
52.1476231887869,8.5734209838069,0.296788253735779
52.1476231887869,8.58061551488904,0.333536560599141
52.1476231887869,8.58781004597117,0.285549203198879
52.1476231887869,8.5950045770533,0.199579538091522
52.1476231887869,8.60219910813543,0.260736011337827
52.1476231887869,8.60939363921756,0.299255875538775
52.1476231887869,8.6165881702997,0.312892759626882
52.1476231887869,8.62378270138183,0.295843793914333
52.1476231887869,8.63097723246396,0.295537577731728
52.1476231887869,8.63817176354609,0.262305515251909
52.1476231887869,8.64536629462823,0.290949190815756
52.1476231887869,8.65256082571036,0.208080247919103
52.1476231887869,8.65975535679249,0.305316133744307
52.1476231887869,8.66694988787462,0.38598575065091
52.1476231887869,8.67414441895675,0.259199978263454
52.1476231887869,8.68133895003889,0.256986726471304
52.1476231887869,8.68853348112102,0.22948227950446
52.1476231887869,8.69572801220315,0.259199978263454
52.1476231887869,8.70292254328528,0.259199978263454
52.1476231887869,8.71011707436741,0.259199978263454
52.1476231887869,8.71731160544955,0.259199978263454
52.1476231887869,8.72450613653168,0.259199978263454
52.1476231887869,8.73170066761381,0.259199978263454
52.1476231887869,8.73889519869594,0.259199978263454
52.1476231887869,8.74608972977807,0.259199978263454
52.1476231887869,8.75328426086021,0.259199978263454
52.1476231887869,8.76047879194234,0.259199978263454
52.1476231887869,8.76767332302447,0.259199978263454
52.1476231887869,8.7748678541066,0.259199978263454
52.1476231887869,8.78206238518873,0.259199978263454
52.1476231887869,8.78925691627087,0.259199978263454
52.1476231887869,8.796451447353,0.259199978263454
52.1476231887869,8.80364597843513,0.259199978263454
52.1476231887869,8.81084050951726,0.259199978263454
52.1476231887869,8.81803504059939,0.259199978263454
52.1476231887869,8.82522957168153,0.259199978263454
52.1476231887869,8.83242410276366,0.259199978263454
52.1476231887869,8.83961863384579,0.259199978263454
52.1476231887869,8.84681316492792,0.181735570469979
52.1476231887869,8.85400769601005,0.286186921265092
52.1476231887869,8.86120222709219,0.266906396353237
52.1476231887869,8.86839675817432,0.259199978263454
52.1476231887869,8.87559128925645,0.259199978263454
52.1476231887869,8.88278582033858,0.259199978263454
52.1476231887869,8.88998035142071,0.259199978263454
52.1476231887869,8.89717488250285,0.259199978263454
52.1521687355652,8.45111395541066,0.261097751522924
52.1521687355652,8.45830848649279,0.281845797206455
52.1521687355652,8.46550301757492,0.259199978263454
52.1521687355652,8.47269754865706,0.259199978263454
52.1521687355652,8.47989207973919,0.255685656796017
52.1521687355652,8.48708661082132,0.244418978657581
52.1521687355652,8.49428114190345,0.285871318876063
52.1521687355652,8.50147567298558,0.270865949236546
52.1521687355652,8.50867020406772,0.28052726073176
52.1521687355652,8.51586473514985,0.291426396018097
52.1521687355652,8.52305926623198,0.258042847132968
52.1521687355652,8.53025379731411,0.270528367707379
52.1521687355652,8.53744832839624,0.268597816156146
52.1521687355652,8.54464285947838,0.259199978263454
52.1521687355652,8.55183739056051,0.259199978263454
52.1521687355652,8.55903192164264,0.262408021136423
52.1521687355652,8.56622645272477,0.261404224519624
52.1521687355652,8.5734209838069,0.286086623455964
52.1521687355652,8.58061551488904,0.326072564201319
52.1521687355652,8.58781004597117,0.277996540344432
52.1521687355652,8.5950045770533,0.254037702119894
52.1521687355652,8.60219910813543,0.280882599178691
52.1521687355652,8.60939363921756,0.259199978263454
52.1521687355652,8.6165881702997,0.259199978263454
52.1521687355652,8.62378270138183,0.25263348770281
52.1521687355652,8.63097723246396,0.271807646318977
52.1521687355652,8.63817176354609,0.425327538433795
52.1521687355652,8.64536629462823,0.370491815642508
52.1521687355652,8.65256082571036,0.244840610087015
52.1521687355652,8.65975535679249,0.29345652399835
52.1521687355652,8.66694988787462,0.389968821138896
52.1521687355652,8.67414441895675,0.345991205060924
52.1521687355652,8.68133895003889,0.282927585983073
52.1521687355652,8.68853348112102,0.259199978263454
52.1521687355652,8.69572801220315,0.261398575675267
52.1521687355652,8.70292254328528,0.262547689371275
52.1521687355652,8.71011707436741,0.259199978263454
52.1521687355652,8.71731160544955,0.259199978263454
52.1521687355652,8.72450613653168,0.259199978263454
52.1521687355652,8.73170066761381,0.259199978263454
52.1521687355652,8.73889519869594,0.259199978263454
52.1521687355652,8.74608972977807,0.259199978263454
52.1521687355652,8.75328426086021,0.259199978263454
52.1521687355652,8.76047879194234,0.259199978263454
52.1521687355652,8.76767332302447,0.259199978263454
52.1521687355652,8.7748678541066,0.259199978263454
52.1521687355652,8.78206238518873,0.244292795442514
52.1521687355652,8.78925691627087,0.259199978263454
52.1521687355652,8.796451447353,0.259199978263454
52.1521687355652,8.80364597843513,0.259199978263454
52.1521687355652,8.81084050951726,0.259199978263454
52.1521687355652,8.81803504059939,0.259199978263454
52.1521687355652,8.82522957168153,0.259199978263454
52.1521687355652,8.83242410276366,0.259199978263454
52.1521687355652,8.83961863384579,0.301242079816434
52.1521687355652,8.84681316492792,0.302620978437229
52.1521687355652,8.85400769601005,0.271870328873828
52.1521687355652,8.86120222709219,0.253185952482954
52.1521687355652,8.86839675817432,0.259199978263454
52.1521687355652,8.87559128925645,0.259199978263454
52.1521687355652,8.88278582033858,0.259199978263454
52.1521687355652,8.88998035142071,0.259199978263454
52.1567142823435,8.47269754865706,0.259199978263454
52.1567142823435,8.47989207973919,0.259199978263454
52.1567142823435,8.48708661082132,0.259199978263454
52.1567142823435,8.49428114190345,0.259199978263454
52.1567142823435,8.50147567298558,0.259199978263454
52.1567142823435,8.50867020406772,0.277921961564467
52.1567142823435,8.51586473514985,0.331998958230586
52.1567142823435,8.52305926623198,0.255521584071476
52.1567142823435,8.53025379731411,0.259199978263454
52.1567142823435,8.53744832839624,0.259199978263454
52.1567142823435,8.54464285947838,0.259199978263454
52.1567142823435,8.55183739056051,0.259199978263454
52.1567142823435,8.55903192164264,0.259199978263454
52.1567142823435,8.56622645272477,0.259021461484042
52.1567142823435,8.5734209838069,0.26288567027486
52.1567142823435,8.58061551488904,0.268257407736796
52.1567142823435,8.58781004597117,0.259199978263454
52.1567142823435,8.5950045770533,0.259199978263454
52.1567142823435,8.60219910813543,0.259199978263454
52.1567142823435,8.60939363921756,0.255305265613337
52.1567142823435,8.6165881702997,0.259199978263454
52.1567142823435,8.62378270138183,0.259199978263454
52.1567142823435,8.63097723246396,0.26336296259282
52.1567142823435,8.63817176354609,0.29748045770899
52.1567142823435,8.64536629462823,0.264568606054767
52.1567142823435,8.65256082571036,0.268852561814375
52.1567142823435,8.65975535679249,0.353855494958066
52.1567142823435,8.66694988787462,0.41299633023802
52.1567142823435,8.67414441895675,0.390080178557518
52.1567142823435,8.68133895003889,0.285522850528791
52.1567142823435,8.68853348112102,0.264868783732356
52.1567142823435,8.69572801220315,0.332902874677387
52.1567142823435,8.70292254328528,0.260210317331277
52.1567142823435,8.71011707436741,0.259199978263454
52.1567142823435,8.71731160544955,0.259199978263454
52.1567142823435,8.72450613653168,0.259199978263454
52.1567142823435,8.73170066761381,0.259199978263454
52.1567142823435,8.73889519869594,0.259199978263454
52.1567142823435,8.74608972977807,0.259199978263454
52.1567142823435,8.75328426086021,0.259199978263454
52.1567142823435,8.76047879194234,0.259199978263454
52.1567142823435,8.76767332302447,0.259199978263454
52.1567142823435,8.7748678541066,0.25833096043001
52.1567142823435,8.78206238518873,0.241109931696104
52.1567142823435,8.78925691627087,0.259199978263454
52.1567142823435,8.796451447353,0.259199978263454
52.1567142823435,8.80364597843513,0.259199978263454
52.1567142823435,8.81084050951726,0.259199978263454
52.1567142823435,8.81803504059939,0.259199978263454
52.1567142823435,8.82522957168153,0.273440888532145
52.1567142823435,8.83242410276366,0.265125923615236
52.1567142823435,8.83961863384579,0.412558461878622
52.1567142823435,8.84681316492792,0.375808872702973
52.1567142823435,8.85400769601005,0.386243532448237
52.1567142823435,8.86120222709219,0.348421004508134
52.1567142823435,8.86839675817432,0.259199978263454
52.1567142823435,8.87559128925645,0.259653889625418
52.1567142823435,8.88278582033858,0.263405001366134
52.1567142823435,8.88998035142071,0.260617409161137
52.1567142823435,8.89717488250285,0.259199978263454
52.1612598291217,8.48708661082132,0.259199978263454
52.1612598291217,8.49428114190345,0.256435936505482
52.1612598291217,8.50147567298558,0.203608560061802
52.1612598291217,8.50867020406772,0.247878579595178
52.1612598291217,8.51586473514985,0.251537394336659
52.1612598291217,8.52305926623198,0.259199978263454
52.1612598291217,8.53025379731411,0.259199978263454
52.1612598291217,8.53744832839624,0.259199978263454
52.1612598291217,8.54464285947838,0.278768836519191
52.1612598291217,8.55183739056051,0.259199978263454
52.1612598291217,8.55903192164264,0.263465018093627
52.1612598291217,8.56622645272477,0.303041451421464
52.1612598291217,8.5734209838069,0.259199978263454
52.1612598291217,8.58061551488904,0.252980117908826
52.1612598291217,8.58781004597117,0.359136251626496
52.1612598291217,8.5950045770533,0.259199978263454
52.1612598291217,8.60219910813543,0.259199978263454
52.1612598291217,8.60939363921756,0.263934408746894
52.1612598291217,8.6165881702997,0.309142869891605
52.1612598291217,8.62378270138183,0.3902524027477
52.1612598291217,8.63097723246396,0.265148797364908
52.1612598291217,8.63817176354609,0.235213496300258
52.1612598291217,8.64536629462823,0.259199978263454
52.1612598291217,8.65256082571036,0.259199978263454
52.1612598291217,8.65975535679249,0.307937806880591
52.1612598291217,8.66694988787462,0.296355847678872
52.1612598291217,8.67414441895675,0.326509808693313
52.1612598291217,8.68133895003889,0.259199978263454
52.1612598291217,8.68853348112102,0.272304465535687
52.1612598291217,8.69572801220315,0.34384691307055
52.1612598291217,8.70292254328528,0.259199978263454
52.1612598291217,8.71011707436741,0.259199978263454
52.1612598291217,8.71731160544955,0.259199978263454
52.1612598291217,8.72450613653168,0.259199978263454
52.1612598291217,8.73170066761381,0.259199978263454
52.1612598291217,8.73889519869594,0.259199978263454
52.1612598291217,8.74608972977807,0.259199978263454
52.1612598291217,8.75328426086021,0.259199978263454
52.1612598291217,8.76047879194234,0.2695670523279
52.1612598291217,8.76767332302447,0.259199978263454
52.1612598291217,8.7748678541066,0.259199978263454
52.1612598291217,8.78206238518873,0.259199978263454
52.1612598291217,8.78925691627087,0.259199978263454
52.1612598291217,8.796451447353,0.259199978263454
52.1612598291217,8.80364597843513,0.259199978263454
52.1612598291217,8.81084050951726,0.259199978263454
52.1612598291217,8.81803504059939,0.259199978263454
52.1612598291217,8.82522957168153,0.321597229385822
52.1612598291217,8.83242410276366,0.298357483045391
52.1612598291217,8.83961863384579,0.237832413807066
52.1612598291217,8.84681316492792,0.274796180680174
52.1612598291217,8.85400769601005,0.338670920039331
52.1612598291217,8.86120222709219,0.324064730049661
52.1612598291217,8.86839675817432,0.310066855789519
52.1612598291217,8.87559128925645,0.263015568334932
52.1612598291217,8.88278582033858,0.262135120112728
52.1612598291217,8.88998035142071,0.259199978263454
52.1612598291217,8.89717488250285,0.259199978263454
52.1612598291217,8.90436941358498,0.259199978263454
52.1658053759,8.48708661082132,0.259199978263454
52.1658053759,8.49428114190345,0.259199978263454
52.1658053759,8.50147567298558,0.263053181585533
52.1658053759,8.50867020406772,0.237743205154041
52.1658053759,8.51586473514985,0.247592996815312
52.1658053759,8.52305926623198,0.259199978263454
52.1658053759,8.53025379731411,0.259199978263454
52.1658053759,8.53744832839624,0.259199978263454
52.1658053759,8.54464285947838,0.31966565519755
52.1658053759,8.55183739056051,0.26160177968666
52.1658053759,8.55903192164264,0.259199978263454
52.1658053759,8.56622645272477,0.2655532447691
52.1658053759,8.5734209838069,0.259199978263454
52.1658053759,8.58061551488904,0.259199978263454
52.1658053759,8.58781004597117,0.320453643388092
52.1658053759,8.5950045770533,0.294629066586734
52.1658053759,8.60219910813543,0.287701183052177
52.1658053759,8.60939363921756,0.375996700383802
52.1658053759,8.6165881702997,0.660720760042875
52.1658053759,8.62378270138183,0.437127672167983
52.1658053759,8.63097723246396,0.428046337141865
52.1658053759,8.63817176354609,0.281600055356929
52.1658053759,8.64536629462823,0.259199978263454
52.1658053759,8.65256082571036,0.259199978263454
52.1658053759,8.65975535679249,0.289754530325977
52.1658053759,8.66694988787462,0.27495158220543
52.1658053759,8.67414441895675,0.25907219366263
52.1658053759,8.68133895003889,0.259199978263454
52.1658053759,8.68853348112102,0.259199978263454
52.1658053759,8.69572801220315,0.259199978263454
52.1658053759,8.70292254328528,0.259199978263454
52.1658053759,8.71011707436741,0.259199978263454
52.1658053759,8.71731160544955,0.259199978263454
52.1658053759,8.72450613653168,0.259199978263454
52.1658053759,8.73170066761381,0.259199978263454
52.1658053759,8.73889519869594,0.251276376654534
52.1658053759,8.74608972977807,0.259199978263454
52.1658053759,8.75328426086021,0.259199978263454
52.1658053759,8.76047879194234,0.29699222696557
52.1658053759,8.76767332302447,0.23891052687661
52.1658053759,8.7748678541066,0.259199978263454
52.1658053759,8.796451447353,0.259199978263454
52.1658053759,8.80364597843513,0.259199978263454
52.1658053759,8.81084050951726,0.259199978263454
52.1658053759,8.81803504059939,0.259199978263454
52.1658053759,8.82522957168153,0.247572849483573
52.1658053759,8.83242410276366,0.24656892777404
52.1658053759,8.83961863384579,0.253485648287183
52.1658053759,8.84681316492792,0.263605170630763
52.1658053759,8.85400769601005,0.527825659687115
52.1658053759,8.86120222709219,0.544051998894086
52.1658053759,8.86839675817432,0.250827559254598
52.1658053759,8.87559128925645,0.265108051199135
52.1658053759,8.88278582033858,0.262264906321126
52.1658053759,8.88998035142071,0.259199978263454
52.1658053759,8.89717488250285,0.259199978263454
52.1658053759,8.90436941358498,0.259199978263454
52.1703509226782,8.50147567298558,0.288693882405479
52.1703509226782,8.50867020406772,0.251571452488749
52.1703509226782,8.51586473514985,0.259199978263454
52.1703509226782,8.52305926623198,0.259199978263454
52.1703509226782,8.53025379731411,0.259199978263454
52.1703509226782,8.53744832839624,0.289279009032811
52.1703509226782,8.54464285947838,0.272174972891007
52.1703509226782,8.55183739056051,0.246603119919769
52.1703509226782,8.55903192164264,0.247570231325729
52.1703509226782,8.56622645272477,0.259199978263454
52.1703509226782,8.5734209838069,0.259199978263454
52.1703509226782,8.58061551488904,0.261482479359107
52.1703509226782,8.58781004597117,0.326438248322662
52.1703509226782,8.5950045770533,0.351784329612695
52.1703509226782,8.60219910813543,0.256459754371311
52.1703509226782,8.60939363921756,0.261501996290429
52.1703509226782,8.6165881702997,0.333459139847874
52.1703509226782,8.62378270138183,0.287155708413901
52.1703509226782,8.63097723246396,0.279663013045372
52.1703509226782,8.63817176354609,0.225237653533773
52.1703509226782,8.64536629462823,0.259199978263454
52.1703509226782,8.65256082571036,0.259199978263454
52.1703509226782,8.65975535679249,0.259199978263454
52.1703509226782,8.66694988787462,0.259199978263454
52.1703509226782,8.67414441895675,0.246591793502065
52.1703509226782,8.68133895003889,0.251942182419309
52.1703509226782,8.68853348112102,0.259199978263454
52.1703509226782,8.69572801220315,0.259199978263454
52.1703509226782,8.70292254328528,0.259199978263454
52.1703509226782,8.71011707436741,0.259199978263454
52.1703509226782,8.71731160544955,0.259199978263454
52.1703509226782,8.72450613653168,0.259199978263454
52.1703509226782,8.73170066761381,0.259199978263454
52.1703509226782,8.73889519869594,0.21181138062844
52.1703509226782,8.74608972977807,0.248257874410456
52.1703509226782,8.75328426086021,0.259199978263454
52.1703509226782,8.76047879194234,0.291083426857843
52.1703509226782,8.76767332302447,0.292115119429372
52.1703509226782,8.81803504059939,0.259199978263454
52.1703509226782,8.82522957168153,0.2441460407633
52.1703509226782,8.83242410276366,0.241981152992427
52.1703509226782,8.83961863384579,0.259199978263454
52.1703509226782,8.84681316492792,0.273833558680494
52.1703509226782,8.85400769601005,0.298698999557468
52.1703509226782,8.86120222709219,0.461333749201236
52.1703509226782,8.86839675817432,0.261668847152445
52.1703509226782,8.87559128925645,0.26747316654635
52.1703509226782,8.88278582033858,0.261264941078773
52.1703509226782,8.88998035142071,0.259199978263454
52.1703509226782,8.89717488250285,0.262897007192551
52.1703509226782,8.90436941358498,0.467110255605488
52.1748964694565,8.50147567298558,0.243132030905042
52.1748964694565,8.50867020406772,0.219402406314363
52.1748964694565,8.51586473514985,0.264080914813133
52.1748964694565,8.52305926623198,0.263517074065103
52.1748964694565,8.53025379731411,0.259199978263454
52.1748964694565,8.53744832839624,0.276397521178416
52.1748964694565,8.54464285947838,0.30986416136233
52.1748964694565,8.55183739056051,0.250762638112977
52.1748964694565,8.55903192164264,0.251579664479757
52.1748964694565,8.56622645272477,0.261916051950696
52.1748964694565,8.5734209838069,0.258302885809749
52.1748964694565,8.58061551488904,0.258381842547026
52.1748964694565,8.58781004597117,0.259534689252871
52.1748964694565,8.5950045770533,0.283662760759658
52.1748964694565,8.60219910813543,0.285940091996475
52.1748964694565,8.60939363921756,0.259154146448899
52.1748964694565,8.6165881702997,0.20313359547833
52.1748964694565,8.62378270138183,0.274460353307982
52.1748964694565,8.63097723246396,0.238974319056677
52.1748964694565,8.63817176354609,0.255451424427582
52.1748964694565,8.64536629462823,0.259199978263454
52.1748964694565,8.65256082571036,0.302838457208396
52.1748964694565,8.65975535679249,0.292398693718896
52.1748964694565,8.66694988787462,0.259199978263454
52.1748964694565,8.67414441895675,0.259199978263454
52.1748964694565,8.68133895003889,0.259199978263454
52.1748964694565,8.68853348112102,0.284859598860441
52.1748964694565,8.69572801220315,0.272030616522843
52.1748964694565,8.70292254328528,0.259199978263454
52.1748964694565,8.71011707436741,0.259199978263454
52.1748964694565,8.71731160544955,0.259199978263454
52.1748964694565,8.72450613653168,0.27773458516834
52.1748964694565,8.73170066761381,0.270728680963799
52.1748964694565,8.73889519869594,0.249229223311523
52.1748964694565,8.74608972977807,0.248351728785637
52.1748964694565,8.75328426086021,0.256890923660667
52.1748964694565,8.76047879194234,0.259199978263454
52.1748964694565,8.76767332302447,0.259199978263454
52.1748964694565,8.7748678541066,0.271790342674871
52.1748964694565,8.83242410276366,0.259199978263454
52.1748964694565,8.84681316492792,0.243762835063481
52.1748964694565,8.85400769601005,0.263700736866836
52.1748964694565,8.86120222709219,0.293989216374227
52.1748964694565,8.86839675817432,0.292257990378604
52.1748964694565,8.87559128925645,0.286712864507415
52.1748964694565,8.88278582033858,0.306581958800745
52.1748964694565,8.88998035142071,0.259199978263454
52.1748964694565,8.89717488250285,0.259199978263454
52.1748964694565,8.90436941358498,0.395166281931092
52.1794420162348,8.50867020406772,0.264318292960988
52.1794420162348,8.51586473514985,0.300402545672109
52.1794420162348,8.52305926623198,0.364141388938003
52.1794420162348,8.53025379731411,0.260946811637683
52.1794420162348,8.53744832839624,0.259199978263454
52.1794420162348,8.54464285947838,0.278339686949263
52.1794420162348,8.55183739056051,0.262802984723604
52.1794420162348,8.55903192164264,0.276209719961941
52.1794420162348,8.56622645272477,0.249654941097507
52.1794420162348,8.5734209838069,0.248276721210607
52.1794420162348,8.58061551488904,0.256331619905955
52.1794420162348,8.58781004597117,0.259199978263454
52.1794420162348,8.5950045770533,0.266178948326424
52.1794420162348,8.60219910813543,0.262410555440405
52.1794420162348,8.60939363921756,0.25821666762389
52.1794420162348,8.6165881702997,0.259199978263454
52.1794420162348,8.62378270138183,0.279893687570085
52.1794420162348,8.63097723246396,0.271741334413043
52.1794420162348,8.63817176354609,0.259199978263454
52.1794420162348,8.64536629462823,0.259199978263454
52.1794420162348,8.65256082571036,0.305601908005393
52.1794420162348,8.65975535679249,0.301617859167879
52.1794420162348,8.66694988787462,0.259199978263454
52.1794420162348,8.67414441895675,0.259199978263454
52.1794420162348,8.68133895003889,0.363122040503079
52.1794420162348,8.68853348112102,0.266273748823364
52.1794420162348,8.69572801220315,0.264039030523359
52.1794420162348,8.70292254328528,0.259199978263454
52.1794420162348,8.71011707436741,0.259199978263454
52.1794420162348,8.71731160544955,0.274052870742685
52.1794420162348,8.72450613653168,0.299710880887983
52.1794420162348,8.73170066761381,0.283064612103232
52.1794420162348,8.73889519869594,0.259199978263454
52.1794420162348,8.74608972977807,0.262338180927173
52.1794420162348,8.75328426086021,0.191581929297764
52.1794420162348,8.76047879194234,0.267725048874869
52.1794420162348,8.76767332302447,0.260891425749989
52.1794420162348,8.7748678541066,0.291130676640305
52.1794420162348,8.78206238518873,0.270037685138446
52.1794420162348,8.84681316492792,0.259199978263454
52.1794420162348,8.85400769601005,0.259199978263454
52.1794420162348,8.86120222709219,0.259199978263454
52.1794420162348,8.86839675817432,0.343844826667793
52.1794420162348,8.87559128925645,0.257397849360295
52.1794420162348,8.88278582033858,0.286314414090473
52.1794420162348,8.88998035142071,0.259199978263454
52.1794420162348,8.89717488250285,0.259199978263454
52.1794420162348,8.90436941358498,0.259199978263454
52.183987563013,8.52305926623198,0.259199978263454
52.183987563013,8.53025379731411,0.28263547422108
52.183987563013,8.53744832839624,0.259199978263454
52.183987563013,8.54464285947838,0.259199978263454
52.183987563013,8.55183739056051,0.259992863599792
52.183987563013,8.55903192164264,0.276932877184344
52.183987563013,8.56622645272477,0.29590447830781
52.183987563013,8.5734209838069,0.395112852056296
52.183987563013,8.58061551488904,0.303664718909122
52.183987563013,8.58781004597117,0.280374978850992
52.183987563013,8.5950045770533,0.28279033469355
52.183987563013,8.60219910813543,0.216973466407581
52.183987563013,8.60939363921756,0.228784492431074
52.183987563013,8.6165881702997,0.259199978263454
52.183987563013,8.62378270138183,0.259199978263454
52.183987563013,8.63097723246396,0.259199978263454
52.183987563013,8.63817176354609,0.259199978263454
52.183987563013,8.64536629462823,0.259199978263454
52.183987563013,8.65256082571036,0.296698921505213
52.183987563013,8.65975535679249,0.305424254335502
52.183987563013,8.66694988787462,0.309546090369334
52.183987563013,8.67414441895675,0.308146204117981
52.183987563013,8.68133895003889,0.282401582880222
52.183987563013,8.68853348112102,0.243457739156046
52.183987563013,8.69572801220315,0.229443682628714
52.183987563013,8.70292254328528,0.245151385520044
52.183987563013,8.71011707436741,0.270494450903776
52.183987563013,8.71731160544955,0.318066112962605
52.183987563013,8.72450613653168,0.273427947427315
52.183987563013,8.73170066761381,0.259199978263454
52.183987563013,8.73889519869594,0.274740204175347
52.183987563013,8.74608972977807,0.284749692487498
52.183987563013,8.75328426086021,0.274746246533555
52.183987563013,8.76047879194234,0.309751311163091
52.183987563013,8.76767332302447,0.25973807574698
52.183987563013,8.7748678541066,0.259199978263454
52.183987563013,8.84681316492792,0.259199978263454
52.183987563013,8.85400769601005,0.259199978263454
52.183987563013,8.86120222709219,0.259199978263454
52.183987563013,8.86839675817432,0.259586778624761
52.183987563013,8.87559128925645,0.259199978263454
52.183987563013,8.88278582033858,0.259199978263454
52.183987563013,8.88998035142071,0.259199978263454
52.183987563013,8.89717488250285,0.259199978263454
52.183987563013,8.90436941358498,0.259199978263454
52.1885331097913,8.50867020406772,0.259199978263454
52.1885331097913,8.51586473514985,0.259199978263454
52.1885331097913,8.52305926623198,0.2956910991218
52.1885331097913,8.53025379731411,0.328726042229242
52.1885331097913,8.53744832839624,0.24728546601515
52.1885331097913,8.54464285947838,0.259199978263454
52.1885331097913,8.55183739056051,0.262438274438181
52.1885331097913,8.55903192164264,0.253360412336206
52.1885331097913,8.56622645272477,0.259199978263454
52.1885331097913,8.5734209838069,0.247521384190211
52.1885331097913,8.58061551488904,0.268096937777299
52.1885331097913,8.58781004597117,0.341568356940434
52.1885331097913,8.5950045770533,0.295744547939055
52.1885331097913,8.60219910813543,0.305794696596903
52.1885331097913,8.60939363921756,0.279784920484223
52.1885331097913,8.6165881702997,0.266633438475444
52.1885331097913,8.62378270138183,0.259264462603165
52.1885331097913,8.63097723246396,0.249559209707558
52.1885331097913,8.63817176354609,0.259199978263454
52.1885331097913,8.64536629462823,0.252526918464279
52.1885331097913,8.65256082571036,0.286653938077244
52.1885331097913,8.65975535679249,0.314778214857324
52.1885331097913,8.66694988787462,0.348014894953919
52.1885331097913,8.67414441895675,0.370067419838822
52.1885331097913,8.68133895003889,0.274203995639416
52.1885331097913,8.68853348112102,0.346425542273655
52.1885331097913,8.69572801220315,0.278475111502647
52.1885331097913,8.70292254328528,0.224746535600055
52.1885331097913,8.71011707436741,0.248408171647801
52.1885331097913,8.71731160544955,0.272707035526203
52.1885331097913,8.72450613653168,0.281557372676975
52.1885331097913,8.73170066761381,0.259199978263454
52.1885331097913,8.73889519869594,0.259199978263454
52.1885331097913,8.74608972977807,0.259199978263454
52.1885331097913,8.75328426086021,0.259199978263454
52.1885331097913,8.76047879194234,0.259607204192138
52.1885331097913,8.76767332302447,0.288671317272505
52.1885331097913,8.7748678541066,0.272727282632038
52.1885331097913,8.78206238518873,0.322721924098485
52.1885331097913,8.86120222709219,0.259199978263454
52.1885331097913,8.86839675817432,0.259199978263454
52.1885331097913,8.87559128925645,0.259199978263454
52.1885331097913,8.88278582033858,0.259199978263454
52.1885331097913,8.88998035142071,0.259199978263454
52.1885331097913,8.89717488250285,0.259199978263454
52.1885331097913,8.90436941358498,0.259199978263454
52.1930786565695,8.47989207973919,0.259199978263454
52.1930786565695,8.48708661082132,0.259199978263454
52.1930786565695,8.49428114190345,0.259199978263454
52.1930786565695,8.50147567298558,0.259199978263454
52.1930786565695,8.50867020406772,0.299211472857155
52.1930786565695,8.51586473514985,0.285267115783689
52.1930786565695,8.52305926623198,0.321941316153086
52.1930786565695,8.53025379731411,0.229333497401599
52.1930786565695,8.53744832839624,0.261679749185217
52.1930786565695,8.54464285947838,0.259199978263454
52.1930786565695,8.55183739056051,0.258691859995039
52.1930786565695,8.55903192164264,0.3288612131984
52.1930786565695,8.56622645272477,0.27859592478138
52.1930786565695,8.5734209838069,0.228407030370634
52.1930786565695,8.58061551488904,0.42114662802781
52.1930786565695,8.58781004597117,0.480337825960668
52.1930786565695,8.5950045770533,0.290478015080547
52.1930786565695,8.60219910813543,0.350560545011114
52.1930786565695,8.60939363921756,0.368870418380766
52.1930786565695,8.6165881702997,0.276589318495663
52.1930786565695,8.62378270138183,0.282708865320696
52.1930786565695,8.63097723246396,0.257751880619835
52.1930786565695,8.63817176354609,0.271917276773307
52.1930786565695,8.64536629462823,0.235823065104134
52.1930786565695,8.65256082571036,0.313885177580429
52.1930786565695,8.65975535679249,0.300371397930806
52.1930786565695,8.66694988787462,0.259199978263454
52.1930786565695,8.67414441895675,0.259199978263454
52.1930786565695,8.68133895003889,0.261996474123193
52.1930786565695,8.68853348112102,0.283954583208971
52.1930786565695,8.69572801220315,0.259199978263454
52.1930786565695,8.70292254328528,0.266115592242342
52.1930786565695,8.71011707436741,0.31572440747374
52.1930786565695,8.71731160544955,0.361650538218887
52.1930786565695,8.72450613653168,0.278383645925188
52.1930786565695,8.73170066761381,0.259199978263454
52.1930786565695,8.73889519869594,0.278521877091264
52.1930786565695,8.74608972977807,0.259199978263454
52.1930786565695,8.75328426086021,0.279757568568502
52.1930786565695,8.76047879194234,0.302276042420093
52.1930786565695,8.76767332302447,0.224827789847514
52.1930786565695,8.7748678541066,0.327343163439163
52.1930786565695,8.78206238518873,0.530623575150777
52.1930786565695,8.86839675817432,0.286893691433388
52.1930786565695,8.87559128925645,0.259199978263454
52.1930786565695,8.88278582033858,0.259199978263454
52.1930786565695,8.88998035142071,0.259199978263454
52.1930786565695,8.89717488250285,0.259199978263454
52.1930786565695,8.90436941358498,0.259199978263454
52.1976242033478,8.45830848649279,0.235872844600257
52.1976242033478,8.46550301757492,0.264439680758012
52.1976242033478,8.47269754865706,0.259199978263454
52.1976242033478,8.47989207973919,0.259199978263454
52.1976242033478,8.48708661082132,0.245154150102536
52.1976242033478,8.49428114190345,0.259199978263454
52.1976242033478,8.50147567298558,0.259199978263454
52.1976242033478,8.50867020406772,0.259199978263454
52.1976242033478,8.51586473514985,0.29232935894848
52.1976242033478,8.52305926623198,0.434394954618051
52.1976242033478,8.53025379731411,0.381248847886686
52.1976242033478,8.53744832839624,0.27623532308661
52.1976242033478,8.54464285947838,0.259874915398933
52.1976242033478,8.55183739056051,0.279060061242477
52.1976242033478,8.55903192164264,0.271767929299993
52.1976242033478,8.56622645272477,0.335916321836151
52.1976242033478,8.5734209838069,0.419184242247958
52.1976242033478,8.58061551488904,0.594571066897954
52.1976242033478,8.58781004597117,0.617498479495193
52.1976242033478,8.5950045770533,0.470891080118949
52.1976242033478,8.60219910813543,0.311096617751306
52.1976242033478,8.60939363921756,0.309810285385101
52.1976242033478,8.6165881702997,0.265307385527446
52.1976242033478,8.62378270138183,0.250972294360929
52.1976242033478,8.63097723246396,0.294920214636684
52.1976242033478,8.63817176354609,0.378857317119106
52.1976242033478,8.64536629462823,0.419116123268354
52.1976242033478,8.65256082571036,0.268274264187245
52.1976242033478,8.65975535679249,0.261938323816637
52.1976242033478,8.66694988787462,0.259199978263454
52.1976242033478,8.67414441895675,0.322888818506208
52.1976242033478,8.68133895003889,0.259199978263454
52.1976242033478,8.68853348112102,0.259199978263454
52.1976242033478,8.69572801220315,0.259199978263454
52.1976242033478,8.70292254328528,0.271554356446748
52.1976242033478,8.71011707436741,0.331944362988109
52.1976242033478,8.71731160544955,0.41742680099821
52.1976242033478,8.72450613653168,0.267997335768315
52.1976242033478,8.73170066761381,0.242522292287382
52.1976242033478,8.73889519869594,0.245159712503929
52.1976242033478,8.74608972977807,0.226578386945447
52.1976242033478,8.75328426086021,0.263460426647536
52.1976242033478,8.76047879194234,0.500432512503576
52.1976242033478,8.76767332302447,0.263408394358797
52.1976242033478,8.7748678541066,0.38093909398801
52.1976242033478,8.78206238518873,0.446890324358831
52.2021697501261,8.45830848649279,0.338020451820358
52.2021697501261,8.46550301757492,0.247887051275051
52.2021697501261,8.47269754865706,0.259199978263454
52.2021697501261,8.47989207973919,0.231063851484808
52.2021697501261,8.48708661082132,0.183720739486052
52.2021697501261,8.49428114190345,0.259199978263454
52.2021697501261,8.50147567298558,0.259199978263454
52.2021697501261,8.50867020406772,0.259199978263454
52.2021697501261,8.51586473514985,0.252423372260246
52.2021697501261,8.52305926623198,0.344397794729254
52.2021697501261,8.53025379731411,0.298173947095043
52.2021697501261,8.53744832839624,0.280225007033792
52.2021697501261,8.54464285947838,0.316763012976772
52.2021697501261,8.55183739056051,0.507466956579742
52.2021697501261,8.55903192164264,0.396123958755967
52.2021697501261,8.56622645272477,0.442879206470179
52.2021697501261,8.5734209838069,0.522046593661017
52.2021697501261,8.58061551488904,0.382974475729666
52.2021697501261,8.58781004597117,0.385449135323535
52.2021697501261,8.5950045770533,0.324819032407387
52.2021697501261,8.60219910813543,0.267038696869238
52.2021697501261,8.60939363921756,0.259199978263454
52.2021697501261,8.6165881702997,0.259199978263454
52.2021697501261,8.62378270138183,0.308517604830828
52.2021697501261,8.63097723246396,0.358014244916083
52.2021697501261,8.63817176354609,0.313848875074345
52.2021697501261,8.64536629462823,0.241970186976069
52.2021697501261,8.65256082571036,0.252180266985162
52.2021697501261,8.65975535679249,0.259199978263454
52.2021697501261,8.66694988787462,0.259199978263454
52.2021697501261,8.67414441895675,0.323830725350987
52.2021697501261,8.68133895003889,0.259199978263454
52.2021697501261,8.68853348112102,0.273863054532458
52.2021697501261,8.69572801220315,0.251215472290789
52.2021697501261,8.70292254328528,0.356128505530731
52.2021697501261,8.71011707436741,0.29393761402389
52.2021697501261,8.71731160544955,0.375278411023709
52.2021697501261,8.72450613653168,0.321449280085696
52.2021697501261,8.73170066761381,0.254584596930287
52.2021697501261,8.73889519869594,0.221197182326396
52.2021697501261,8.74608972977807,0.222972486451496
52.2021697501261,8.75328426086021,0.237503440841143
52.2021697501261,8.76047879194234,0.303504008825686
52.2021697501261,8.76767332302447,0.21674215904773
52.2021697501261,8.7748678541066,0.293884872061889
52.2021697501261,8.78206238518873,0.316539335900386
52.2067152969043,8.45830848649279,0.403009833312399
52.2067152969043,8.46550301757492,0.286270805001154
52.2067152969043,8.47269754865706,0.259199978263454
52.2067152969043,8.47989207973919,0.299607643039002
52.2067152969043,8.48708661082132,0.298092520609751
52.2067152969043,8.49428114190345,0.259199978263454
52.2067152969043,8.50147567298558,0.259199978263454
52.2067152969043,8.50867020406772,0.289176862458122
52.2067152969043,8.51586473514985,0.355430694171018
52.2067152969043,8.52305926623198,0.295338318185327
52.2067152969043,8.53025379731411,0.263649704832998
52.2067152969043,8.53744832839624,0.284865581050655
52.2067152969043,8.54464285947838,0.321420082273447
52.2067152969043,8.55183739056051,0.38515095361526
52.2067152969043,8.55903192164264,0.336886009865388
52.2067152969043,8.56622645272477,0.332525564640073
52.2067152969043,8.5734209838069,0.311129853606934
52.2067152969043,8.58061551488904,0.245392602003994
52.2067152969043,8.58781004597117,0.25640979641246
52.2067152969043,8.5950045770533,0.268137065687161
52.2067152969043,8.60219910813543,0.301808053780401
52.2067152969043,8.60939363921756,0.238574030516951
52.2067152969043,8.6165881702997,0.260473881654777
52.2067152969043,8.62378270138183,0.298322552792879
52.2067152969043,8.63097723246396,0.306778217004044
52.2067152969043,8.63817176354609,0.299746731260993
52.2067152969043,8.64536629462823,0.297961590770936
52.2067152969043,8.65256082571036,0.236678083222576
52.2067152969043,8.65975535679249,0.258224424734606
52.2067152969043,8.66694988787462,0.251524430844899
52.2067152969043,8.67414441895675,0.276407206987318
52.2067152969043,8.68133895003889,0.331481436879963
52.2067152969043,8.68853348112102,0.315666632528636
52.2067152969043,8.69572801220315,0.286632153895273
52.2067152969043,8.70292254328528,0.289644656013568
52.2067152969043,8.71011707436741,0.295640063812182
52.2067152969043,8.71731160544955,0.375325215643804
52.2067152969043,8.72450613653168,0.256857585775247
52.2067152969043,8.73170066761381,0.257974337075118
52.2067152969043,8.73889519869594,0.26441960784827
52.2067152969043,8.74608972977807,0.320178450945163
52.2067152969043,8.75328426086021,0.274402515651602
52.2067152969043,8.76047879194234,0.428850409662172
52.2067152969043,8.76767332302447,0.259199978263454
52.2067152969043,8.7748678541066,0.289345750055156
52.2067152969043,8.78206238518873,0.345105057964021
52.2112608436826,8.45111395541066,0.258775329548272
52.2112608436826,8.45830848649279,0.264930128426734
52.2112608436826,8.46550301757492,0.260509366691693
52.2112608436826,8.47269754865706,0.259199978263454
52.2112608436826,8.47989207973919,0.300885315711897
52.2112608436826,8.48708661082132,0.30212908021191
52.2112608436826,8.49428114190345,0.259199978263454
52.2112608436826,8.50147567298558,0.262766956333111
52.2112608436826,8.50867020406772,0.30993151011182
52.2112608436826,8.51586473514985,0.261144915340464
52.2112608436826,8.52305926623198,0.259199978263454
52.2112608436826,8.53025379731411,0.259199978263454
52.2112608436826,8.53744832839624,0.28470075508347
52.2112608436826,8.54464285947838,0.385595838694969
52.2112608436826,8.55183739056051,0.426633292349706
52.2112608436826,8.55903192164264,0.299694043580436
52.2112608436826,8.56622645272477,0.286026384410423
52.2112608436826,8.5734209838069,0.263485688860241
52.2112608436826,8.58061551488904,0.355572324537431
52.2112608436826,8.58781004597117,0.294607769246099
52.2112608436826,8.5950045770533,0.375212761234637
52.2112608436826,8.60219910813543,0.356152053487432
52.2112608436826,8.60939363921756,0.240145126872871
52.2112608436826,8.6165881702997,0.306621679411386
52.2112608436826,8.62378270138183,0.259199978263454
52.2112608436826,8.63097723246396,0.257671300190575
52.2112608436826,8.63817176354609,0.255299297662101
52.2112608436826,8.64536629462823,0.259199978263454
52.2112608436826,8.65256082571036,0.25371369574186
52.2112608436826,8.65975535679249,0.259199978263454
52.2112608436826,8.66694988787462,0.259199978263454
52.2112608436826,8.67414441895675,0.26575361236881
52.2112608436826,8.68133895003889,0.340233167890925
52.2112608436826,8.68853348112102,0.320062216625732
52.2112608436826,8.69572801220315,0.208891298076509
52.2112608436826,8.70292254328528,0.26029259619097
52.2112608436826,8.71011707436741,0.262417969970244
52.2112608436826,8.71731160544955,0.251026188520392
52.2112608436826,8.72450613653168,0.187168741246865
52.2112608436826,8.73170066761381,0.281964111001607
52.2112608436826,8.73889519869594,0.277441850599316
52.2112608436826,8.74608972977807,0.33090490304044
52.2112608436826,8.75328426086021,0.259199978263454
52.2112608436826,8.76047879194234,0.297555109959943
52.2112608436826,8.76767332302447,0.28816726467919
52.2158063904608,8.45111395541066,0.259199978263454
52.2158063904608,8.45830848649279,0.265394639231414
52.2158063904608,8.46550301757492,0.259199978263454
52.2158063904608,8.47269754865706,0.264381526642964
52.2158063904608,8.47989207973919,0.259199978263454
52.2158063904608,8.48708661082132,0.264528785693126
52.2158063904608,8.49428114190345,0.259199978263454
52.2158063904608,8.50147567298558,0.259199978263454
52.2158063904608,8.50867020406772,0.259199978263454
52.2158063904608,8.51586473514985,0.259199978263454
52.2158063904608,8.52305926623198,0.259199978263454
52.2158063904608,8.53025379731411,0.259199978263454
52.2158063904608,8.53744832839624,0.247976698366203
52.2158063904608,8.54464285947838,0.261260755569532
52.2158063904608,8.55183739056051,0.267092185705905
52.2158063904608,8.55903192164264,0.264231863768478
52.2158063904608,8.56622645272477,0.259199978263454
52.2158063904608,8.5734209838069,0.259199978263454
52.2158063904608,8.58061551488904,0.259199978263454
52.2158063904608,8.58781004597117,0.261183811819087
52.2158063904608,8.5950045770533,0.265019071759341
52.2158063904608,8.60219910813543,0.286906797400158
52.2158063904608,8.60939363921756,0.279434047358498
52.2158063904608,8.6165881702997,0.259199978263454
52.2158063904608,8.62378270138183,0.248473393911136
52.2158063904608,8.63097723246396,0.245434875399645
52.2158063904608,8.63817176354609,0.181262187386721
52.2158063904608,8.64536629462823,0.255286571457736
52.2158063904608,8.65256082571036,0.262843155639702
52.2158063904608,8.65975535679249,0.261045111489959
52.2158063904608,8.66694988787462,0.259199978263454
52.2158063904608,8.67414441895675,0.259199978263454
52.2158063904608,8.68133895003889,0.259199978263454
52.2158063904608,8.68853348112102,0.252691497259265
52.2158063904608,8.69572801220315,0.240946916240125
52.2158063904608,8.70292254328528,0.249690854266735
52.2158063904608,8.71011707436741,0.306130272495236
52.2158063904608,8.71731160544955,0.283528793404414
52.2158063904608,8.72450613653168,0.267308019266876
52.2158063904608,8.73170066761381,0.383846225377719
52.2158063904608,8.73889519869594,0.242152875095284
52.2158063904608,8.74608972977807,0.25641143920333
52.2158063904608,8.75328426086021,0.260031921200315
52.2203519372391,8.45830848649279,0.289666347495395
52.2203519372391,8.46550301757492,0.275682371113682
52.2203519372391,8.47269754865706,0.287745929496667
52.2203519372391,8.47989207973919,0.271818483477919
52.2203519372391,8.48708661082132,0.309851991104863
52.2203519372391,8.49428114190345,0.299055126027189
52.2203519372391,8.50147567298558,0.273584891104934
52.2203519372391,8.50867020406772,0.259199978263454
52.2203519372391,8.51586473514985,0.259199978263454
52.2203519372391,8.52305926623198,0.259580667834827
52.2203519372391,8.53025379731411,0.259199978263454
52.2203519372391,8.53744832839624,0.269535348041346
52.2203519372391,8.54464285947838,0.244428357331729
52.2203519372391,8.55183739056051,0.259199978263454
52.2203519372391,8.55903192164264,0.259199978263454
52.2203519372391,8.56622645272477,0.259199978263454
52.2203519372391,8.5734209838069,0.259199978263454
52.2203519372391,8.58061551488904,0.259634123940854
52.2203519372391,8.58781004597117,0.273728044767437
52.2203519372391,8.5950045770533,0.276033899364839
52.2203519372391,8.60219910813543,0.27505567206134
52.2203519372391,8.60939363921756,0.268276083915866
52.2203519372391,8.6165881702997,0.259199978263454
52.2203519372391,8.62378270138183,0.259199978263454
52.2203519372391,8.63097723246396,0.259199978263454
52.2203519372391,8.63817176354609,0.213135831403343
52.2203519372391,8.64536629462823,0.254272358689102
52.2203519372391,8.65256082571036,0.284715657295744
52.2203519372391,8.65975535679249,0.286417772369873
52.2203519372391,8.66694988787462,0.300936629474812
52.2203519372391,8.67414441895675,0.259199978263454
52.2203519372391,8.68133895003889,0.259199978263454
52.2203519372391,8.68853348112102,0.259199978263454
52.2203519372391,8.69572801220315,0.259199978263454
52.2203519372391,8.70292254328528,0.307675074579323
52.2203519372391,8.71011707436741,0.39751333839477
52.2203519372391,8.71731160544955,0.258998845730994
52.2203519372391,8.72450613653168,0.247268258199306
52.2203519372391,8.73170066761381,0.246426688834979
52.2203519372391,8.73889519869594,0.278694677681299
52.2203519372391,8.74608972977807,0.276859970052506
52.2203519372391,8.75328426086021,0.276739934754381
52.2248974840174,8.45830848649279,0.261125083147038
52.2248974840174,8.46550301757492,0.260439836441443
52.2248974840174,8.47269754865706,0.259199978263454
52.2248974840174,8.47989207973919,0.259199978263454
52.2248974840174,8.48708661082132,0.257248007098492
52.2248974840174,8.49428114190345,0.261924911664854
52.2248974840174,8.50147567298558,0.259199978263454
52.2248974840174,8.50867020406772,0.259199978263454
52.2248974840174,8.51586473514985,0.354227132062748
52.2248974840174,8.52305926623198,0.342087583154213
52.2248974840174,8.53025379731411,0.259199978263454
52.2248974840174,8.53744832839624,0.25518372707424
52.2248974840174,8.54464285947838,0.21788217487701
52.2248974840174,8.55183739056051,0.259199978263454
52.2248974840174,8.55903192164264,0.259199978263454
52.2248974840174,8.56622645272477,0.259199978263454
52.2248974840174,8.5734209838069,0.252786881604059
52.2248974840174,8.58061551488904,0.328881329339787
52.2248974840174,8.58781004597117,0.272286207476947
52.2248974840174,8.5950045770533,0.259199978263454
52.2248974840174,8.60219910813543,0.259199978263454
52.2248974840174,8.60939363921756,0.259199978263454
52.2248974840174,8.6165881702997,0.259199978263454
52.2248974840174,8.62378270138183,0.259199978263454
52.2248974840174,8.63097723246396,0.268355298364286
52.2248974840174,8.63817176354609,0.289373119934274
52.2248974840174,8.64536629462823,0.259199978263454
52.2248974840174,8.65256082571036,0.259199978263454
52.2248974840174,8.65975535679249,0.268990087384225
52.2248974840174,8.66694988787462,0.289541719623827
52.2248974840174,8.67414441895675,0.259199978263454
52.2248974840174,8.68133895003889,0.295014062302138
52.2248974840174,8.68853348112102,0.350624888753025
52.2248974840174,8.69572801220315,0.259199978263454
52.2248974840174,8.70292254328528,0.239188524860342
52.2248974840174,8.71011707436741,0.219194890271991
52.2248974840174,8.71731160544955,0.259199978263454
52.2248974840174,8.72450613653168,0.248398982583819
52.2248974840174,8.73170066761381,0.257146486836664
52.2248974840174,8.73889519869594,0.259199978263454
52.2248974840174,8.74608972977807,0.242670354503994
52.2248974840174,8.75328426086021,0.258471310851799
52.2294430307956,8.46550301757492,0.291127504127395
52.2294430307956,8.47269754865706,0.277330611660862
52.2294430307956,8.47989207973919,0.259199978263454
52.2294430307956,8.48708661082132,0.259199978263454
52.2294430307956,8.49428114190345,0.259199978263454
52.2294430307956,8.50147567298558,0.259199978263454
52.2294430307956,8.50867020406772,0.259199978263454
52.2294430307956,8.51586473514985,0.259933548728169
52.2294430307956,8.52305926623198,0.259588427617929
52.2294430307956,8.53025379731411,0.259199978263454
52.2294430307956,8.53744832839624,0.259199978263454
52.2294430307956,8.54464285947838,0.259199978263454
52.2294430307956,8.55183739056051,0.259199978263454
52.2294430307956,8.55903192164264,0.28319794960773
52.2294430307956,8.56622645272477,0.284866539990908
52.2294430307956,8.5734209838069,0.278429526034206
52.2294430307956,8.58061551488904,0.383862252574319
52.2294430307956,8.58781004597117,0.222664801416862
52.2294430307956,8.5950045770533,0.252477293271754
52.2294430307956,8.60219910813543,0.259199978263454
52.2294430307956,8.60939363921756,0.259199978263454
52.2294430307956,8.6165881702997,0.259199978263454
52.2294430307956,8.62378270138183,0.259199978263454
52.2294430307956,8.63097723246396,0.272479192100352
52.2294430307956,8.63817176354609,0.287589972947035
52.2294430307956,8.64536629462823,0.291958633839939
52.2294430307956,8.65256082571036,0.31258394259095
52.2294430307956,8.65975535679249,0.259199978263454
52.2294430307956,8.66694988787462,0.335472739718636
52.2294430307956,8.67414441895675,0.276199949578097
52.2294430307956,8.68133895003889,0.259199978263454
52.2294430307956,8.68853348112102,0.269161292304741
52.2294430307956,8.69572801220315,0.267003985046608
52.2294430307956,8.70292254328528,0.269468780803721
52.2294430307956,8.71011707436741,0.257027200248208
52.2294430307956,8.71731160544955,0.259199978263454
52.2294430307956,8.72450613653168,0.259199978263454
52.2294430307956,8.73170066761381,0.259199978263454
52.2294430307956,8.73889519869594,0.268871229026995
52.2294430307956,8.74608972977807,0.259199978263454
52.2339885775739,8.46550301757492,0.364156884966771
52.2339885775739,8.47269754865706,0.330165865657446
52.2339885775739,8.47989207973919,0.272833177464127
52.2339885775739,8.48708661082132,0.259199978263454
52.2339885775739,8.49428114190345,0.259199978263454
52.2339885775739,8.50147567298558,0.259199978263454
52.2339885775739,8.50867020406772,0.259199978263454
52.2339885775739,8.51586473514985,0.275735643386881
52.2339885775739,8.52305926623198,0.263322625712137
52.2339885775739,8.53025379731411,0.267356542588472
52.2339885775739,8.53744832839624,0.296170041381519
52.2339885775739,8.54464285947838,0.259199978263454
52.2339885775739,8.55183739056051,0.259199978263454
52.2339885775739,8.55903192164264,0.260506553783518
52.2339885775739,8.56622645272477,0.261407067817561
52.2339885775739,8.5734209838069,0.308870153311599
52.2339885775739,8.58061551488904,0.255999435465489
52.2339885775739,8.58781004597117,0.239423095083884
52.2339885775739,8.5950045770533,0.259199978263454
52.2339885775739,8.60219910813543,0.294655521092051
52.2339885775739,8.60939363921756,0.276068836525236
52.2339885775739,8.6165881702997,0.259199978263454
52.2339885775739,8.62378270138183,0.259199978263454
52.2339885775739,8.63097723246396,0.290925125845545
52.2339885775739,8.63817176354609,0.327801790087912
52.2339885775739,8.64536629462823,0.259199978263454
52.2339885775739,8.65256082571036,0.265353155875884
52.2339885775739,8.65975535679249,0.259199978263454
52.2339885775739,8.66694988787462,0.297616166890725
52.2339885775739,8.67414441895675,0.261738892163569
52.2339885775739,8.68853348112102,0.259199978263454
52.2339885775739,8.69572801220315,0.259199978263454
52.2339885775739,8.70292254328528,0.309641691975529
52.2339885775739,8.71011707436741,0.268414956360768
52.2339885775739,8.71731160544955,0.259199978263454
52.2339885775739,8.72450613653168,0.259199978263454
52.2339885775739,8.73170066761381,0.266089061611722
52.2339885775739,8.73889519869594,0.29808536044744
52.2385341243521,8.46550301757492,0.259199978263454
52.2385341243521,8.47269754865706,0.227445565559154
52.2385341243521,8.47989207973919,0.292402580296277
52.2385341243521,8.48708661082132,0.269883789870823
52.2385341243521,8.49428114190345,0.259199978263454
52.2385341243521,8.50147567298558,0.259199978263454
52.2385341243521,8.50867020406772,0.259199978263454
52.2385341243521,8.51586473514985,0.2960400047109
52.2385341243521,8.52305926623198,0.262974192164314
52.2385341243521,8.53025379731411,0.261654021953361
52.2385341243521,8.53744832839624,0.266718250952103
52.2385341243521,8.54464285947838,0.268554043919401
52.2385341243521,8.55183739056051,0.259199978263454
52.2385341243521,8.55903192164264,0.259199978263454
52.2385341243521,8.56622645272477,0.259199978263454
52.2385341243521,8.5734209838069,0.259199978263454
52.2385341243521,8.58061551488904,0.259199978263454
52.2385341243521,8.58781004597117,0.259199978263454
52.2385341243521,8.5950045770533,0.257197865479197
52.2385341243521,8.60219910813543,0.246245257186615
52.2385341243521,8.60939363921756,0.266534638153702
52.2385341243521,8.6165881702997,0.211369566274476
52.2385341243521,8.62378270138183,0.347036950352497
52.2385341243521,8.63097723246396,0.411654351652142
52.2385341243521,8.63817176354609,0.259199978263454
52.2385341243521,8.64536629462823,0.259199978263454
52.2385341243521,8.65256082571036,0.259199978263454
52.2385341243521,8.65975535679249,0.259199978263454
52.2385341243521,8.66694988787462,0.259199978263454
52.2385341243521,8.67414441895675,0.259199978263454
52.2385341243521,8.69572801220315,0.259199978263454
52.2385341243521,8.70292254328528,0.345102214539826
52.2385341243521,8.71011707436741,0.301452091504391
52.2385341243521,8.71731160544955,0.259199978263454
52.2385341243521,8.72450613653168,0.259199978263454
52.2385341243521,8.73170066761381,0.259199978263454
52.2430796711304,8.46550301757492,0.259199978263454
52.2430796711304,8.47269754865706,0.259199978263454
52.2430796711304,8.47989207973919,0.267093609064792
52.2430796711304,8.48708661082132,0.27137567385879
52.2430796711304,8.49428114190345,0.273380023868295
52.2430796711304,8.50147567298558,0.274624222160755
52.2430796711304,8.50867020406772,0.303046458052624
52.2430796711304,8.51586473514985,0.296802702930394
52.2430796711304,8.52305926623198,0.28656934572064
52.2430796711304,8.53025379731411,0.292953954580713
52.2430796711304,8.53744832839624,0.272786637069017
52.2430796711304,8.54464285947838,0.276643507714229
52.2430796711304,8.55183739056051,0.259199978263454
52.2430796711304,8.55903192164264,0.259199978263454
52.2430796711304,8.56622645272477,0.259199978263454
52.2430796711304,8.5734209838069,0.259199978263454
52.2430796711304,8.58061551488904,0.276488624555047
52.2430796711304,8.58781004597117,0.262144602758343
52.2430796711304,8.5950045770533,0.262146838509186
52.2430796711304,8.60219910813543,0.246702607858195
52.2430796711304,8.60939363921756,0.251629828226827
52.2430796711304,8.6165881702997,0.233370504261329
52.2430796711304,8.62378270138183,0.385843845659804
52.2430796711304,8.63097723246396,0.502607276781979
52.2430796711304,8.63817176354609,0.259199978263454
52.2430796711304,8.64536629462823,0.325296280157135
52.2430796711304,8.65256082571036,0.268119301048649
52.2430796711304,8.65975535679249,0.259199978263454
52.2430796711304,8.66694988787462,0.259199978263454
52.2430796711304,8.70292254328528,0.284226928846985
52.2430796711304,8.71011707436741,0.257399959640627
52.2430796711304,8.71731160544955,0.259199978263454
52.2430796711304,8.73170066761381,0.259199978263454
52.2476252179087,8.47269754865706,0.253012472925309
52.2476252179087,8.47989207973919,0.283502856889941
52.2476252179087,8.48708661082132,0.292845285386803
52.2476252179087,8.49428114190345,0.362792692328483
52.2476252179087,8.50147567298558,0.386489985860975
52.2476252179087,8.50867020406772,0.471536864698384
52.2476252179087,8.51586473514985,0.259199978263454
52.2476252179087,8.52305926623198,0.283306085007946
52.2476252179087,8.53025379731411,0.285823703809149
52.2476252179087,8.53744832839624,0.259199978263454
52.2476252179087,8.54464285947838,0.259199978263454
52.2476252179087,8.55183739056051,0.259199978263454
52.2476252179087,8.55903192164264,0.259199978263454
52.2476252179087,8.56622645272477,0.276641362752514
52.2476252179087,8.5734209838069,0.265932314166955
52.2476252179087,8.58061551488904,0.290406271838631
52.2476252179087,8.58781004597117,0.265643316972953
52.2476252179087,8.5950045770533,0.260182803878812
52.2476252179087,8.60219910813543,0.259199978263454
52.2476252179087,8.60939363921756,0.259199978263454
52.2476252179087,8.6165881702997,0.259199978263454
52.2476252179087,8.62378270138183,0.259199978263454
52.2476252179087,8.63097723246396,0.291728623943082
52.2476252179087,8.63817176354609,0.259199978263454
52.2476252179087,8.64536629462823,0.263121831063423
52.2476252179087,8.65256082571036,0.259199978263454
52.2476252179087,8.65975535679249,0.259199978263454
52.2476252179087,8.70292254328528,0.26757121687611
52.2476252179087,8.71011707436741,0.259199978263454
52.2521707646869,8.46550301757492,0.25521890100611
52.2521707646869,8.47269754865706,0.254547403329237
52.2521707646869,8.47989207973919,0.607995485372812
52.2521707646869,8.48708661082132,0.380070379393087
52.2521707646869,8.49428114190345,0.266433160104052
52.2521707646869,8.50147567298558,0.280374050545685
52.2521707646869,8.50867020406772,0.303738974887107
52.2521707646869,8.51586473514985,0.265129447282405
52.2521707646869,8.52305926623198,0.295780761769237
52.2521707646869,8.53025379731411,0.259199978263454
52.2521707646869,8.53744832839624,0.259199978263454
52.2521707646869,8.54464285947838,0.262417348835742
52.2521707646869,8.55183739056051,0.2622285549696
52.2521707646869,8.55903192164264,0.259199978263454
52.2521707646869,8.56622645272477,0.276606203520946
52.2521707646869,8.5734209838069,0.26590858200064
52.2521707646869,8.58061551488904,0.259199978263454
52.2521707646869,8.58781004597117,0.259199978263454
52.2521707646869,8.5950045770533,0.259199978263454
52.2521707646869,8.60219910813543,0.259199978263454
52.2521707646869,8.60939363921756,0.259199978263454
52.2521707646869,8.6165881702997,0.259199978263454
52.2521707646869,8.62378270138183,0.259199978263454
52.2521707646869,8.63097723246396,0.259199978263454
52.2521707646869,8.63817176354609,0.259199978263454
52.2521707646869,8.64536629462823,0.259199978263454
52.2567163114652,8.46550301757492,0.259013204323994
52.2567163114652,8.47269754865706,0.42330948261295
52.2567163114652,8.47989207973919,0.41581253416852
52.2567163114652,8.48708661082132,0.340298568069408
52.2567163114652,8.49428114190345,0.272212186043151
52.2567163114652,8.50147567298558,0.278521729507938
52.2567163114652,8.50867020406772,0.317443340806572
52.2567163114652,8.51586473514985,0.288993911791441
52.2567163114652,8.52305926623198,0.261428421797091
52.2567163114652,8.53025379731411,0.259199978263454
52.2567163114652,8.53744832839624,0.259199978263454
52.2567163114652,8.54464285947838,0.259942769974432
52.2567163114652,8.55183739056051,0.259827265806715
52.2567163114652,8.55903192164264,0.259199978263454
52.2567163114652,8.6165881702997,0.259199978263454
52.2567163114652,8.62378270138183,0.259199978263454
52.2567163114652,8.63097723246396,0.259199978263454
52.2567163114652,8.63817176354609,0.259199978263454
52.2612618582435,8.46550301757492,0.258311374228604
52.2612618582435,8.47989207973919,0.259199978263454
52.2612618582435,8.48708661082132,0.26136274774657
52.2612618582435,8.49428114190345,0.261429572625851
52.2612618582435,8.50147567298558,0.259199978263454
52.2612618582435,8.50867020406772,0.265394838134411
52.2612618582435,8.51586473514985,0.281312656861543
52.2612618582435,8.52305926623198,0.259199978263454
52.2612618582435,8.53025379731411,0.259199978263454
52.2612618582435,8.53744832839624,0.259199978263454
52.2658074050217,8.46550301757492,0.239823235170046
