nan,nan,5.334836943728641367e-01
9.296732494934365931e+00,4.899648397439805336e+01,5.467411785011947467e-01
9.251789390796128387e+00,4.886305370631104950e+01,5.599870697441093892e-01
9.093894026531778252e+00,4.894047306963397403e+01,5.721006061198624648e-01
9.181051304455799311e+00,4.891040879592279111e+01,5.844660748957866137e-01
8.978798795629067797e+00,4.895259509717246260e+01,5.984517476913180367e-01
8.972337665748652213e+00,4.902156761263294271e+01,6.106662698437050896e-01
9.276226866334818411e+00,4.887053477460634099e+01,6.247205287694630460e-01
9.137524451421517924e+00,4.890245435363752335e+01,6.354358977420337951e-01
9.279716586153211821e+00,4.888808955348753926e+01,6.483386496909887553e-01
9.223463497263741928e+00,4.889615794253029435e+01,6.617755265053038016e-01
