nan,nan,1.751334451815858895e+00
9.774829830166920530e+00,5.357488482636233584e+01,1.762442468016023556e+00
8.495602312829392488e+00,5.389920517683798806e+01,1.773768721353216726e+00
9.841971666358688253e+00,5.347408417904820510e+01,1.784652185165187976e+00
9.909270910022605960e+00,5.364784698754782966e+01,1.797136837890283223e+00
1.023243489062902611e+01,5.342923251512949179e+01,1.808671842843864175e+00
1.021866177353007288e+01,5.340967561755841331e+01,1.819766871089626870e+00
1.015690621832636609e+01,5.358645729322071816e+01,1.831056260894678989e+00
1.021282036316310204e+01,5.345791076700663069e+01,1.842020687240949695e+00
1.016445381983867868e+01,5.363053760881894050e+01,1.853334268132168283e+00
8.632833672605967124e+00,5.391857585079768000e+01,1.863078447075932287e+00
