nan,nan,6.442632578421919609e-02
1.187373783763533730e+01,5.129806016670639934e+01,7.702032777407386011e-02
1.179360276058147150e+01,5.130114096613151276e+01,8.897664148899195324e-02
1.217460692974622916e+01,5.150053481904759423e+01,1.005299951821016918e-01
1.195504095920954235e+01,5.155463256810480033e+01,1.130851895204654511e-01
1.187865395313833261e+01,5.128092790327814754e+01,1.246573743448740473e-01
1.200232575114919165e+01,5.135994750943653031e+01,1.373233094476826455e-01
1.214886179298454749e+01,5.135911064798190750e+01,1.495381135206458878e-01
1.197337554732977694e+01,5.134188469683178369e+01,1.634439534290512974e-01
1.206952509633623372e+01,5.129502414141281008e+01,1.754918510271958332e-01
1.150829942111951176e+01,5.134422427924037180e+01,1.883612864235099937e-01
