nan,nan,3.173079706713488046e-01
6.660926383535252349e+00,5.121775486193353544e+01,3.340228499984595478e-01
6.462858531721985322e+00,5.110196030955129487e+01,3.475788075569408719e-01
6.684522197870280458e+00,5.112123412404336875e+01,3.600218681938453513e-01
6.742930290772326529e+00,5.117708317428063225e+01,3.729739168546507000e-01
6.766172450343345801e+00,5.111351415473903614e+01,3.869544933184036473e-01
6.624491796311720471e+00,5.127416040602758329e+01,4.004005649519831178e-01
6.706512392782702392e+00,5.118446977941195541e+01,4.120843939083414509e-01
6.569915634410375738e+00,5.107259876293680634e+01,4.244378497881636236e-01
6.725664525414395634e+00,5.116730553635755285e+01,4.364190911106879400e-01
6.593679685908349519e+00,5.107168649760746604e+01,4.491555714599030358e-01
