50.9779656,13.7918369287366,0.306321065969254
50.9779656,13.7990314333344,0.270481261611735
50.9779656,13.8134204425299,0.259199978263454
50.9779656,13.8206149471276,0.259199978263454
50.9825917379339,13.7918369287366,0.331172326247033
50.9825917379339,13.7990314333344,0.436330642121002
50.9825917379339,13.8062259379321,0.312142434048042
50.9825917379339,13.8134204425299,0.238398967500071
50.9825917379339,13.8206149471276,0.259199978263454
50.9825917379339,13.8278094517253,0.259199978263454
50.9825917379339,13.8350039563231,0.259199978263454
50.9872178758677,13.7918369287366,0.391035756127364
50.9872178758677,13.7990314333344,0.448346234908847
50.9872178758677,13.8062259379321,0.36263212791857
50.9872178758677,13.8134204425299,0.394154485008508
50.9872178758677,13.8206149471276,0.281388977012913
50.9872178758677,13.8278094517253,0.259199978263454
50.9872178758677,13.8350039563231,0.317079115193894
50.9872178758677,13.8709764793118,0.259199978263454
50.9872178758677,13.8781709839095,0.259199978263454
50.9918440138016,13.7702534149434,0.270764189431641
50.9918440138016,13.7774479195412,0.390017868842793
50.9918440138016,13.7846424241389,0.349827476670868
50.9918440138016,13.7918369287366,0.371386203056395
50.9918440138016,13.7990314333344,0.420120339782376
50.9918440138016,13.8062259379321,0.376432096018794
50.9918440138016,13.8134204425299,0.390327436700132
50.9918440138016,13.8206149471276,0.318526215565036
50.9918440138016,13.8278094517253,0.320988860375885
50.9918440138016,13.8350039563231,0.271301224268283
50.9918440138016,13.8421984609208,0.260112934110526
50.9918440138016,13.8493929655185,0.406837291425505
50.9918440138016,13.8565874701163,0.28313832185189
50.9918440138016,13.863781974714,0.284034747748496
50.9918440138016,13.8709764793118,0.285264647778652
50.9918440138016,13.8781709839095,0.314393116139841
50.9918440138016,13.8853654885072,0.364744056996325
50.9918440138016,13.892559993105,0.242350805112249
50.9964701517354,13.7702534149434,0.259199978263454
50.9964701517354,13.7774479195412,0.275510246234246
50.9964701517354,13.7846424241389,0.322886965639647
50.9964701517354,13.7918369287366,0.422555577179184
50.9964701517354,13.7990314333344,0.493951615241659
50.9964701517354,13.8062259379321,0.392434621935724
50.9964701517354,13.8134204425299,0.291682623128286
50.9964701517354,13.8206149471276,0.380777680552961
50.9964701517354,13.8278094517253,0.463193586774205
50.9964701517354,13.8350039563231,0.270944561726749
50.9964701517354,13.8421984609208,0.369550159449903
50.9964701517354,13.8493929655185,0.322301673820515
50.9964701517354,13.8565874701163,0.353800240769963
50.9964701517354,13.863781974714,0.308773590390368
50.9964701517354,13.8709764793118,0.282585556646804
50.9964701517354,13.8781709839095,0.285174608136355
50.9964701517354,13.8853654885072,0.319030185306507
50.9964701517354,13.892559993105,0.252136059543542
50.9964701517354,13.8997544977027,0.27363897183652
51.0010962896693,13.755864405748,0.262883621504514
51.0010962896693,13.7702534149434,0.260160930836819
51.0010962896693,13.7774479195412,0.259199978263454
51.0010962896693,13.7846424241389,0.287259581562002
51.0010962896693,13.7918369287366,0.455367833545977
51.0010962896693,13.7990314333344,0.447622610817203
51.0010962896693,13.8062259379321,0.280289064417817
51.0010962896693,13.8134204425299,0.297876600336291
51.0010962896693,13.8206149471276,0.340969335506492
51.0010962896693,13.8278094517253,0.555899456938599
51.0010962896693,13.8350039563231,0.443832754867175
51.0010962896693,13.8421984609208,0.517583963362403
51.0010962896693,13.8493929655185,0.440553295834342
51.0010962896693,13.8565874701163,0.369579479266151
51.0010962896693,13.863781974714,0.217899311984624
51.0010962896693,13.8709764793118,0.338571548463482
51.0010962896693,13.8781709839095,0.28037976173926
51.0010962896693,13.8853654885072,0.307869355128417
51.0010962896693,13.892559993105,0.227515224557272
51.0010962896693,13.8997544977027,0.275838257788073
51.0010962896693,13.9069490023004,0.268724125897523
51.0057224276032,13.6911138643683,0.443132404755879
51.0057224276032,13.6983083689661,0.301761324206368
51.0057224276032,13.7055028735638,0.259199978263454
51.0057224276032,13.7486699011502,0.259199978263454
51.0057224276032,13.755864405748,0.319692727201045
51.0057224276032,13.7630589103457,0.538955689428481
51.0057224276032,13.7702534149434,0.279644551642929
51.0057224276032,13.7774479195412,0.29077373577276
51.0057224276032,13.7846424241389,0.372131355127584
51.0057224276032,13.7918369287366,0.468582368486807
51.0057224276032,13.7990314333344,0.522274341298581
51.0057224276032,13.8062259379321,0.266707661848707
51.0057224276032,13.8134204425299,0.339399826498235
51.0057224276032,13.8206149471276,0.331671279512225
51.0057224276032,13.8278094517253,0.554487111186695
51.0057224276032,13.8350039563231,0.352460314646656
51.0057224276032,13.8421984609208,0.454505237758598
51.0057224276032,13.8493929655185,0.582055504501287
51.0057224276032,13.8565874701163,0.364378153275182
51.0057224276032,13.863781974714,0.389805599855968
51.0057224276032,13.8709764793118,0.487906760364025
51.0057224276032,13.8781709839095,0.36858063114636
51.0057224276032,13.8853654885072,0.30285861024369
51.0057224276032,13.892559993105,0.236903443755712
51.0057224276032,13.8997544977027,0.257198686688957
51.0057224276032,13.9069490023004,0.259199978263454
51.010348565537,13.6839193597706,0.307442215750088
51.010348565537,13.6911138643683,0.589049175467825
51.010348565537,13.6983083689661,0.425014702891897
51.010348565537,13.7055028735638,0.332531287827688
51.010348565537,13.7126973781615,0.259199978263454
51.010348565537,13.7198918827593,0.259199978263454
51.010348565537,13.727086387357,0.316245099539336
51.010348565537,13.7342808919547,0.29520569288328
51.010348565537,13.7414753965525,0.298054278185521
51.010348565537,13.7486699011502,0.354755327680611
51.010348565537,13.755864405748,0.34559478241809
51.010348565537,13.7630589103457,0.484078716438135
51.010348565537,13.7702534149434,0.328939468055737
51.010348565537,13.7774479195412,0.355984232419996
51.010348565537,13.7846424241389,0.432217749016703
51.010348565537,13.7918369287366,0.426020412571261
51.010348565537,13.7990314333344,0.400762999600593
51.010348565537,13.8062259379321,0.332584611643337
51.010348565537,13.8134204425299,0.474693056717086
51.010348565537,13.8206149471276,0.361974450439724
51.010348565537,13.8278094517253,0.628496116112205
51.010348565537,13.8350039563231,0.392512542056968
51.010348565537,13.8421984609208,0.451453258938477
51.010348565537,13.8493929655185,0.536048633478986
51.010348565537,13.8565874701163,0.354678884852975
51.010348565537,13.863781974714,0.373732320316579
51.010348565537,13.8709764793118,0.668576003462795
51.010348565537,13.8781709839095,0.454688683476559
51.010348565537,13.8853654885072,0.270438462878453
51.010348565537,13.892559993105,0.259199978263454
51.010348565537,13.8997544977027,0.259199978263454
51.010348565537,13.9069490023004,0.259199978263454
51.0149747034709,13.6695303505751,0.277449228566509
51.0149747034709,13.6839193597706,0.344901275625475
51.0149747034709,13.6911138643683,0.46076526801146
51.0149747034709,13.6983083689661,0.42206353318783
51.0149747034709,13.7055028735638,0.412844933672324
51.0149747034709,13.7126973781615,0.328772649128264
51.0149747034709,13.7198918827593,0.323347788813066
51.0149747034709,13.727086387357,0.416791121852699
51.0149747034709,13.7342808919547,0.424939936123436
51.0149747034709,13.7414753965525,0.441005227630843
51.0149747034709,13.7486699011502,0.403351856902431
51.0149747034709,13.755864405748,0.441338370553664
51.0149747034709,13.7630589103457,0.575006858349696
51.0149747034709,13.7702534149434,0.590909172093298
51.0149747034709,13.7774479195412,0.316300323030403
51.0149747034709,13.7846424241389,0.420417553629567
51.0149747034709,13.7918369287366,0.480872736622904
51.0149747034709,13.7990314333344,0.271310292203882
51.0149747034709,13.8062259379321,0.307342630560513
51.0149747034709,13.8134204425299,0.425799736184054
51.0149747034709,13.8206149471276,0.252985617966485
51.0149747034709,13.8278094517253,0.482953002219725
51.0149747034709,13.8350039563231,0.373378715882146
51.0149747034709,13.8421984609208,0.489756857381244
51.0149747034709,13.8493929655185,0.276152614092016
51.0149747034709,13.8565874701163,0.265479217890689
51.0149747034709,13.863781974714,0.477140621443609
51.0149747034709,13.8709764793118,0.484017447640464
51.0149747034709,13.8781709839095,0.372126157709236
51.0149747034709,13.8853654885072,0.259199978263454
51.0149747034709,13.892559993105,0.27300872702932
51.0149747034709,13.8997544977027,0.260269810234761
51.0149747034709,13.9069490023004,0.2481482849629
51.0149747034709,13.9213380114959,0.259199978263454
51.0196008414048,13.6695303505751,0.261890548040333
51.0196008414048,13.6767248551728,0.238829368245036
51.0196008414048,13.6839193597706,0.265032649002352
51.0196008414048,13.6911138643683,0.319494804326664
51.0196008414048,13.6983083689661,0.455415840523564
51.0196008414048,13.7055028735638,0.511127917115082
51.0196008414048,13.7126973781615,0.463641399876597
51.0196008414048,13.7198918827593,0.420051859922676
51.0196008414048,13.727086387357,0.326848981189401
51.0196008414048,13.7342808919547,0.32256339965668
51.0196008414048,13.7414753965525,0.420700521652408
51.0196008414048,13.7486699011502,0.429524200652006
51.0196008414048,13.755864405748,0.359657873306647
51.0196008414048,13.7630589103457,0.539495989727325
51.0196008414048,13.7702534149434,0.580936572306157
51.0196008414048,13.7774479195412,0.568310279413286
51.0196008414048,13.7846424241389,0.419417735339261
51.0196008414048,13.7918369287366,0.338686413094903
51.0196008414048,13.7990314333344,0.31184196181264
51.0196008414048,13.8062259379321,0.420230314639256
51.0196008414048,13.8134204425299,0.385872278019874
51.0196008414048,13.8206149471276,0.351526257989623
51.0196008414048,13.8278094517253,0.27228203072091
51.0196008414048,13.8350039563231,0.340878156950168
51.0196008414048,13.8421984609208,0.344845238670068
51.0196008414048,13.8493929655185,0.270180578137112
51.0196008414048,13.8565874701163,0.239546564960745
51.0196008414048,13.863781974714,0.306849427993139
51.0196008414048,13.8709764793118,0.259199978263454
51.0196008414048,13.8781709839095,0.259199978263454
51.0196008414048,13.8853654885072,0.259199978263454
51.0196008414048,13.892559993105,0.287908914447596
51.0196008414048,13.8997544977027,0.271818377842361
51.0196008414048,13.9069490023004,0.246586901074924
51.0196008414048,13.9141435068982,0.308419713507964
51.0196008414048,13.9213380114959,0.259199978263454
51.0196008414048,13.9285325160937,0.259199978263454
51.0196008414048,13.9357270206914,0.259199978263454
51.0242269793386,13.6695303505751,0.259199978263454
51.0242269793386,13.6767248551728,0.259199978263454
51.0242269793386,13.6839193597706,0.295585398391562
51.0242269793386,13.6911138643683,0.396215038741711
51.0242269793386,13.6983083689661,0.343979466586851
51.0242269793386,13.7055028735638,0.539167697335336
51.0242269793386,13.7126973781615,0.518905804236373
51.0242269793386,13.7198918827593,0.491308443054779
51.0242269793386,13.727086387357,0.434860675675752
51.0242269793386,13.7342808919547,0.540184489517604
51.0242269793386,13.7414753965525,0.5247403232907
51.0242269793386,13.7486699011502,0.398258631165051
51.0242269793386,13.755864405748,0.511986076651357
51.0242269793386,13.7630589103457,0.703942419763276
51.0242269793386,13.7702534149434,0.376323950527747
51.0242269793386,13.7774479195412,0.56965986575769
51.0242269793386,13.7846424241389,0.463316893139082
51.0242269793386,13.7918369287366,0.631994024279049
51.0242269793386,13.7990314333344,0.445122265668282
51.0242269793386,13.8062259379321,0.484168829162388
51.0242269793386,13.8134204425299,0.435377657195699
51.0242269793386,13.8206149471276,0.348846368163951
51.0242269793386,13.8278094517253,0.344438302815662
51.0242269793386,13.8350039563231,0.561300881953199
51.0242269793386,13.8421984609208,0.476603554896105
51.0242269793386,13.8493929655185,0.259553011578151
51.0242269793386,13.8565874701163,0.261947868589801
51.0242269793386,13.863781974714,0.311639823444834
51.0242269793386,13.8709764793118,0.2611980661615
51.0242269793386,13.8781709839095,0.296850189755725
51.0242269793386,13.8853654885072,0.339171500687131
51.0242269793386,13.892559993105,0.259199978263454
51.0242269793386,13.8997544977027,0.29439013188353
51.0242269793386,13.9069490023004,0.311967602140971
51.0242269793386,13.9141435068982,0.267413987477935
51.0242269793386,13.9213380114959,0.259199978263454
51.0242269793386,13.9285325160937,0.259199978263454
51.0242269793386,13.9357270206914,0.259199978263454
51.0242269793386,13.9429215252891,0.259199978263454
51.0288531172725,13.6695303505751,0.261643163701085
51.0288531172725,13.6767248551728,0.289958622013849
51.0288531172725,13.6839193597706,0.381267364859476
51.0288531172725,13.6911138643683,0.498103866982013
51.0288531172725,13.6983083689661,0.513869035856247
51.0288531172725,13.7055028735638,0.849747213572078
51.0288531172725,13.7126973781615,0.64414262372216
51.0288531172725,13.7198918827593,0.605938909975272
51.0288531172725,13.727086387357,0.686367307671261
51.0288531172725,13.7342808919547,0.597404819855865
51.0288531172725,13.7414753965525,0.61989145937082
51.0288531172725,13.7486699011502,0.709174623488381
51.0288531172725,13.755864405748,0.568986044518109
51.0288531172725,13.7630589103457,0.808485536335758
51.0288531172725,13.7702534149434,0.480710930440058
51.0288531172725,13.7774479195412,0.490099559401198
51.0288531172725,13.7846424241389,0.538484227455145
51.0288531172725,13.7918369287366,0.40440778094971
51.0288531172725,13.7990314333344,0.639001382400366
51.0288531172725,13.8062259379321,0.671005960549629
51.0288531172725,13.8134204425299,0.396909375364998
51.0288531172725,13.8206149471276,0.509897472080747
51.0288531172725,13.8278094517253,0.473470478487601
51.0288531172725,13.8350039563231,0.431494284058064
51.0288531172725,13.8421984609208,0.28852362691125
51.0288531172725,13.8493929655185,0.292623229599616
51.0288531172725,13.8565874701163,0.259199978263454
51.0288531172725,13.863781974714,0.348950034120559
51.0288531172725,13.8709764793118,0.260881512999805
51.0288531172725,13.8781709839095,0.244964671212799
51.0288531172725,13.8853654885072,0.293531653453007
51.0288531172725,13.892559993105,0.274877556415151
51.0288531172725,13.8997544977027,0.329337975576481
51.0288531172725,13.9069490023004,0.283167936068932
51.0288531172725,13.9141435068982,0.259199978263454
51.0288531172725,13.9213380114959,0.259199978263454
51.0288531172725,13.9285325160937,0.259199978263454
51.0288531172725,13.9357270206914,0.259199978263454
51.0288531172725,13.9429215252891,0.259199978263454
51.0288531172725,13.9501160298869,0.259199978263454
51.0288531172725,13.9573105344846,0.259199978263454
51.0334792552063,13.6047798091955,0.259199978263454
51.0334792552063,13.6119743137932,0.259199978263454
51.0334792552063,13.6263633229887,0.310178130374602
51.0334792552063,13.6335578275864,0.404108198848184
51.0334792552063,13.6407523321842,0.31844360270999
51.0334792552063,13.6479468367819,0.384089716329703
51.0334792552063,13.6695303505751,0.323289110793116
51.0334792552063,13.6767248551728,0.415389652032129
51.0334792552063,13.6839193597706,0.411341317637779
51.0334792552063,13.6911138643683,0.427629444565479
51.0334792552063,13.6983083689661,0.676964577501817
51.0334792552063,13.7055028735638,0.625024370118194
51.0334792552063,13.7126973781615,0.630791353472415
51.0334792552063,13.7198918827593,0.738193866516094
51.0334792552063,13.727086387357,0.745465604536724
51.0334792552063,13.7342808919547,0.600893307807763
51.0334792552063,13.7414753965525,0.668074831965756
51.0334792552063,13.7486699011502,0.63201428704456
51.0334792552063,13.755864405748,0.421969211712606
51.0334792552063,13.7630589103457,0.368469172560346
51.0334792552063,13.7702534149434,0.355242515450913
51.0334792552063,13.7774479195412,0.483309202915467
51.0334792552063,13.7846424241389,0.870806316211459
51.0334792552063,13.7918369287366,0.423798124443174
51.0334792552063,13.7990314333344,0.343065751974236
51.0334792552063,13.8062259379321,0.495961826668546
51.0334792552063,13.8134204425299,0.443848493663127
51.0334792552063,13.8206149471276,0.520390537554742
51.0334792552063,13.8278094517253,0.428114605147326
51.0334792552063,13.8350039563231,0.333250890414854
51.0334792552063,13.8421984609208,0.291696397083036
51.0334792552063,13.8493929655185,0.29003170766656
51.0334792552063,13.8565874701163,0.300136317417406
51.0334792552063,13.863781974714,0.30550968579967
51.0334792552063,13.8709764793118,0.259199978263454
51.0334792552063,13.8781709839095,0.25175891527165
51.0334792552063,13.8853654885072,0.328340834652946
51.0334792552063,13.892559993105,0.354178336720663
51.0334792552063,13.8997544977027,0.333107026266927
51.0334792552063,13.9069490023004,0.259199978263454
51.0334792552063,13.9141435068982,0.272874148387725
51.0334792552063,13.9213380114959,0.259199978263454
51.0334792552063,13.9285325160937,0.259199978263454
51.0334792552063,13.9357270206914,0.265319195178746
51.0334792552063,13.9429215252891,0.269092522656695
51.0334792552063,13.9501160298869,0.254826635413346
51.0334792552063,13.9573105344846,0.269258359171523
51.0381053931402,13.6047798091955,0.259199978263454
51.0381053931402,13.6119743137932,0.259199978263454
51.0381053931402,13.6191688183909,0.259199978263454
51.0381053931402,13.6263633229887,0.301847552255532
51.0381053931402,13.6335578275864,0.452312697688941
51.0381053931402,13.6407523321842,0.253878319599536
51.0381053931402,13.6479468367819,0.451253266751008
51.0381053931402,13.6551413413796,0.210932268202898
51.0381053931402,13.6623358459774,0.348199627445329
51.0381053931402,13.6695303505751,0.433408154721127
51.0381053931402,13.6767248551728,0.458386526680975
51.0381053931402,13.6839193597706,0.52112722547924
51.0381053931402,13.6911138643683,0.611383940026077
51.0381053931402,13.6983083689661,0.748359490533113
51.0381053931402,13.7055028735638,0.60047337013455
51.0381053931402,13.7126973781615,0.405287217315466
51.0381053931402,13.7198918827593,0.56585699686456
51.0381053931402,13.727086387357,0.534842601247802
51.0381053931402,13.7342808919547,0.764788437090258
51.0381053931402,13.7414753965525,0.483773519618987
51.0381053931402,13.7486699011502,0.547635437619841
51.0381053931402,13.755864405748,0.377151388540066
51.0381053931402,13.7630589103457,0.418382873476628
51.0381053931402,13.7702534149434,0.301354951628232
51.0381053931402,13.7774479195412,0.411823749179485
51.0381053931402,13.7846424241389,0.544526700207041
51.0381053931402,13.7918369287366,0.483285554132118
51.0381053931402,13.7990314333344,0.561278719854053
51.0381053931402,13.8062259379321,0.762503762407026
51.0381053931402,13.8134204425299,0.389531569962588
51.0381053931402,13.8206149471276,0.404105357206358
51.0381053931402,13.8278094517253,0.360393745331469
51.0381053931402,13.8350039563231,0.387441556302652
51.0381053931402,13.8421984609208,0.370110311174722
51.0381053931402,13.8493929655185,0.29468245314229
51.0381053931402,13.8565874701163,0.27364779709916
51.0381053931402,13.863781974714,0.33739940671768
51.0381053931402,13.8709764793118,0.289345632184815
51.0381053931402,13.8781709839095,0.314967926655658
51.0381053931402,13.8853654885072,0.433356340523202
51.0381053931402,13.892559993105,0.261634958684572
51.0381053931402,13.8997544977027,0.259199978263454
51.0381053931402,13.9069490023004,0.259199978263454
51.0381053931402,13.9141435068982,0.303482447384716
51.0381053931402,13.9213380114959,0.305568693563207
51.0381053931402,13.9285325160937,0.266543432060408
51.0381053931402,13.9357270206914,0.252188061855126
51.0381053931402,13.9429215252891,0.234377402998955
51.0381053931402,13.9501160298869,0.257757485730177
51.0381053931402,13.9573105344846,0.289335816505688
51.0427315310741,13.5975853045977,0.268971028389039
51.0427315310741,13.6047798091955,0.290242579040415
51.0427315310741,13.6119743137932,0.264522443824616
51.0427315310741,13.6191688183909,0.290383040205187
51.0427315310741,13.6263633229887,0.407471063729735
51.0427315310741,13.6335578275864,0.499307248673368
51.0427315310741,13.6407523321842,0.386131958577589
51.0427315310741,13.6479468367819,0.33381924889198
51.0427315310741,13.6551413413796,0.274776685245301
51.0427315310741,13.6623358459774,0.395718111974666
51.0427315310741,13.6695303505751,0.533828960452397
51.0427315310741,13.6767248551728,0.484165570278116
51.0427315310741,13.6839193597706,0.631910753637398
51.0427315310741,13.6911138643683,0.747439910493972
51.0427315310741,13.6983083689661,0.786857188886574
51.0427315310741,13.7055028735638,0.630517470888139
51.0427315310741,13.7126973781615,0.310009781823516
51.0427315310741,13.7198918827593,0.544847462723362
51.0427315310741,13.727086387357,0.410991372494697
51.0427315310741,13.7342808919547,0.659474052705127
51.0427315310741,13.7414753965525,0.53543166244285
51.0427315310741,13.7486699011502,0.440876356420677
51.0427315310741,13.755864405748,0.510412341108063
51.0427315310741,13.7630589103457,0.356792354949106
51.0427315310741,13.7702534149434,0.543365171107577
51.0427315310741,13.7774479195412,0.646933802763629
51.0427315310741,13.7846424241389,0.756614300672576
51.0427315310741,13.7918369287366,0.749635573793605
51.0427315310741,13.7990314333344,0.796936960370504
51.0427315310741,13.8062259379321,0.687123170750456
51.0427315310741,13.8134204425299,0.420870019955316
51.0427315310741,13.8206149471276,0.361803593568416
51.0427315310741,13.8278094517253,0.398335204996578
51.0427315310741,13.8350039563231,0.295543523489755
51.0427315310741,13.8421984609208,0.359176674248323
51.0427315310741,13.8493929655185,0.269009754845837
51.0427315310741,13.8565874701163,0.227340265574343
51.0427315310741,13.863781974714,0.257476119331602
51.0427315310741,13.8709764793118,0.279390659503817
51.0427315310741,13.8781709839095,0.347185763413319
51.0427315310741,13.8853654885072,0.259823657226244
51.0427315310741,13.892559993105,0.259199978263454
51.0427315310741,13.8997544977027,0.259199978263454
51.0427315310741,13.9069490023004,0.259199978263454
51.0427315310741,13.9141435068982,0.268711386368308
51.0427315310741,13.9213380114959,0.314319940235882
51.0427315310741,13.9285325160937,0.283569944451053
51.0427315310741,13.9357270206914,0.259199978263454
51.0427315310741,13.9429215252891,0.259199978263454
51.0427315310741,13.9501160298869,0.259199978263454
51.0427315310741,13.9573105344846,0.259199978263454
51.0473576690079,13.5903908,0.259199978263454
51.0473576690079,13.5975853045977,0.259199978263454
51.0473576690079,13.6047798091955,0.27149640238314
51.0473576690079,13.6119743137932,0.299586131026177
51.0473576690079,13.6191688183909,0.290049166166992
51.0473576690079,13.6263633229887,0.29007292797883
51.0473576690079,13.6335578275864,0.267935889210675
51.0473576690079,13.6407523321842,0.325572816633447
51.0473576690079,13.6479468367819,0.272548987284728
51.0473576690079,13.6551413413796,0.390182498938263
51.0473576690079,13.6623358459774,0.500222795676572
51.0473576690079,13.6695303505751,0.497776676662789
51.0473576690079,13.6767248551728,0.511377690052761
51.0473576690079,13.6839193597706,0.502631747984304
51.0473576690079,13.6911138643683,0.663412311470318
51.0473576690079,13.6983083689661,0.598493078654344
51.0473576690079,13.7055028735638,0.51799083572561
51.0473576690079,13.7126973781615,0.541657425231752
51.0473576690079,13.7198918827593,0.535844640808392
51.0473576690079,13.727086387357,0.549090615235756
51.0473576690079,13.7342808919547,0.738619912803345
51.0473576690079,13.7414753965525,0.68317232959579
51.0473576690079,13.7486699011502,0.729359987229488
51.0473576690079,13.755864405748,0.737349470520347
51.0473576690079,13.7630589103457,0.553258564126777
51.0473576690079,13.7702534149434,0.839105508707786
51.0473576690079,13.7774479195412,0.615079883505445
51.0473576690079,13.7846424241389,0.63987662622971
51.0473576690079,13.7918369287366,0.677236377256646
51.0473576690079,13.7990314333344,0.758670998517188
51.0473576690079,13.8062259379321,0.493624958979096
51.0473576690079,13.8134204425299,0.3757081621194
51.0473576690079,13.8206149471276,0.346042922230185
51.0473576690079,13.8278094517253,0.312314110684736
51.0473576690079,13.8350039563231,0.259199978263454
51.0473576690079,13.8421984609208,0.33617067544684
51.0473576690079,13.8493929655185,0.268457465836987
51.0473576690079,13.8565874701163,0.259199978263454
51.0473576690079,13.863781974714,0.409159285852038
51.0473576690079,13.8709764793118,0.37135183286167
51.0473576690079,13.8781709839095,0.259199978263454
51.0473576690079,13.8853654885072,0.259199978263454
51.0473576690079,13.892559993105,0.259199978263454
51.0473576690079,13.8997544977027,0.259199978263454
51.0473576690079,13.9069490023004,0.259199978263454
51.0473576690079,13.9141435068982,0.259199978263454
51.0473576690079,13.9213380114959,0.259199978263454
51.0473576690079,13.9285325160937,0.259199978263454
51.0473576690079,13.9357270206914,0.259199978263454
51.0473576690079,13.9429215252891,0.259199978263454
51.0473576690079,13.9501160298869,0.259199978263454
51.0473576690079,13.9573105344846,0.259199978263454
51.0519838069418,13.5903908,0.270647471312372
51.0519838069418,13.5975853045977,0.265253464703303
51.0519838069418,13.6047798091955,0.259199978263454
51.0519838069418,13.6119743137932,0.259199978263454
51.0519838069418,13.6191688183909,0.259199978263454
51.0519838069418,13.6263633229887,0.259199978263454
51.0519838069418,13.6335578275864,0.261259285497138
51.0519838069418,13.6407523321842,0.270088539583951
51.0519838069418,13.6479468367819,0.273213676545689
51.0519838069418,13.6551413413796,0.369886952484301
51.0519838069418,13.6623358459774,0.527293510958264
51.0519838069418,13.6695303505751,0.291153147464981
51.0519838069418,13.6767248551728,0.469355354507729
51.0519838069418,13.6839193597706,0.657830547863723
51.0519838069418,13.6911138643683,0.470501977025735
51.0519838069418,13.6983083689661,0.496362976710173
51.0519838069418,13.7055028735638,0.432603441776592
51.0519838069418,13.7126973781615,0.432179838283741
51.0519838069418,13.7198918827593,0.570537390614064
51.0519838069418,13.727086387357,0.581135555750257
51.0519838069418,13.7342808919547,0.716534185973231
51.0519838069418,13.7414753965525,0.732554304937222
51.0519838069418,13.7486699011502,0.617383282442624
51.0519838069418,13.755864405748,0.586496832345571
51.0519838069418,13.7630589103457,0.65410720207101
51.0519838069418,13.7702534149434,0.445807015774617
51.0519838069418,13.7774479195412,0.56584575044447
51.0519838069418,13.7846424241389,0.682722301826781
51.0519838069418,13.7918369287366,0.672897028217966
51.0519838069418,13.7990314333344,0.572328553765009
51.0519838069418,13.8062259379321,0.828266156147954
51.0519838069418,13.8134204425299,0.486199853192488
51.0519838069418,13.8206149471276,0.553583301334894
51.0519838069418,13.8278094517253,0.294246427580062
51.0519838069418,13.8350039563231,0.269032036796596
51.0519838069418,13.8421984609208,0.293704787849988
51.0519838069418,13.8493929655185,0.306910111112416
51.0519838069418,13.8565874701163,0.277349705410974
51.0519838069418,13.863781974714,0.279184787867645
51.0519838069418,13.8709764793118,0.280234674664481
51.0519838069418,13.8781709839095,0.259199978263454
51.0519838069418,13.8853654885072,0.259199978263454
51.0519838069418,13.892559993105,0.268542971740628
51.0519838069418,13.8997544977027,0.259199978263454
51.0519838069418,13.9069490023004,0.259199978263454
51.0519838069418,13.9141435068982,0.259199978263454
51.0519838069418,13.9213380114959,0.259199978263454
51.0519838069418,13.9285325160937,0.259199978263454
51.0519838069418,13.9357270206914,0.259199978263454
51.0519838069418,13.9429215252891,0.259199978263454
51.0519838069418,13.9501160298869,0.259199978263454
51.0519838069418,13.9573105344846,0.259199978263454
51.0566099448756,13.5903908,0.291116545416742
51.0566099448756,13.5975853045977,0.278303260398675
51.0566099448756,13.6047798091955,0.259199978263454
51.0566099448756,13.6119743137932,0.259199978263454
51.0566099448756,13.6191688183909,0.259199978263454
51.0566099448756,13.6263633229887,0.25714323434435
51.0566099448756,13.6335578275864,0.259199978263454
51.0566099448756,13.6407523321842,0.344894481309632
51.0566099448756,13.6479468367819,0.272885928981122
51.0566099448756,13.6551413413796,0.315634395155421
51.0566099448756,13.6623358459774,0.373775462352362
51.0566099448756,13.6695303505751,0.391769666818308
51.0566099448756,13.6767248551728,0.442733116654911
51.0566099448756,13.6839193597706,0.568900788490527
51.0566099448756,13.6911138643683,0.525439166077571
51.0566099448756,13.6983083689661,0.375721214500655
51.0566099448756,13.7055028735638,0.424426960875795
51.0566099448756,13.7126973781615,0.712483756275891
51.0566099448756,13.7198918827593,0.728351550403029
51.0566099448756,13.727086387357,0.794567308700611
51.0566099448756,13.7342808919547,0.415646018373698
51.0566099448756,13.7414753965525,0.610798835226679
51.0566099448756,13.7486699011502,0.45710080589393
51.0566099448756,13.755864405748,0.489677762159076
51.0566099448756,13.7630589103457,0.834287437643964
51.0566099448756,13.7702534149434,0.765499421553557
51.0566099448756,13.7774479195412,0.648069596842763
51.0566099448756,13.7846424241389,0.588724681982701
51.0566099448756,13.7918369287366,0.42092050644778
51.0566099448756,13.7990314333344,0.368317152648239
51.0566099448756,13.8062259379321,0.424298490499626
51.0566099448756,13.8134204425299,0.379329387361941
51.0566099448756,13.8206149471276,0.295331820994926
51.0566099448756,13.8278094517253,0.252531407016908
51.0566099448756,13.8350039563231,0.300431558099224
51.0566099448756,13.8421984609208,0.256707715134983
51.0566099448756,13.8493929655185,0.331807561708635
51.0566099448756,13.8565874701163,0.36180400117344
51.0566099448756,13.863781974714,0.322404523981439
51.0566099448756,13.8709764793118,0.307039405431829
51.0566099448756,13.8781709839095,0.275855181483215
51.0566099448756,13.8853654885072,0.458026922505678
51.0566099448756,13.892559993105,0.43389186537728
51.0566099448756,13.8997544977027,0.2771378223645
51.0566099448756,13.9069490023004,0.259199978263454
51.0566099448756,13.9141435068982,0.259199978263454
51.0566099448756,13.9213380114959,0.259199978263454
51.0566099448756,13.9285325160937,0.259199978263454
51.0566099448756,13.9357270206914,0.259199978263454
51.0566099448756,13.9429215252891,0.27946132337559
51.0566099448756,13.9501160298869,0.303062514162469
51.0566099448756,13.9573105344846,0.260179813518616
51.0612360828095,13.5903908,0.260044212496026
51.0612360828095,13.5975853045977,0.259199978263454
51.0612360828095,13.6047798091955,0.259199978263454
51.0612360828095,13.6119743137932,0.259199978263454
51.0612360828095,13.6191688183909,0.259199978263454
51.0612360828095,13.6263633229887,0.241807552235418
51.0612360828095,13.6335578275864,0.252609895661295
51.0612360828095,13.6407523321842,0.347033246270235
51.0612360828095,13.6479468367819,0.259199978263454
51.0612360828095,13.6551413413796,0.33341952402293
51.0612360828095,13.6623358459774,0.425798929218948
51.0612360828095,13.6695303505751,0.408231572927835
51.0612360828095,13.6767248551728,0.621089212111909
51.0612360828095,13.6839193597706,0.438882905728106
51.0612360828095,13.6911138643683,0.367086857117968
51.0612360828095,13.6983083689661,0.416606341024578
51.0612360828095,13.7055028735638,0.315914657452103
51.0612360828095,13.7126973781615,0.614924702976655
51.0612360828095,13.7198918827593,0.676751183882828
51.0612360828095,13.727086387357,0.393099992146681
51.0612360828095,13.7342808919547,0.600501471946867
51.0612360828095,13.7414753965525,0.951878673930795
51.0612360828095,13.7486699011502,0.721665847440385
51.0612360828095,13.755864405748,0.722418178664846
51.0612360828095,13.7630589103457,0.482633979238155
51.0612360828095,13.7702534149434,0.455620838966647
51.0612360828095,13.7774479195412,0.515567658554077
51.0612360828095,13.7846424241389,0.464806320324355
51.0612360828095,13.7918369287366,0.337705223200534
51.0612360828095,13.7990314333344,0.340707812060856
51.0612360828095,13.8062259379321,0.334147415584828
51.0612360828095,13.8134204425299,0.375243561171435
51.0612360828095,13.8206149471276,0.575214102483137
51.0612360828095,13.8278094517253,0.356855046676422
51.0612360828095,13.8350039563231,0.374750658523204
51.0612360828095,13.8421984609208,0.407922431197624
51.0612360828095,13.8493929655185,0.659264325155869
51.0612360828095,13.8565874701163,0.499429990992861
51.0612360828095,13.863781974714,0.281325326896554
51.0612360828095,13.8709764793118,0.242751346742049
51.0612360828095,13.8781709839095,0.237714841496269
51.0612360828095,13.8853654885072,0.74444638195022
51.0612360828095,13.892559993105,0.269292076759838
51.0612360828095,13.8997544977027,0.260063264145146
51.0612360828095,13.9069490023004,0.259199978263454
51.0612360828095,13.9141435068982,0.259199978263454
51.0612360828095,13.9213380114959,0.259199978263454
51.0612360828095,13.9357270206914,0.259199978263454
51.0612360828095,13.9429215252891,0.295035266357169
51.0612360828095,13.9501160298869,0.337385815060738
51.0612360828095,13.9573105344846,0.262191715188469
51.0658622207434,13.5903908,0.259199978263454
51.0658622207434,13.5975853045977,0.259199978263454
51.0658622207434,13.6047798091955,0.259199978263454
51.0658622207434,13.6119743137932,0.259199978263454
51.0658622207434,13.6191688183909,0.278291368398893
51.0658622207434,13.6263633229887,0.274973314659602
51.0658622207434,13.6335578275864,0.259984702964823
51.0658622207434,13.6407523321842,0.295280506752075
51.0658622207434,13.6479468367819,0.259199978263454
51.0658622207434,13.6551413413796,0.282509159892659
51.0658622207434,13.6623358459774,0.398321988729985
51.0658622207434,13.6695303505751,0.55722481366563
51.0658622207434,13.6767248551728,0.600616032132366
51.0658622207434,13.6839193597706,0.218133516277615
51.0658622207434,13.6911138643683,0.241914954966159
51.0658622207434,13.6983083689661,0.217279881810055
51.0658622207434,13.7055028735638,0.246699730073592
51.0658622207434,13.7126973781615,0.277419742207087
51.0658622207434,13.7198918827593,0.345592704618667
51.0658622207434,13.727086387357,0.42512725758204
51.0658622207434,13.7342808919547,0.447463785171569
51.0658622207434,13.7414753965525,0.725399167284776
51.0658622207434,13.7486699011502,0.784162260143093
51.0658622207434,13.755864405748,0.97994337807047
51.0658622207434,13.7630589103457,0.625499453085574
51.0658622207434,13.7702534149434,0.500013697104906
51.0658622207434,13.7774479195412,0.532502345401338
51.0658622207434,13.7846424241389,0.417897375570453
51.0658622207434,13.7918369287366,0.524646949475989
51.0658622207434,13.7990314333344,0.409760594355458
51.0658622207434,13.8062259379321,0.279431294553241
51.0658622207434,13.8134204425299,0.267223109969832
51.0658622207434,13.8206149471276,0.5712503413293
51.0658622207434,13.8278094517253,0.465689725471372
51.0658622207434,13.8350039563231,0.311330087885695
51.0658622207434,13.8421984609208,0.371409491046314
51.0658622207434,13.8493929655185,0.266035083487746
51.0658622207434,13.8565874701163,0.282082236178272
51.0658622207434,13.863781974714,0.260466645537426
51.0658622207434,13.8709764793118,0.373565822660159
51.0658622207434,13.8781709839095,0.289095633198317
51.0658622207434,13.8853654885072,0.32105124441409
51.0658622207434,13.892559993105,0.303971303152664
51.0658622207434,13.8997544977027,0.236919688289667
51.0658622207434,13.9069490023004,0.259199978263454
51.0658622207434,13.9141435068982,0.259199978263454
51.0658622207434,13.9429215252891,0.259199978263454
51.0658622207434,13.9501160298869,0.270840022061784
51.0704883586772,13.5903908,0.259199978263454
51.0704883586772,13.5975853045977,0.259199978263454
51.0704883586772,13.6047798091955,0.259199978263454
51.0704883586772,13.6119743137932,0.259199978263454
51.0704883586772,13.6191688183909,0.303775853999236
51.0704883586772,13.6263633229887,0.335964731063685
51.0704883586772,13.6335578275864,0.259199978263454
51.0704883586772,13.6407523321842,0.272978834150627
51.0704883586772,13.6479468367819,0.259199978263454
51.0704883586772,13.6551413413796,0.261887050169955
51.0704883586772,13.6623358459774,0.334672897171165
51.0704883586772,13.6695303505751,0.374795661906202
51.0704883586772,13.6767248551728,0.318706311149132
51.0704883586772,13.6839193597706,0.37568229325034
51.0704883586772,13.6911138643683,0.362696008624872
51.0704883586772,13.6983083689661,0.414530588284223
51.0704883586772,13.7055028735638,0.361495124692224
51.0704883586772,13.7126973781615,0.286932151333161
51.0704883586772,13.7198918827593,0.389476528654685
51.0704883586772,13.727086387357,0.646509003346646
51.0704883586772,13.7342808919547,0.571313137608152
51.0704883586772,13.7414753965525,0.66804794957718
51.0704883586772,13.7486699011502,0.824342155220377
51.0704883586772,13.755864405748,0.893921190130331
51.0704883586772,13.7630589103457,0.643889038919846
51.0704883586772,13.7702534149434,0.620499670795862
51.0704883586772,13.7774479195412,0.680329867408569
51.0704883586772,13.7846424241389,0.446037040513172
51.0704883586772,13.7918369287366,0.349851602886164
51.0704883586772,13.7990314333344,0.265842207407595
51.0704883586772,13.8062259379321,0.298165568985747
51.0704883586772,13.8134204425299,0.282942045621127
51.0704883586772,13.8206149471276,0.259199978263454
51.0704883586772,13.8278094517253,0.259199978263454
51.0704883586772,13.8350039563231,0.263325367806693
51.0704883586772,13.8421984609208,0.372457772333785
51.0704883586772,13.8493929655185,0.259199978263454
51.0704883586772,13.8565874701163,0.259199978263454
51.0704883586772,13.863781974714,0.259199978263454
51.0704883586772,13.8709764793118,0.26782566286187
51.0704883586772,13.8781709839095,0.256608673173584
51.0704883586772,13.8853654885072,0.25331378648228
51.0704883586772,13.9429215252891,0.259199978263454
51.0704883586772,13.9501160298869,0.259199978263454
51.0751144966111,13.5903908,0.259199978263454
51.0751144966111,13.5975853045977,0.259199978263454
51.0751144966111,13.6047798091955,0.259199978263454
51.0751144966111,13.6119743137932,0.259199978263454
51.0751144966111,13.6191688183909,0.259199978263454
51.0751144966111,13.6263633229887,0.259199978263454
51.0751144966111,13.6335578275864,0.273503232278156
51.0751144966111,13.6407523321842,0.232681828382214
51.0751144966111,13.6479468367819,0.260806538585261
51.0751144966111,13.6551413413796,0.311475564884294
51.0751144966111,13.6623358459774,0.310326126272898
51.0751144966111,13.6695303505751,0.336151320950592
51.0751144966111,13.6767248551728,0.293801524106418
51.0751144966111,13.6839193597706,0.265224233579728
51.0751144966111,13.6911138643683,0.401148703855697
51.0751144966111,13.6983083689661,0.428664292435578
51.0751144966111,13.7055028735638,0.306364761879932
51.0751144966111,13.7126973781615,0.322529173087221
51.0751144966111,13.7198918827593,0.707765880680192
51.0751144966111,13.727086387357,0.752822817480494
51.0751144966111,13.7342808919547,0.590340381749083
51.0751144966111,13.7414753965525,0.66054182993424
51.0751144966111,13.7486699011502,0.882093228450558
51.0751144966111,13.755864405748,0.434230113493118
51.0751144966111,13.7630589103457,0.355220733911994
51.0751144966111,13.7702534149434,0.406897430258722
51.0751144966111,13.7774479195412,0.288230526463015
51.0751144966111,13.7846424241389,0.330374831869509
51.0751144966111,13.7918369287366,0.302873756096288
51.0751144966111,13.7990314333344,0.272646356135124
51.0751144966111,13.8062259379321,0.259199978263454
51.0751144966111,13.8134204425299,0.259199978263454
51.0751144966111,13.8206149471276,0.259199978263454
51.0751144966111,13.8278094517253,0.259199978263454
51.0751144966111,13.8350039563231,0.259199978263454
51.0751144966111,13.8421984609208,0.259199978263454
51.0751144966111,13.8493929655185,0.259199978263454
51.0751144966111,13.8565874701163,0.259199978263454
51.0751144966111,13.863781974714,0.259199978263454
51.0751144966111,13.8709764793118,0.259199978263454
51.0751144966111,13.8781709839095,0.259199978263454
51.0751144966111,13.8853654885072,0.259199978263454
51.079740634545,13.5975853045977,0.259199978263454
51.079740634545,13.6047798091955,0.259199978263454
51.079740634545,13.6119743137932,0.351123129369949
51.079740634545,13.6191688183909,0.270809084307893
51.079740634545,13.6263633229887,0.346930253292743
51.079740634545,13.6335578275864,0.362420222506459
51.079740634545,13.6407523321842,0.3207360809714
51.079740634545,13.6479468367819,0.37730935608112
51.079740634545,13.6551413413796,0.368715099976083
51.079740634545,13.6623358459774,0.306390874545797
51.079740634545,13.6695303505751,0.32357404300292
51.079740634545,13.6767248551728,0.34342124314578
51.079740634545,13.6839193597706,0.309348806763638
51.079740634545,13.6911138643683,0.287647096416119
51.079740634545,13.6983083689661,0.576073550581977
51.079740634545,13.7055028735638,0.494871253964304
51.079740634545,13.7126973781615,0.615184473392898
51.079740634545,13.7198918827593,0.560100528378868
51.079740634545,13.727086387357,0.549009212753415
51.079740634545,13.7342808919547,0.612442009261851
51.079740634545,13.7414753965525,0.396856766211255
51.079740634545,13.7486699011502,0.456798912615379
51.079740634545,13.755864405748,0.440385744830516
51.079740634545,13.7630589103457,0.374259193632071
51.079740634545,13.7702534149434,0.275093830217844
51.079740634545,13.7774479195412,0.259199978263454
51.079740634545,13.7846424241389,0.259199978263454
51.079740634545,13.7918369287366,0.259199978263454
51.079740634545,13.7990314333344,0.259199978263454
51.079740634545,13.8062259379321,0.259199978263454
51.079740634545,13.8134204425299,0.259199978263454
51.079740634545,13.8206149471276,0.259199978263454
51.079740634545,13.8278094517253,0.259199978263454
51.079740634545,13.8350039563231,0.259199978263454
51.079740634545,13.8421984609208,0.259199978263454
51.079740634545,13.8493929655185,0.259199978263454
51.079740634545,13.8565874701163,0.259199978263454
51.079740634545,13.863781974714,0.259199978263454
51.079740634545,13.8709764793118,0.259199978263454
51.079740634545,13.8781709839095,0.259199978263454
51.079740634545,13.8853654885072,0.259199978263454
51.079740634545,13.892559993105,0.340534944481059
51.0843667724788,13.5975853045977,0.259199978263454
51.0843667724788,13.6047798091955,0.259199978263454
51.0843667724788,13.6119743137932,0.323090811041102
51.0843667724788,13.6191688183909,0.259199978263454
51.0843667724788,13.6263633229887,0.306127565659297
51.0843667724788,13.6335578275864,0.381729012386385
51.0843667724788,13.6407523321842,0.363653146881594
51.0843667724788,13.6479468367819,0.38187749630937
51.0843667724788,13.6551413413796,0.363772069766572
51.0843667724788,13.6623358459774,0.287852882081342
51.0843667724788,13.6695303505751,0.277139605121582
51.0843667724788,13.6767248551728,0.291789486889391
51.0843667724788,13.6839193597706,0.436256289289079
51.0843667724788,13.6911138643683,0.417189999936576
51.0843667724788,13.6983083689661,0.705576076367643
51.0843667724788,13.7055028735638,0.716205761094464
51.0843667724788,13.7126973781615,0.63995122525477
51.0843667724788,13.7198918827593,0.655614814144892
51.0843667724788,13.727086387357,0.845018046763021
51.0843667724788,13.7342808919547,0.518819320240736
51.0843667724788,13.7414753965525,0.332329471484674
51.0843667724788,13.7486699011502,0.285361726678929
51.0843667724788,13.755864405748,0.278102128093301
51.0843667724788,13.7630589103457,0.41895075816793
51.0843667724788,13.7702534149434,0.428475128725473
51.0843667724788,13.7774479195412,0.259811296516288
51.0843667724788,13.7846424241389,0.259199978263454
51.0843667724788,13.7918369287366,0.259199978263454
51.0843667724788,13.7990314333344,0.259199978263454
51.0843667724788,13.8062259379321,0.259199978263454
51.0843667724788,13.8134204425299,0.259199978263454
51.0843667724788,13.8206149471276,0.259199978263454
51.0843667724788,13.8278094517253,0.259199978263454
51.0843667724788,13.8350039563231,0.259199978263454
51.0843667724788,13.8421984609208,0.259199978263454
51.0843667724788,13.8493929655185,0.259199978263454
51.0843667724788,13.8565874701163,0.259199978263454
51.0843667724788,13.863781974714,0.259199978263454
51.0843667724788,13.8709764793118,0.259199978263454
51.0843667724788,13.8781709839095,0.259199978263454
51.0843667724788,13.8853654885072,0.259199978263454
51.0843667724788,13.892559993105,0.259199978263454
51.0843667724788,13.9069490023004,0.259199978263454
51.0889929104127,13.6047798091955,0.259199978263454
51.0889929104127,13.6119743137932,0.259199978263454
51.0889929104127,13.6191688183909,0.32868572860519
51.0889929104127,13.6263633229887,0.307726098308702
51.0889929104127,13.6335578275864,0.428949544044051
51.0889929104127,13.6407523321842,0.302432336301146
51.0889929104127,13.6479468367819,0.27402673731589
51.0889929104127,13.6551413413796,0.290669495295859
51.0889929104127,13.6623358459774,0.280556104755892
51.0889929104127,13.6695303505751,0.270400516322985
51.0889929104127,13.6767248551728,0.326991203977574
51.0889929104127,13.6839193597706,0.287498185590214
51.0889929104127,13.6911138643683,0.386936718669412
51.0889929104127,13.6983083689661,0.489179675302707
51.0889929104127,13.7055028735638,0.597312158901592
51.0889929104127,13.7126973781615,0.589206876583146
51.0889929104127,13.7198918827593,0.481647742776853
51.0889929104127,13.727086387357,0.604321732323998
51.0889929104127,13.7342808919547,0.514934198566179
51.0889929104127,13.7414753965525,0.382962621708777
51.0889929104127,13.7486699011502,0.2810465076274
51.0889929104127,13.755864405748,0.404394679287431
51.0889929104127,13.7630589103457,0.461148282995708
51.0889929104127,13.7702534149434,0.404166294091625
51.0889929104127,13.7774479195412,0.259199978263454
51.0889929104127,13.7846424241389,0.259199978263454
51.0889929104127,13.7918369287366,0.259199978263454
51.0889929104127,13.7990314333344,0.259199978263454
51.0889929104127,13.8062259379321,0.259199978263454
51.0889929104127,13.8134204425299,0.259199978263454
51.0889929104127,13.8206149471276,0.259199978263454
51.0889929104127,13.8278094517253,0.259199978263454
51.0889929104127,13.8350039563231,0.259199978263454
51.0889929104127,13.8421984609208,0.259199978263454
51.0889929104127,13.8493929655185,0.259199978263454
51.0889929104127,13.8565874701163,0.259199978263454
51.0889929104127,13.863781974714,0.259199978263454
51.0889929104127,13.8709764793118,0.259199978263454
51.0889929104127,13.8781709839095,0.259199978263454
51.0889929104127,13.8853654885072,0.259199978263454
51.0889929104127,13.892559993105,0.259199978263454
51.0889929104127,13.8997544977027,0.259199978263454
51.0889929104127,13.9069490023004,0.259199978263454
51.0936190483465,13.5975853045977,0.288178364142991
51.0936190483465,13.6047798091955,0.457977455566936
51.0936190483465,13.6119743137932,0.276674137312005
51.0936190483465,13.6191688183909,0.299573155443127
51.0936190483465,13.6263633229887,0.259849484498106
51.0936190483465,13.6335578275864,0.260729585221414
51.0936190483465,13.6407523321842,0.242783793382078
51.0936190483465,13.6479468367819,0.250315927491356
51.0936190483465,13.6623358459774,0.262139019462679
51.0936190483465,13.6695303505751,0.215649030924971
51.0936190483465,13.6767248551728,0.246857524316767
51.0936190483465,13.7055028735638,0.459739153372608
51.0936190483465,13.7126973781615,0.442921665094911
51.0936190483465,13.7198918827593,0.664586122129084
51.0936190483465,13.727086387357,0.50492251397683
51.0936190483465,13.7342808919547,0.257692065940908
51.0936190483465,13.7414753965525,0.263197357601737
51.0936190483465,13.7486699011502,0.258721900344246
51.0936190483465,13.755864405748,0.296628146532885
51.0936190483465,13.7630589103457,0.213035563083142
51.0936190483465,13.7702534149434,0.267218237001428
51.0936190483465,13.7774479195412,0.259199978263454
51.0936190483465,13.7846424241389,0.259199978263454
51.0936190483465,13.7918369287366,0.259199978263454
51.0936190483465,13.7990314333344,0.259199978263454
51.0936190483465,13.8062259379321,0.259199978263454
51.0936190483465,13.8134204425299,0.259199978263454
51.0936190483465,13.8206149471276,0.259199978263454
51.0936190483465,13.8278094517253,0.259199978263454
51.0936190483465,13.8350039563231,0.261905127518959
51.0936190483465,13.8421984609208,0.301628834663265
51.0936190483465,13.8493929655185,0.263560982408577
51.0936190483465,13.8565874701163,0.259199978263454
51.0936190483465,13.863781974714,0.259199978263454
51.0936190483465,13.8709764793118,0.259199978263454
51.0936190483465,13.8781709839095,0.259199978263454
51.0936190483465,13.8853654885072,0.259199978263454
51.0936190483465,13.892559993105,0.259199978263454
51.0936190483465,13.8997544977027,0.259199978263454
51.0936190483465,13.9069490023004,0.259199978263454
51.0982451862804,13.6119743137932,0.259199978263454
51.0982451862804,13.6191688183909,0.259199978263454
51.0982451862804,13.6263633229887,0.259199978263454
51.0982451862804,13.6335578275864,0.259199978263454
51.0982451862804,13.6983083689661,0.328099761564446
51.0982451862804,13.7055028735638,0.248882807771368
51.0982451862804,13.7126973781615,0.493288579096025
51.0982451862804,13.7198918827593,0.423069997120169
51.0982451862804,13.727086387357,0.483745161634723
51.0982451862804,13.7342808919547,0.322236595189864
51.0982451862804,13.7414753965525,0.259199978263454
51.0982451862804,13.7486699011502,0.259199978263454
51.0982451862804,13.755864405748,0.259199978263454
51.0982451862804,13.7630589103457,0.262725663794606
51.0982451862804,13.7702534149434,0.479009427034859
51.0982451862804,13.7774479195412,0.259199978263454
51.0982451862804,13.7846424241389,0.259199978263454
51.0982451862804,13.7918369287366,0.259199978263454
51.0982451862804,13.7990314333344,0.259199978263454
51.0982451862804,13.8062259379321,0.259199978263454
51.0982451862804,13.8134204425299,0.259199978263454
51.0982451862804,13.8206149471276,0.259199978263454
51.0982451862804,13.8278094517253,0.259199978263454
51.0982451862804,13.8350039563231,0.259199978263454
51.0982451862804,13.8421984609208,0.270666656985845
51.0982451862804,13.8493929655185,0.259199978263454
51.0982451862804,13.8565874701163,0.259199978263454
51.0982451862804,13.863781974714,0.259199978263454
51.0982451862804,13.8709764793118,0.259199978263454
51.0982451862804,13.8781709839095,0.259199978263454
51.0982451862804,13.8853654885072,0.259199978263454
51.0982451862804,13.892559993105,0.259199978263454
51.0982451862804,13.8997544977027,0.259199978263454
51.0982451862804,13.9069490023004,0.259199978263454
51.1028713242143,13.6983083689661,0.28775455409143
51.1028713242143,13.7055028735638,0.259199978263454
51.1028713242143,13.7126973781615,0.27762785868522
51.1028713242143,13.7198918827593,0.343709831749664
51.1028713242143,13.727086387357,0.278852042586891
51.1028713242143,13.7342808919547,0.259199978263454
51.1028713242143,13.7414753965525,0.259199978263454
51.1028713242143,13.7486699011502,0.259199978263454
51.1028713242143,13.755864405748,0.259199978263454
51.1028713242143,13.7630589103457,0.259199978263454
51.1028713242143,13.7702534149434,0.347899184103712
51.1028713242143,13.7774479195412,0.261028017600539
51.1028713242143,13.7846424241389,0.259199978263454
51.1028713242143,13.7918369287366,0.259199978263454
51.1028713242143,13.7990314333344,0.259199978263454
51.1028713242143,13.8062259379321,0.259199978263454
51.1028713242143,13.8134204425299,0.259199978263454
51.1028713242143,13.8206149471276,0.259199978263454
51.1028713242143,13.8278094517253,0.259199978263454
51.1028713242143,13.8350039563231,0.259199978263454
51.1028713242143,13.8421984609208,0.259199978263454
51.1028713242143,13.8493929655185,0.259199978263454
51.1028713242143,13.8565874701163,0.259199978263454
51.1028713242143,13.863781974714,0.259199978263454
51.1028713242143,13.8709764793118,0.259199978263454
51.1028713242143,13.8781709839095,0.259199978263454
51.1028713242143,13.8853654885072,0.259199978263454
51.1028713242143,13.892559993105,0.259199978263454
51.1074974621481,13.6983083689661,0.259199978263454
51.1074974621481,13.7055028735638,0.259199978263454
51.1074974621481,13.7126973781615,0.268761934323742
51.1074974621481,13.7198918827593,0.260101223536822
51.1074974621481,13.727086387357,0.294096173417928
51.1074974621481,13.7342808919547,0.295118640986332
51.1074974621481,13.7414753965525,0.259199978263454
51.1074974621481,13.7486699011502,0.281352798062024
51.1074974621481,13.755864405748,0.500628508539363
51.1074974621481,13.7630589103457,0.501541402909251
51.1074974621481,13.7702534149434,0.301442531438183
51.1074974621481,13.7774479195412,0.288878568070389
51.1074974621481,13.7846424241389,0.28902870492307
51.1074974621481,13.7918369287366,0.257120557418045
51.1074974621481,13.7990314333344,0.259199978263454
51.1074974621481,13.8062259379321,0.259199978263454
51.1074974621481,13.8134204425299,0.259199978263454
51.1074974621481,13.8206149471276,0.259199978263454
51.1074974621481,13.8278094517253,0.269098475154127
51.1074974621481,13.8350039563231,0.275346428863005
51.1074974621481,13.8421984609208,0.259199978263454
51.1074974621481,13.8493929655185,0.259199978263454
51.1074974621481,13.8565874701163,0.259199978263454
51.1074974621481,13.863781974714,0.259199978263454
51.1074974621481,13.8709764793118,0.259199978263454
51.1074974621481,13.8781709839095,0.259199978263454
51.1074974621481,13.8853654885072,0.259199978263454
51.1074974621481,13.892559993105,0.259199978263454
51.112123600082,13.6983083689661,0.259199978263454
51.112123600082,13.7126973781615,0.304831825182362
51.112123600082,13.7198918827593,0.264697612201776
51.112123600082,13.727086387357,0.298411007472089
51.112123600082,13.7342808919547,0.301126731969711
51.112123600082,13.7414753965525,0.363079194135767
51.112123600082,13.7486699011502,0.386849329987995
51.112123600082,13.755864405748,0.537783726446319
51.112123600082,13.7630589103457,0.533127136470928
51.112123600082,13.7702534149434,0.424733921749595
51.112123600082,13.7774479195412,0.585415938679698
51.112123600082,13.7846424241389,0.423202153895109
51.112123600082,13.7918369287366,0.298330116654527
51.112123600082,13.7990314333344,0.259199978263454
51.112123600082,13.8062259379321,0.259199978263454
51.112123600082,13.8134204425299,0.259199978263454
51.112123600082,13.8206149471276,0.259199978263454
51.112123600082,13.8278094517253,0.271636212077004
51.112123600082,13.8350039563231,0.278364365397372
51.112123600082,13.8421984609208,0.259199978263454
51.112123600082,13.8493929655185,0.259199978263454
51.112123600082,13.8565874701163,0.259199978263454
51.112123600082,13.863781974714,0.259199978263454
51.112123600082,13.8709764793118,0.259199978263454
51.112123600082,13.8781709839095,0.259199978263454
51.112123600082,13.8853654885072,0.259199978263454
51.1167497380158,13.7126973781615,0.26109625498063
51.1167497380158,13.7198918827593,0.251469627477782
51.1167497380158,13.727086387357,0.273954163158301
51.1167497380158,13.7342808919547,0.357048574196569
51.1167497380158,13.7414753965525,0.407187067284388
51.1167497380158,13.7486699011502,0.309390989475896
51.1167497380158,13.755864405748,0.418995807060461
51.1167497380158,13.7630589103457,0.367375548610661
51.1167497380158,13.7702534149434,0.428724441057744
51.1167497380158,13.7774479195412,0.377765928196727
51.1167497380158,13.7846424241389,0.4846972401038
51.1167497380158,13.7918369287366,0.417834264693323
51.1167497380158,13.7990314333344,0.272038788609914
51.1167497380158,13.8062259379321,0.259199978263454
51.1167497380158,13.8134204425299,0.259199978263454
51.1167497380158,13.8206149471276,0.259199978263454
51.1167497380158,13.8278094517253,0.259199978263454
51.1167497380158,13.8350039563231,0.259199978263454
51.1167497380158,13.8421984609208,0.259199978263454
51.1167497380158,13.8493929655185,0.259199978263454
51.1167497380158,13.8565874701163,0.259199978263454
51.1167497380158,13.863781974714,0.259199978263454
51.1167497380158,13.8709764793118,0.259199978263454
51.1167497380158,13.8781709839095,0.259199978263454
51.1167497380158,13.8853654885072,0.259199978263454
51.1213758759497,13.7126973781615,0.252055306994507
51.1213758759497,13.7198918827593,0.388396085983127
51.1213758759497,13.727086387357,0.342499338443233
51.1213758759497,13.7342808919547,0.343137283239544
51.1213758759497,13.7414753965525,0.29905115719697
51.1213758759497,13.7486699011502,0.259199978263454
51.1213758759497,13.755864405748,0.256626780783611
51.1213758759497,13.7630589103457,0.281160142414779
51.1213758759497,13.7702534149434,0.339748171774195
51.1213758759497,13.7774479195412,0.373898939166389
51.1213758759497,13.7846424241389,0.528487772700188
51.1213758759497,13.7918369287366,0.422191311291059
51.1213758759497,13.7990314333344,0.262764477785131
51.1213758759497,13.8062259379321,0.259199978263454
51.1213758759497,13.8134204425299,0.259199978263454
51.1213758759497,13.8206149471276,0.259199978263454
51.1213758759497,13.8278094517253,0.277033696476023
51.1213758759497,13.8350039563231,0.309660297301421
51.1213758759497,13.8421984609208,0.286687537247838
51.1213758759497,13.8493929655185,0.2630470283489
51.1213758759497,13.8565874701163,0.259199978263454
51.1213758759497,13.863781974714,0.259199978263454
51.1213758759497,13.8709764793118,0.259199978263454
51.1213758759497,13.8781709839095,0.259199978263454
51.1260020138836,13.7198918827593,0.26239345629673
51.1260020138836,13.727086387357,0.259199978263454
51.1260020138836,13.7342808919547,0.295106337806748
51.1260020138836,13.7414753965525,0.298657784855326
51.1260020138836,13.7486699011502,0.298113301881324
51.1260020138836,13.755864405748,0.256712789628765
51.1260020138836,13.7630589103457,0.434599619330047
51.1260020138836,13.7702534149434,0.289179946033485
51.1260020138836,13.7774479195412,0.229556067005476
51.1260020138836,13.7846424241389,0.482406338494537
51.1260020138836,13.7918369287366,0.378505618253629
51.1260020138836,13.7990314333344,0.262098433226311
51.1260020138836,13.8062259379321,0.259199978263454
51.1260020138836,13.8134204425299,0.277243656404487
51.1260020138836,13.8206149471276,0.303106353673733
51.1260020138836,13.8278094517253,0.409956127197789
51.1260020138836,13.8350039563231,0.317609447028606
51.1260020138836,13.8421984609208,0.495993406538343
51.1260020138836,13.8493929655185,0.306383689956431
51.1260020138836,13.8565874701163,0.266117559759527
51.1260020138836,13.863781974714,0.259199978263454
51.1260020138836,13.8709764793118,0.259199978263454
51.1306281518174,13.7126973781615,0.259199978263454
51.1306281518174,13.7198918827593,0.259199978263454
51.1306281518174,13.727086387357,0.259199978263454
51.1306281518174,13.7342808919547,0.261614156750666
51.1306281518174,13.7414753965525,0.259199978263454
51.1306281518174,13.7486699011502,0.259199978263454
51.1306281518174,13.755864405748,0.259199978263454
51.1306281518174,13.7630589103457,0.259199978263454
51.1306281518174,13.7702534149434,0.253643625413637
51.1306281518174,13.7774479195412,0.249513836679734
51.1306281518174,13.7846424241389,0.273575497910238
51.1306281518174,13.7918369287366,0.344698162001226
51.1306281518174,13.7990314333344,0.259199978263454
51.1306281518174,13.8062259379321,0.259199978263454
51.1306281518174,13.8134204425299,0.259199978263454
51.1306281518174,13.8206149471276,0.259199978263454
51.1306281518174,13.8278094517253,0.259199978263454
51.1306281518174,13.8350039563231,0.240850458181111
51.1306281518174,13.8421984609208,0.279006693171668
51.1306281518174,13.8493929655185,0.348201353492088
51.1306281518174,13.8565874701163,0.314920550671909
51.1306281518174,13.863781974714,0.259199978263454
51.1306281518174,13.8709764793118,0.259199978263454
51.1352542897513,13.7198918827593,0.261111595583085
51.1352542897513,13.727086387357,0.259199978263454
51.1352542897513,13.7342808919547,0.259199978263454
51.1352542897513,13.7486699011502,0.259199978263454
51.1352542897513,13.7630589103457,0.259199978263454
51.1352542897513,13.7702534149434,0.244552388361744
51.1352542897513,13.7774479195412,0.172786416090637
51.1352542897513,13.7846424241389,0.243934024160613
51.1352542897513,13.7918369287366,0.308236802622374
51.1352542897513,13.7990314333344,0.271765397903853
51.1352542897513,13.8062259379321,0.265902790881279
51.1352542897513,13.8134204425299,0.259199978263454
51.1352542897513,13.8206149471276,0.259199978263454
51.1352542897513,13.8278094517253,0.259199978263454
51.1352542897513,13.8350039563231,0.256368919404114
51.1352542897513,13.8421984609208,0.259467126704264
51.1352542897513,13.8493929655185,0.259199978263454
51.1352542897513,13.8565874701163,0.259199978263454
51.1352542897513,13.863781974714,0.259199978263454
51.1398804276852,13.7630589103457,0.259199978263454
51.1398804276852,13.7702534149434,0.259199978263454
51.1398804276852,13.7774479195412,0.258559241390636
51.1398804276852,13.7846424241389,0.259199978263454
51.1398804276852,13.7918369287366,0.352439230260523
51.1398804276852,13.7990314333344,0.637855110268218
51.1398804276852,13.8062259379321,0.413232094640633
51.1398804276852,13.8134204425299,0.314444857689083
51.1398804276852,13.8206149471276,0.259199978263454
51.1398804276852,13.8278094517253,0.259199978263454
51.1398804276852,13.8350039563231,0.259199978263454
51.1398804276852,13.8421984609208,0.259199978263454
51.1398804276852,13.8493929655185,0.259199978263454
51.1398804276852,13.8565874701163,0.259199978263454
51.1398804276852,13.863781974714,0.259199978263454
51.1398804276852,13.8709764793118,0.259199978263454
51.1398804276852,13.8781709839095,0.259199978263454
51.144506565619,13.7702534149434,0.259199978263454
51.144506565619,13.7774479195412,0.259199978263454
51.144506565619,13.7846424241389,0.259199978263454
51.144506565619,13.7918369287366,0.298868448737526
51.144506565619,13.7990314333344,0.313115242755838
51.144506565619,13.8062259379321,0.285001051621637
51.144506565619,13.8134204425299,0.289629998023272
51.144506565619,13.8206149471276,0.259199978263454
51.144506565619,13.8278094517253,0.259199978263454
51.144506565619,13.8350039563231,0.259199978263454
51.144506565619,13.8421984609208,0.259199978263454
51.144506565619,13.8493929655185,0.259199978263454
51.144506565619,13.8565874701163,0.259199978263454
51.144506565619,13.863781974714,0.294126785157117
51.144506565619,13.8709764793118,0.255748412540731
51.144506565619,13.8781709839095,0.259199978263454
51.144506565619,13.8853654885072,0.259199978263454
51.1491327035529,13.7630589103457,0.259199978263454
51.1491327035529,13.7702534149434,0.259199978263454
51.1491327035529,13.7774479195412,0.259199978263454
51.1491327035529,13.7846424241389,0.273760175267316
51.1491327035529,13.7918369287366,0.277189467155558
51.1491327035529,13.7990314333344,0.324871263940274
51.1491327035529,13.8062259379321,0.324319653326189
51.1491327035529,13.8134204425299,0.253302991921172
51.1491327035529,13.8206149471276,0.259199978263454
51.1491327035529,13.8421984609208,0.259199978263454
51.1491327035529,13.8493929655185,0.259199978263454
51.1491327035529,13.8565874701163,0.259199978263454
51.1491327035529,13.863781974714,0.299980601601293
51.1491327035529,13.8709764793118,0.279699889341311
51.1491327035529,13.8781709839095,0.270168639413031
51.1537588414867,13.7630589103457,0.259199978263454
51.1537588414867,13.7702534149434,0.259199978263454
51.1537588414867,13.7774479195412,0.259199978263454
51.1537588414867,13.7846424241389,0.30481521272683
51.1537588414867,13.7918369287366,0.288011146358698
51.1537588414867,13.7990314333344,0.248978170318973
51.1537588414867,13.8062259379321,0.29968866031967
51.1537588414867,13.8134204425299,0.282547952039566
51.1537588414867,13.8565874701163,0.259199978263454
51.1537588414867,13.863781974714,0.259199978263454
51.1537588414867,13.8709764793118,0.259199978263454
51.1537588414867,13.8781709839095,0.259199978263454
51.1583849794206,13.755864405748,0.259199978263454
51.1583849794206,13.7630589103457,0.259199978263454
51.1583849794206,13.7702534149434,0.259442183161746
51.1583849794206,13.7774479195412,0.259199978263454
51.1583849794206,13.7846424241389,0.259199978263454
51.1583849794206,13.7918369287366,0.259199978263454
51.1583849794206,13.7990314333344,0.280082431702027
51.1583849794206,13.8062259379321,0.259199978263454
51.1630111173545,13.7486699011502,0.259199978263454
51.1630111173545,13.755864405748,0.259199978263454
51.1630111173545,13.7630589103457,0.359159047289275
51.1630111173545,13.7702534149434,0.316577737314472
51.1630111173545,13.7774479195412,0.262336104058279
51.1630111173545,13.7846424241389,0.283069460892291
51.1630111173545,13.7918369287366,0.264748588834467
51.1630111173545,13.7990314333344,0.287949889438225
51.1676372552883,13.755864405748,0.259199978263454
51.1676372552883,13.7630589103457,0.281691065289683
51.1676372552883,13.7702534149434,0.259199978263454
51.1676372552883,13.7774479195412,0.259199978263454
51.1676372552883,13.7990314333344,0.262687265490949
