nan,nan,8.042204597989063841e-02
1.116099791933334373e+01,5.048079709478095367e+01,9.325557597554370859e-02
1.100597310806408302e+01,5.039415629293389287e+01,1.054875880582648306e-01
1.102427668879280276e+01,5.043201974628499329e+01,1.169452434483565506e-01
1.112134880337017329e+01,5.039522359554869269e+01,1.290673860175247933e-01
1.122456315789464476e+01,5.039847762665171871e+01,1.405564362244028365e-01
1.107641112634046543e+01,5.037485009212249309e+01,1.521641864520374143e-01
1.124356183472718307e+01,5.031154032871346260e+01,1.642587984214314289e-01
1.097805618303478603e+01,5.040956801034780455e+01,1.759219387644472554e-01
1.111846670856484565e+01,5.050063104881837006e+01,1.881322889270091170e-01
1.103906256835126953e+01,5.039666983502802822e+01,1.986585239971953576e-01
