nan,nan,7.360680727449098182e-01
8.466818033478777039e+00,4.919810336494161618e+01,7.483290390086748678e-01
8.709749184406440747e+00,4.903534888581563678e+01,7.640095695293386280e-01
8.529376611428363120e+00,4.905182858364406684e+01,7.790593329895100227e-01
8.309955454823432675e+00,4.897649238206089706e+01,7.930719753028335761e-01
8.388912006178378178e+00,4.908153218557811215e+01,8.059614577208477071e-01
8.521597970173603542e+00,4.900253513353926138e+01,8.175422018409531644e-01
8.336197037697594681e+00,4.887851365148929261e+01,8.318218897061223638e-01
8.361689506339088140e+00,4.892722880369866090e+01,8.443703376438812525e-01
8.397498240253746360e+00,4.909869760448230380e+01,8.580805271040931048e-01
8.505397330658462707e+00,4.925599867570866053e+01,8.714638340297315988e-01
