nan,nan,1.227712010452348401e-01
1.039494576048865682e+01,4.829811087183840357e+01,1.356590881231560519e-01
1.026124983461145668e+01,4.845162088918615240e+01,1.465706212301585432e-01
1.041440698377752483e+01,4.842136598704749417e+01,1.583530424322215913e-01
1.048883636989686963e+01,4.824472814972356360e+01,1.702801343538834500e-01
1.025495189733121393e+01,4.838448008095096498e+01,1.817454821444575985e-01
1.019261779465249873e+01,4.841278259077010659e+01,1.932671127600021355e-01
1.053161895447503227e+01,4.829358696687854291e+01,2.063856397031422207e-01
1.047860690928054161e+01,4.847296389346726642e+01,2.179567037264890650e-01
1.025022422111618781e+01,4.836519069988380437e+01,2.288657869253553079e-01
1.020552966925435534e+01,4.837045007830075605e+01,2.405522854446336400e-01
