nan,nan,2.913020939907438600e-01
1.093195573838900536e+01,4.927922467682742536e+01,3.030057571508241732e-01
1.091948129688833724e+01,4.914822779312095236e+01,3.147012141612745562e-01
1.091410171984434818e+01,4.926326072022020242e+01,3.275240710404790367e-01
1.095915448637316558e+01,4.923902706775787408e+01,3.391775523292461236e-01
1.099471593322418883e+01,4.929998420447179086e+01,3.506568626805624533e-01
1.117439547092420682e+01,4.918043313121354032e+01,3.613471113513331834e-01
1.106968121780941772e+01,4.930052085486857294e+01,3.724897812170681610e-01
1.126903940925361525e+01,4.903797220748315056e+01,3.838768464387724566e-01
1.119027782241054503e+01,4.921216431075995956e+01,3.956726405425425863e-01
1.120228845472409418e+01,4.922826161664160338e+01,4.068715780995237341e-01
