nan,nan,3.154591913474741882e-01
1.001029694147020166e+01,5.202544008293006783e+01,3.279160908844988009e-01
1.012826228946867602e+01,5.214556833081114462e+01,3.395411175537226822e-01
1.003445624186916163e+01,5.204910839154960200e+01,3.511200952948339560e-01
9.901612453570793448e+00,5.192599241021985534e+01,3.628624851436095811e-01
9.991436398918393635e+00,5.219689221173229043e+01,3.748522228624120434e-01
1.001050709958088270e+01,5.196186942760699878e+01,3.871149875849581590e-01
1.000946155310397323e+01,5.220670592083637729e+01,4.008379872689599166e-01
9.833116581469012019e+00,5.198962951055865744e+01,4.131873992970797049e-01
9.776130261520966869e+00,5.208444520881509021e+01,4.290689273878240950e-01
9.721417668975895765e+00,5.208120507801900345e+01,4.403962371463353564e-01
