nan,nan,2.510649053157696375e-01
1.088798911405835135e+01,4.828395593254964524e+01,2.612900050104380867e-01
1.077493761317481358e+01,4.822290555608671525e+01,2.730618864023455772e-01
1.083983689806857065e+01,4.835135678035172191e+01,2.873366254800883146e-01
1.073353107203162438e+01,4.834445980918313523e+01,2.988782436613715010e-01
1.078661325333477983e+01,4.835404279098887770e+01,3.116144533327201982e-01
1.072729771694452872e+01,4.831059229408627687e+01,3.237418947448806872e-01
1.076038228447158041e+01,4.837752096217425191e+01,3.360143782695557135e-01
1.081050355666050677e+01,4.826719733888654673e+01,3.486380678310452286e-01
1.075831066309710415e+01,4.833012098735854778e+01,3.605958145137395654e-01
1.085279787679811214e+01,4.823337699267795387e+01,3.722444336447409685e-01
