nan,nan,4.060820607482570344e-01
1.079431564589437542e+01,5.430984329863435534e+01,4.180400941243648250e-01
1.062782295755631168e+01,5.415282061421083171e+01,4.292955287547928211e-01
1.067352560283317864e+01,5.390913541986664370e+01,4.406410953972051958e-01
1.105556950992612819e+01,5.419143829416745461e+01,4.526483983383778886e-01
1.094960888697972656e+01,5.438126728120992226e+01,4.655548994440393828e-01
1.114354124268476021e+01,5.444607836990559235e+01,4.774440288717739511e-01
1.108194653314532019e+01,5.435686425872469130e+01,4.885367424634913802e-01
1.072554899676820916e+01,5.420782552433844614e+01,4.995987485232296632e-01
1.107810543940018988e+01,5.425292888497612154e+01,5.109208609725389705e-01
1.098727105175169960e+01,5.419416075088712859e+01,5.223953566977986851e-01
