nan,nan,1.952913148984668223e-01
9.995613733482930030e+00,5.370345245208811491e+01,2.067735227083185579e-01
1.029498566654195812e+01,5.395807280636472569e+01,2.195137884708579235e-01
1.004461744021268821e+01,5.368695369932478201e+01,2.316222223209502551e-01
9.939052441833780449e+00,5.380295852186909400e+01,2.430004049451887083e-01
1.015123609122943726e+01,5.382341999606361327e+01,2.547254397479173926e-01
9.996156356583412617e+00,5.373160942624128467e+01,2.683727575819235822e-01
9.986566414902126709e+00,5.368399100373127908e+01,2.813041635384088690e-01
1.000657494878213960e+01,5.379557035137190724e+01,2.920057072276847077e-01
1.029469146174155370e+01,5.389766294155928961e+01,3.030837487032499444e-01
1.020965544862003505e+01,5.395437173051928426e+01,3.163451334062408749e-01
