nan,nan,1.386220761048078398e-01
1.340867115880277360e+01,5.236196565675687964e+01,1.513436060318184562e-01
1.316908484573833249e+01,5.208720182207244420e+01,1.663077312269764796e-01
1.311737274757029326e+01,5.193358626335964345e+01,1.788238630312990740e-01
1.347332674436727551e+01,5.216588566532795568e+01,1.901471861156735776e-01
1.308075783669251635e+01,5.199219735314292024e+01,2.050717783322154320e-01
1.329395045480569237e+01,5.228182207878622023e+01,2.164520959141682799e-01
1.340789622910289225e+01,5.231960777032391974e+01,2.275579369425022869e-01
1.324907608828997319e+01,5.230894902077567110e+01,2.395551636493584713e-01
1.332110393523157832e+01,5.231231981825042254e+01,2.509691393390107161e-01
1.343467801564996122e+01,5.232539605210381239e+01,2.629687309421749886e-01
