nan,nan,3.151181231169142283e-01
9.770216290204329468e+00,5.470457293001494747e+01,3.263902406534714973e-01
9.336167547275755041e+00,5.468792783398848201e+01,3.407991356776052805e-01
9.602852989977021636e+00,5.450513995336912387e+01,3.527296646667263391e-01
9.542022450074890472e+00,5.454708367242706402e+01,3.647151224256552915e-01
9.540574402087125705e+00,5.482792903312417820e+01,3.770970284000163542e-01
9.275342751701113997e+00,5.437187716547006033e+01,3.884041355402335638e-01
9.516173819701625902e+00,5.447952135535195595e+01,3.993273744982986928e-01
9.249849540555572958e+00,5.470636478356419730e+01,4.111779352618750716e-01
9.598304973882740398e+00,5.476411965738478216e+01,4.230729683165593835e-01
9.558037271738365703e+00,5.436741286307329801e+01,4.342573933762392535e-01
