nan,nan,1.164758268101750843e-01
7.022894810168645030e+00,5.000703709583842027e+01,1.286214315262413921e-01
6.955585892397105674e+00,5.000873908767152898e+01,1.404697446420365425e-01
6.904886680424728418e+00,5.004226595186403159e+01,1.521946722627550708e-01
6.890133411159630406e+00,4.995744863414753922e+01,1.636086976806858384e-01
7.011488166413055723e+00,4.995415288321337499e+01,1.774437022024157318e-01
6.773842339530681045e+00,4.998612055801576304e+01,1.906317746380697953e-01
7.118207297351733409e+00,4.985335431691145658e+01,2.021082778949228609e-01
6.892692616408872652e+00,4.985393157461393798e+01,2.143163820637965511e-01
7.105114019101572254e+00,4.995904082596625528e+01,2.256944616390154090e-01
7.186657613722156945e+00,4.989320501410202979e+01,2.388664945453227717e-01
