53.0853114,8.22535198965782,0.229111195355366
53.0898537610682,8.21096292471485,0.308089247066426
53.0898537610682,8.21815745718633,0.277916254463703
53.0898537610682,8.22535198965782,0.261058609738815
53.0898537610682,8.2325465221293,0.257693579821549
53.0898537610682,8.23974105460079,0.349388111958663
53.0898537610682,8.24693558707227,0.291382729178824
53.0943961221364,8.19657385977188,0.259199978263454
53.0943961221364,8.20376839224336,0.300587860156092
53.0943961221364,8.21096292471485,0.414860088981831
53.0943961221364,8.21815745718633,0.300580261189594
53.0943961221364,8.22535198965782,0.463083873487211
53.0943961221364,8.2325465221293,0.334688209916059
53.0943961221364,8.23974105460079,0.4406635186927
53.0943961221364,8.24693558707227,0.419245388733573
53.0943961221364,8.25413011954376,0.278809986856724
53.0943961221364,8.26132465201524,0.259199978263454
53.0989384832046,8.20376839224336,0.282562603923524
53.0989384832046,8.21096292471485,0.361444910978385
53.0989384832046,8.21815745718633,0.263852041125805
53.0989384832046,8.22535198965782,0.307126338578579
53.0989384832046,8.2325465221293,0.366423604979919
53.0989384832046,8.23974105460079,0.329061231651578
53.0989384832046,8.24693558707227,0.343064094758444
53.0989384832046,8.25413011954376,0.287562761370947
53.0989384832046,8.26132465201524,0.259199978263454
53.0989384832046,8.26851918448673,0.268146340164041
53.0989384832046,8.27571371695821,0.336693135528509
53.1034808442728,8.20376839224336,0.302057457671275
53.1034808442728,8.21096292471485,0.470676284604349
53.1034808442728,8.21815745718633,0.264073129197638
53.1034808442728,8.22535198965782,0.27678231741152
53.1034808442728,8.2325465221293,0.325706568310537
53.1034808442728,8.23974105460079,0.259199978263454
53.1034808442728,8.24693558707227,0.262487828413406
53.1034808442728,8.25413011954376,0.248665188524643
53.1034808442728,8.26132465201524,0.262051564003129
53.1034808442728,8.26851918448673,0.287730594840585
53.1034808442728,8.27571371695821,0.284457555397889
53.108023205341,8.20376839224336,0.275300232831123
53.108023205341,8.21096292471485,0.360928969366939
53.108023205341,8.21815745718633,0.343984075672352
53.108023205341,8.22535198965782,0.343266326296705
53.108023205341,8.2325465221293,0.378908362373365
53.108023205341,8.23974105460079,0.272972983177659
53.108023205341,8.24693558707227,0.297636871931883
53.108023205341,8.25413011954376,0.266338755901848
53.108023205341,8.26132465201524,0.245582233744854
53.108023205341,8.26851918448673,0.258074971600514
53.108023205341,8.27571371695821,0.292311733307013
53.1125655664092,8.1390176,0.286138493663585
53.1125655664092,8.14621213247148,0.259199978263454
53.1125655664092,8.15340666494297,0.259199978263454
53.1125655664092,8.16060119741445,0.259199978263454
53.1125655664092,8.16779572988594,0.259199978263454
53.1125655664092,8.17499026235742,0.259199978263454
53.1125655664092,8.18218479482891,0.274793176535999
53.1125655664092,8.18937932730039,0.32677869539324
53.1125655664092,8.21096292471485,0.450538166378004
53.1125655664092,8.21815745718633,0.513048163359959
53.1125655664092,8.22535198965782,0.352231154634865
53.1125655664092,8.2325465221293,0.298071029325258
53.1125655664092,8.23974105460079,0.323448426442356
53.1125655664092,8.24693558707227,0.299662746030584
53.1125655664092,8.25413011954376,0.349093226945322
53.1125655664092,8.26132465201524,0.267782844509753
53.1125655664092,8.26851918448673,0.206545593949283
53.1125655664092,8.27571371695821,0.265507393485196
53.1171079274774,8.1390176,0.259199978263454
53.1171079274774,8.14621213247148,0.259199978263454
53.1171079274774,8.15340666494297,0.259199978263454
53.1171079274774,8.16060119741445,0.259199978263454
53.1171079274774,8.16779572988594,0.259199978263454
53.1171079274774,8.17499026235742,0.259199978263454
53.1171079274774,8.18218479482891,0.284056342366755
53.1171079274774,8.18937932730039,0.364373366953487
53.1171079274774,8.19657385977188,0.288118547800909
53.1171079274774,8.20376839224336,0.264345008713546
53.1171079274774,8.21096292471485,0.315047032323391
53.1171079274774,8.21815745718633,0.455163926227737
53.1171079274774,8.22535198965782,0.412619062589102
53.1171079274774,8.2325465221293,0.259199978263454
53.1171079274774,8.23974105460079,0.360481377720157
53.1171079274774,8.24693558707227,0.367686972915545
53.1171079274774,8.25413011954376,0.378201492983334
53.1171079274774,8.26132465201524,0.335411942887746
53.1171079274774,8.26851918448673,0.26855016278694
53.1171079274774,8.27571371695821,0.259199978263454
53.1216502885456,8.1390176,0.259199978263454
53.1216502885456,8.14621213247148,0.259199978263454
53.1216502885456,8.15340666494297,0.259199978263454
53.1216502885456,8.16060119741445,0.274928037747186
53.1216502885456,8.16779572988594,0.266944074301113
53.1216502885456,8.17499026235742,0.259199978263454
53.1216502885456,8.18218479482891,0.310180389048344
53.1216502885456,8.18937932730039,0.458018224638305
53.1216502885456,8.19657385977188,0.442587116950517
53.1216502885456,8.20376839224336,0.383189380401206
53.1216502885456,8.21096292471485,0.391332862115155
53.1216502885456,8.21815745718633,0.408567458856949
53.1216502885456,8.22535198965782,0.468182802857493
53.1216502885456,8.2325465221293,0.272317362663707
53.1216502885456,8.23974105460079,0.261003605915005
53.1216502885456,8.24693558707227,0.312929303789764
53.1216502885456,8.25413011954376,0.37442964837045
53.1216502885456,8.26132465201524,0.280093827573763
53.1216502885456,8.26851918448673,0.259199978263454
53.1216502885456,8.27571371695821,0.259199978263454
53.1261926496138,8.1390176,0.259199978263454
53.1261926496138,8.14621213247148,0.259199978263454
53.1261926496138,8.15340666494297,0.255281162309614
53.1261926496138,8.16060119741445,0.282691411698561
53.1261926496138,8.16779572988594,0.316730219428249
53.1261926496138,8.17499026235742,0.459844471891175
53.1261926496138,8.18218479482891,0.316995064296055
53.1261926496138,8.18937932730039,0.239747999257502
53.1261926496138,8.19657385977188,0.366754808576767
53.1261926496138,8.20376839224336,0.42191355272387
53.1261926496138,8.21096292471485,0.386158751866674
53.1261926496138,8.21815745718633,0.494143347131731
53.1261926496138,8.22535198965782,0.56848078353545
53.1261926496138,8.2325465221293,0.43903987554457
53.1261926496138,8.23974105460079,0.330216880574283
53.1261926496138,8.24693558707227,0.337009149970578
53.1261926496138,8.25413011954376,0.258874452613123
53.1261926496138,8.26132465201524,0.259199978263454
53.1261926496138,8.26851918448673,0.259199978263454
53.1261926496138,8.27571371695821,0.259199978263454
53.130735010682,8.14621213247148,0.316662275623174
53.130735010682,8.15340666494297,0.28820328769525
53.130735010682,8.16060119741445,0.244517029019419
53.130735010682,8.16779572988594,0.270904161554134
53.130735010682,8.17499026235742,0.397322251262633
53.130735010682,8.18218479482891,0.485030469662547
53.130735010682,8.18937932730039,0.35142616811689
53.130735010682,8.19657385977188,0.385634869525884
53.130735010682,8.20376839224336,0.375656413527624
53.130735010682,8.21096292471485,0.317895531652941
53.130735010682,8.21815745718633,0.557593380925141
53.130735010682,8.22535198965782,0.534424757574713
53.130735010682,8.2325465221293,0.223365084997274
53.130735010682,8.23974105460079,0.284831285430404
53.130735010682,8.24693558707227,0.309284801579976
53.130735010682,8.25413011954376,0.351717235972315
53.130735010682,8.26132465201524,0.315408744149107
53.130735010682,8.26851918448673,0.259199978263454
53.130735010682,8.27571371695821,0.251255489021117
53.1352773717502,8.14621213247148,0.288235234548305
53.1352773717502,8.15340666494297,0.315546999875591
53.1352773717502,8.16060119741445,0.395450230231856
53.1352773717502,8.16779572988594,0.440509082836837
53.1352773717502,8.17499026235742,0.308929140437115
53.1352773717502,8.18218479482891,0.390324767018314
53.1352773717502,8.18937932730039,0.530048523372253
53.1352773717502,8.19657385977188,0.443416598299555
53.1352773717502,8.20376839224336,0.351763773696653
53.1352773717502,8.21096292471485,0.531030649128832
53.1352773717502,8.21815745718633,0.827259121956608
53.1352773717502,8.22535198965782,0.35863001925205
53.1352773717502,8.2325465221293,0.362938393323835
53.1352773717502,8.23974105460079,0.381888491457866
53.1352773717502,8.24693558707227,0.290775374603784
53.1352773717502,8.25413011954376,0.309739612562272
53.1352773717502,8.26132465201524,0.273398831575189
53.1352773717502,8.26851918448673,0.259199978263454
53.1352773717502,8.27571371695821,0.259199978263454
53.1398197328184,8.14621213247148,0.243953069262693
53.1398197328184,8.15340666494297,0.352125958691996
53.1398197328184,8.16060119741445,0.414557476636496
53.1398197328184,8.16779572988594,0.40355918139398
53.1398197328184,8.17499026235742,0.479158556864463
53.1398197328184,8.18218479482891,0.504967343672406
53.1398197328184,8.18937932730039,0.430845152112938
53.1398197328184,8.19657385977188,0.394845132863747
53.1398197328184,8.20376839224336,0.453428185459466
53.1398197328184,8.21096292471485,0.790829395426213
53.1398197328184,8.21815745718633,0.742463258799337
53.1398197328184,8.22535198965782,0.612648161241729
53.1398197328184,8.2325465221293,0.330614024927409
53.1398197328184,8.23974105460079,0.272687436886442
53.1398197328184,8.24693558707227,0.290497563899921
53.1398197328184,8.25413011954376,0.340024445333666
53.1398197328184,8.26132465201524,0.28649613221328
53.1398197328184,8.26851918448673,0.259199978263454
53.1398197328184,8.27571371695821,0.259199978263454
53.1443620938866,8.15340666494297,0.282125839531509
53.1443620938866,8.16060119741445,0.285719213687802
53.1443620938866,8.16779572988594,0.306468708538132
53.1443620938866,8.17499026235742,0.33428406585082
53.1443620938866,8.18218479482891,0.426215510248092
53.1443620938866,8.18937932730039,0.464040080973051
53.1443620938866,8.19657385977188,0.53205254279541
53.1443620938866,8.20376839224336,0.578953634995922
53.1443620938866,8.21096292471485,0.818774793054868
53.1443620938866,8.21815745718633,0.705338153273936
53.1443620938866,8.22535198965782,0.521833893547643
53.1443620938866,8.2325465221293,0.337884036734207
53.1443620938866,8.23974105460079,0.285338729690162
53.1443620938866,8.24693558707227,0.259199978263454
53.1443620938866,8.25413011954376,0.28576391473527
53.1443620938866,8.26132465201524,0.270058043380871
53.1443620938866,8.26851918448673,0.259199978263454
53.1443620938866,8.27571371695821,0.259199978263454
53.1489044549548,8.15340666494297,0.260238449790148
53.1489044549548,8.16060119741445,0.313928120589567
53.1489044549548,8.16779572988594,0.269141339307599
53.1489044549548,8.17499026235742,0.407249530479415
53.1489044549548,8.18218479482891,0.572634970197382
53.1489044549548,8.18937932730039,0.440441086309041
53.1489044549548,8.19657385977188,0.490975749407943
53.1489044549548,8.20376839224336,0.448770880960582
53.1489044549548,8.21096292471485,0.716618272177308
53.1489044549548,8.21815745718633,0.607110128346247
53.1489044549548,8.22535198965782,0.638831903780846
53.1489044549548,8.2325465221293,0.485460167165615
53.1489044549548,8.23974105460079,0.406014200922484
53.1489044549548,8.24693558707227,0.282073758683125
53.1489044549548,8.25413011954376,0.259199978263454
53.1489044549548,8.26132465201524,0.259199978263454
53.1489044549548,8.26851918448673,0.259199978263454
53.1489044549548,8.27571371695821,0.259199978263454
53.1534468160229,8.16060119741445,0.35583897399355
53.1534468160229,8.16779572988594,0.365390395932909
53.1534468160229,8.17499026235742,0.380607962753576
53.1534468160229,8.18218479482891,0.407780671319335
53.1534468160229,8.18937932730039,0.383893076695358
53.1534468160229,8.19657385977188,0.334745942682382
53.1534468160229,8.20376839224336,0.460426667366232
53.1534468160229,8.21096292471485,0.569222924825907
53.1534468160229,8.21815745718633,0.467000363611889
53.1534468160229,8.22535198965782,0.521270717497797
53.1534468160229,8.2325465221293,0.460157618836518
53.1534468160229,8.23974105460079,0.358093221908658
53.1534468160229,8.24693558707227,0.496587416554345
53.1534468160229,8.25413011954376,0.258624204574781
53.1534468160229,8.26132465201524,0.259199978263454
53.1534468160229,8.26851918448673,0.259199978263454
53.1534468160229,8.27571371695821,0.259199978263454
53.1579891770911,8.16060119741445,0.264389934679577
53.1579891770911,8.16779572988594,0.342802628607051
53.1579891770911,8.17499026235742,0.383548564367933
53.1579891770911,8.18218479482891,0.288435413464413
53.1579891770911,8.18937932730039,0.365236519474113
53.1579891770911,8.19657385977188,0.440415215119048
53.1579891770911,8.20376839224336,0.446311926721192
53.1579891770911,8.21096292471485,0.512924775925667
53.1579891770911,8.21815745718633,0.438003928668462
53.1579891770911,8.22535198965782,0.49354235233678
53.1579891770911,8.2325465221293,0.441121585653086
53.1579891770911,8.23974105460079,0.450354693037775
53.1579891770911,8.24693558707227,0.50210231809731
53.1579891770911,8.25413011954376,0.286169863164385
53.1579891770911,8.26132465201524,0.259199978263454
53.1579891770911,8.26851918448673,0.259199978263454
53.1579891770911,8.27571371695821,0.259199978263454
53.1625315381593,8.16060119741445,0.244576986141801
53.1625315381593,8.16779572988594,0.293400302728709
53.1625315381593,8.17499026235742,0.322867530182512
53.1625315381593,8.18218479482891,0.450350705227061
53.1625315381593,8.18937932730039,0.299885192722132
53.1625315381593,8.19657385977188,0.35009078284668
53.1625315381593,8.20376839224336,0.3138868645704
53.1625315381593,8.21096292471485,0.366326457574911
53.1625315381593,8.21815745718633,0.457668921180511
53.1625315381593,8.22535198965782,0.680003169230501
53.1625315381593,8.2325465221293,0.485971068160652
53.1625315381593,8.23974105460079,0.42124207631199
53.1625315381593,8.24693558707227,0.378613672386637
53.1625315381593,8.25413011954376,0.240523022673167
53.1625315381593,8.26132465201524,0.259199978263454
53.1625315381593,8.26851918448673,0.259199978263454
53.1625315381593,8.27571371695821,0.259986299598015
53.1670738992275,8.16779572988594,0.259199978263454
53.1670738992275,8.17499026235742,0.279205309007312
53.1670738992275,8.18218479482891,0.327983094696467
53.1670738992275,8.18937932730039,0.313177197788148
53.1670738992275,8.19657385977188,0.431801223148543
53.1670738992275,8.20376839224336,0.399773415806052
53.1670738992275,8.21096292471485,0.307520684028728
53.1670738992275,8.21815745718633,0.352695346504679
53.1670738992275,8.22535198965782,0.451459769009605
53.1670738992275,8.2325465221293,0.363242367471227
53.1670738992275,8.23974105460079,0.397539206779414
53.1670738992275,8.24693558707227,0.345295083313055
53.1670738992275,8.25413011954376,0.303487238579883
53.1670738992275,8.26132465201524,0.22368719151567
53.1670738992275,8.26851918448673,0.252057105124276
53.1670738992275,8.27571371695821,0.296515507979045
53.1716162602957,8.16779572988594,0.259199978263454
53.1716162602957,8.17499026235742,0.259199978263454
53.1716162602957,8.18218479482891,0.274067047844519
53.1716162602957,8.18937932730039,0.356417718468461
53.1716162602957,8.19657385977188,0.4329633090142
53.1716162602957,8.20376839224336,0.310416990431388
53.1716162602957,8.21096292471485,0.339030734089108
53.1716162602957,8.21815745718633,0.392153576610965
53.1716162602957,8.22535198965782,0.513851879389811
53.1716162602957,8.2325465221293,0.543706072116607
53.1716162602957,8.23974105460079,0.327244425181989
53.1716162602957,8.24693558707227,0.385276293649186
53.1716162602957,8.25413011954376,0.266446561966219
53.1716162602957,8.26132465201524,0.204967127946743
53.1716162602957,8.26851918448673,0.246777735177654
53.1716162602957,8.27571371695821,0.259199978263454
53.1761586213639,8.16779572988594,0.287794586675761
53.1761586213639,8.17499026235742,0.259199978263454
53.1761586213639,8.18218479482891,0.312568307712557
53.1761586213639,8.18937932730039,0.182695878615501
53.1761586213639,8.19657385977188,0.378778238392914
53.1761586213639,8.20376839224336,0.346532513551303
53.1761586213639,8.21096292471485,0.265123224201503
53.1761586213639,8.21815745718633,0.266031308862864
53.1761586213639,8.22535198965782,0.332151698082953
53.1761586213639,8.2325465221293,0.336313034468989
53.1761586213639,8.23974105460079,0.259199978263454
53.1761586213639,8.24693558707227,0.26874633224854
53.1761586213639,8.25413011954376,0.259199978263454
53.1761586213639,8.26132465201524,0.259199978263454
53.1761586213639,8.26851918448673,0.259199978263454
53.1761586213639,8.27571371695821,0.259199978263454
53.1807009824321,8.16779572988594,0.259199978263454
53.1807009824321,8.17499026235742,0.264751304342347
53.1807009824321,8.18218479482891,0.318966809144662
53.1807009824321,8.18937932730039,0.286357492181971
53.1807009824321,8.19657385977188,0.314003507058199
53.1807009824321,8.20376839224336,0.35585229548887
53.1807009824321,8.21096292471485,0.279072060497544
53.1807009824321,8.21815745718633,0.248840420455302
53.1807009824321,8.22535198965782,0.2722775507658
53.1807009824321,8.2325465221293,0.295239834617344
53.1807009824321,8.23974105460079,0.279579885247478
53.1807009824321,8.24693558707227,0.264948400321002
53.1807009824321,8.25413011954376,0.259199978263454
53.1807009824321,8.26132465201524,0.259199978263454
53.1807009824321,8.26851918448673,0.259199978263454
53.1807009824321,8.27571371695821,0.259199978263454
53.1852433435003,8.18218479482891,0.297481478667808
53.1852433435003,8.18937932730039,0.288371676360373
53.1852433435003,8.19657385977188,0.311437782152001
53.1852433435003,8.20376839224336,0.443523784725058
53.1852433435003,8.21096292471485,0.300696486603261
53.1852433435003,8.21815745718633,0.217959470794952
53.1852433435003,8.22535198965782,0.226842097713538
53.1852433435003,8.2325465221293,0.340190527333567
53.1852433435003,8.23974105460079,0.461392192249258
53.1852433435003,8.24693558707227,0.427199424198042
53.1852433435003,8.25413011954376,0.253426652852582
53.1852433435003,8.26132465201524,0.259199978263454
53.1852433435003,8.26851918448673,0.259199978263454
53.1852433435003,8.27571371695821,0.259199978263454
53.1897857045685,8.18937932730039,0.281159111233587
53.1897857045685,8.19657385977188,0.396789063909921
53.1897857045685,8.20376839224336,0.395731824307298
53.1897857045685,8.21096292471485,0.339232234569132
53.1897857045685,8.21815745718633,0.35076359423288
53.1897857045685,8.22535198965782,0.391076860859835
53.1897857045685,8.2325465221293,0.364033377056786
53.1897857045685,8.23974105460079,0.40933547901322
53.1897857045685,8.24693558707227,0.339576759514791
53.1897857045685,8.25413011954376,0.258958468375286
53.1897857045685,8.26132465201524,0.259199978263454
53.1897857045685,8.26851918448673,0.259199978263454
53.1897857045685,8.27571371695821,0.259199978263454
53.1943280656367,8.19657385977188,0.29415150535603
53.1943280656367,8.20376839224336,0.343274687989074
53.1943280656367,8.21096292471485,0.372173181605853
53.1943280656367,8.21815745718633,0.256133603422697
53.1943280656367,8.22535198965782,0.312832555456904
53.1943280656367,8.2325465221293,0.296436958644131
53.1943280656367,8.23974105460079,0.268422170987428
53.1943280656367,8.24693558707227,0.259569321658116
53.1988704267049,8.20376839224336,0.326551137649875
53.1988704267049,8.21096292471485,0.27627627498992
53.1988704267049,8.21815745718633,0.259199978263454
53.1988704267049,8.22535198965782,0.270545118225454
53.1988704267049,8.23974105460079,0.259199978263454
53.1988704267049,8.24693558707227,0.374965006420715
