nan,nan,3.514787430568943050e-01
7.174884908037653553e+00,5.189141768741063743e+01,3.631341074697201909e-01
7.403220292099042865e+00,5.184104997810965898e+01,3.742682089209221075e-01
7.532776877044423003e+00,5.173204466475576879e+01,3.867646203764678048e-01
7.387327187145565688e+00,5.196357845138466303e+01,3.979894339628579636e-01
7.592768746531774582e+00,5.173083080366001241e+01,4.106290848985792441e-01
7.191277889338302920e+00,5.190140005072757390e+01,4.216459636910110942e-01
7.542434316900224367e+00,5.182267444639941800e+01,4.356747489430729536e-01
7.142945694248728827e+00,5.194030367407631132e+01,4.473661993745338683e-01
7.415642093983220384e+00,5.193577633468142096e+01,4.593205004377605705e-01
7.552291807612158792e+00,5.170886338255311188e+01,4.719725521062045348e-01
