48.1190583,10.1233844634275,0.312828968683715
48.1190583,10.1305789865988,0.337804607345354
48.1190583,10.1377735097702,0.259199978263454
48.1190583,10.1449680329416,0.259199978263454
48.1190583,10.1521625561129,0.259505443673254
48.123623987622,10.1161899402561,0.261632878172049
48.123623987622,10.1233844634275,0.321906978042194
48.123623987622,10.1305789865988,0.457625489712622
48.123623987622,10.1377735097702,0.259199978263454
48.123623987622,10.1449680329416,0.259826234766381
48.123623987622,10.1521625561129,0.270991526298824
48.123623987622,10.1593570792843,0.259199978263454
48.123623987622,10.1665516024557,0.259199978263454
48.123623987622,10.1737461256271,0.259199978263454
48.123623987622,10.1881351719698,0.259199978263454
48.1281896752441,10.1161899402561,0.255979648205881
48.1281896752441,10.1233844634275,0.202296982406536
48.1281896752441,10.1305789865988,0.259199978263454
48.1281896752441,10.1377735097702,0.259199978263454
48.1281896752441,10.1449680329416,0.259199978263454
48.1281896752441,10.1521625561129,0.259199978263454
48.1281896752441,10.1593570792843,0.259199978263454
48.1281896752441,10.1665516024557,0.259199978263454
48.1281896752441,10.1737461256271,0.259199978263454
48.1281896752441,10.1809406487984,0.259199978263454
48.1281896752441,10.1881351719698,0.259199978263454
48.1327553628661,10.1089954170847,0.259199978263454
48.1327553628661,10.1161899402561,0.241364901600172
48.1327553628661,10.1233844634275,0.259199978263454
48.1327553628661,10.1305789865988,0.259199978263454
48.1327553628661,10.1377735097702,0.259199978263454
48.1327553628661,10.1449680329416,0.259199978263454
48.1327553628661,10.1521625561129,0.259199978263454
48.1327553628661,10.1593570792843,0.259199978263454
48.1327553628661,10.1665516024557,0.259199978263454
48.1327553628661,10.1737461256271,0.259199978263454
48.1327553628661,10.1809406487984,0.259199978263454
48.1327553628661,10.1881351719698,0.259199978263454
48.1327553628661,10.1953296951412,0.259199978263454
48.1373210504882,10.1089954170847,0.259199978263454
48.1373210504882,10.1161899402561,0.243930887102567
48.1373210504882,10.1233844634275,0.259199978263454
48.1373210504882,10.1305789865988,0.259199978263454
48.1373210504882,10.1377735097702,0.259199978263454
48.1373210504882,10.1449680329416,0.259199978263454
48.1373210504882,10.1521625561129,0.259199978263454
48.1373210504882,10.1593570792843,0.259199978263454
48.1373210504882,10.1665516024557,0.259199978263454
48.1373210504882,10.1737461256271,0.259199978263454
48.1373210504882,10.1809406487984,0.259199978263454
48.1373210504882,10.1881351719698,0.259199978263454
48.1373210504882,10.1953296951412,0.259199978263454
48.1373210504882,10.2025242183126,0.259199978263454
48.1418867381102,10.1089954170847,0.259199978263454
48.1418867381102,10.1161899402561,0.231239369598698
48.1418867381102,10.1233844634275,0.243511457238298
48.1418867381102,10.1305789865988,0.259199978263454
48.1418867381102,10.1377735097702,0.259199978263454
48.1418867381102,10.1449680329416,0.259199978263454
48.1418867381102,10.1521625561129,0.259199978263454
48.1418867381102,10.1593570792843,0.259199978263454
48.1418867381102,10.1665516024557,0.30651272873868
48.1418867381102,10.1737461256271,0.263945728803078
48.1418867381102,10.1809406487984,0.259199978263454
48.1418867381102,10.1881351719698,0.259199978263454
48.1418867381102,10.1953296951412,0.259199978263454
48.1418867381102,10.2025242183126,0.259199978263454
48.1418867381102,10.2097187414839,0.259199978263454
48.1464524257322,10.1089954170847,0.259199978263454
48.1464524257322,10.1161899402561,0.267704797506614
48.1464524257322,10.1233844634275,0.284660309299866
48.1464524257322,10.1305789865988,0.259199978263454
48.1464524257322,10.1377735097702,0.259199978263454
48.1464524257322,10.1449680329416,0.259199978263454
48.1464524257322,10.1521625561129,0.259199978263454
48.1464524257322,10.1593570792843,0.259199978263454
48.1464524257322,10.1665516024557,0.292498632727964
48.1464524257322,10.1737461256271,0.305640695213779
48.1464524257322,10.1809406487984,0.259199978263454
48.1464524257322,10.1881351719698,0.259199978263454
48.1464524257322,10.1953296951412,0.259199978263454
48.1464524257322,10.2025242183126,0.259199978263454
48.1510181133543,10.1018008939133,0.259199978263454
48.1510181133543,10.1089954170847,0.259199978263454
48.1510181133543,10.1161899402561,0.286422746943486
48.1510181133543,10.1233844634275,0.259199978263454
48.1510181133543,10.1305789865988,0.259199978263454
48.1510181133543,10.1377735097702,0.259199978263454
48.1510181133543,10.1449680329416,0.259199978263454
48.1510181133543,10.1521625561129,0.259199978263454
48.1510181133543,10.1593570792843,0.259199978263454
48.1510181133543,10.1665516024557,0.260705467356694
48.1510181133543,10.1737461256271,0.25865623057796
48.1510181133543,10.1809406487984,0.259199978263454
48.1510181133543,10.1881351719698,0.259199978263454
48.1510181133543,10.1953296951412,0.259199978263454
48.1510181133543,10.2025242183126,0.259199978263454
48.1555838009763,10.1018008939133,0.286597077231787
48.1555838009763,10.1089954170847,0.259199978263454
48.1555838009763,10.1161899402561,0.235419034217517
48.1555838009763,10.1233844634275,0.259199978263454
48.1555838009763,10.1305789865988,0.259199978263454
48.1555838009763,10.1377735097702,0.259199978263454
48.1555838009763,10.1449680329416,0.259199978263454
48.1555838009763,10.1521625561129,0.259199978263454
48.1555838009763,10.1593570792843,0.259199978263454
48.1555838009763,10.1665516024557,0.259199978263454
48.1555838009763,10.1737461256271,0.259199978263454
48.1555838009763,10.1809406487984,0.259199978263454
48.1555838009763,10.1881351719698,0.259199978263454
48.1555838009763,10.1953296951412,0.259199978263454
48.1555838009763,10.2025242183126,0.259199978263454
48.1601494885984,10.1018008939133,0.28263659861503
48.1601494885984,10.1089954170847,0.392144394326666
48.1601494885984,10.1161899402561,0.414824284924078
48.1601494885984,10.1233844634275,0.260880673769127
48.1601494885984,10.1305789865988,0.259199978263454
48.1601494885984,10.1377735097702,0.259199978263454
48.1601494885984,10.1449680329416,0.259199978263454
48.1601494885984,10.1521625561129,0.259199978263454
48.1601494885984,10.1593570792843,0.259199978263454
48.1601494885984,10.1665516024557,0.259199978263454
48.1601494885984,10.1737461256271,0.259199978263454
48.1601494885984,10.1809406487984,0.259199978263454
48.1601494885984,10.1881351719698,0.259199978263454
48.1601494885984,10.1953296951412,0.259199978263454
48.1601494885984,10.2025242183126,0.259199978263454
48.1647151762204,10.1018008939133,0.259199978263454
48.1647151762204,10.1089954170847,0.322213918496813
48.1647151762204,10.1161899402561,0.380461278401979
48.1647151762204,10.1233844634275,0.210163281747837
48.1647151762204,10.1305789865988,0.259199978263454
48.1647151762204,10.1377735097702,0.259199978263454
48.1647151762204,10.1449680329416,0.259199978263454
48.1647151762204,10.1521625561129,0.259199978263454
48.1647151762204,10.1593570792843,0.259199978263454
48.1647151762204,10.1665516024557,0.259199978263454
48.1647151762204,10.1737461256271,0.259199978263454
48.1647151762204,10.1809406487984,0.259199978263454
48.1647151762204,10.1881351719698,0.259199978263454
48.1647151762204,10.1953296951412,0.259199978263454
48.1647151762204,10.2025242183126,0.259199978263454
48.1647151762204,10.2097187414839,0.259199978263454
48.1647151762204,10.2169132646553,0.259199978263454
48.1692808638424,10.094606370742,0.259199978263454
48.1692808638424,10.1018008939133,0.259199978263454
48.1692808638424,10.1089954170847,0.25838685943701
48.1692808638424,10.1161899402561,0.259199978263454
48.1692808638424,10.1233844634275,0.254807378405798
48.1692808638424,10.1305789865988,0.259199978263454
48.1692808638424,10.1377735097702,0.259199978263454
48.1692808638424,10.1449680329416,0.239853321904713
48.1692808638424,10.1521625561129,0.257380803587821
48.1692808638424,10.1593570792843,0.259199978263454
48.1692808638424,10.1665516024557,0.259199978263454
48.1692808638424,10.1737461256271,0.259199978263454
48.1692808638424,10.1809406487984,0.259199978263454
48.1692808638424,10.1881351719698,0.259199978263454
48.1692808638424,10.1953296951412,0.259199978263454
48.1692808638424,10.2025242183126,0.259199978263454
48.1692808638424,10.2097187414839,0.259199978263454
48.1692808638424,10.2169132646553,0.259199978263454
48.1738465514645,10.094606370742,0.259199978263454
48.1738465514645,10.1018008939133,0.250673606273351
48.1738465514645,10.1089954170847,0.212494362515451
48.1738465514645,10.1161899402561,0.261559565194569
48.1738465514645,10.1233844634275,0.259199978263454
48.1738465514645,10.1305789865988,0.259199978263454
48.1738465514645,10.1377735097702,0.259199978263454
48.1738465514645,10.1449680329416,0.236747567328972
48.1738465514645,10.1521625561129,0.255643716574179
48.1738465514645,10.1593570792843,0.259199978263454
48.1738465514645,10.1665516024557,0.259199978263454
48.1738465514645,10.1737461256271,0.259199978263454
48.1738465514645,10.1809406487984,0.259265424360913
48.1738465514645,10.1881351719698,0.306246905080193
48.1738465514645,10.1953296951412,0.281159192888913
48.1738465514645,10.2025242183126,0.259199978263454
48.1738465514645,10.2097187414839,0.259199978263454
48.1738465514645,10.2169132646553,0.259199978263454
48.1784122390865,10.094606370742,0.259199978263454
48.1784122390865,10.1018008939133,0.259199978263454
48.1784122390865,10.1089954170847,0.259637164491587
48.1784122390865,10.1161899402561,0.259265129981851
48.1784122390865,10.1233844634275,0.259199978263454
48.1784122390865,10.1305789865988,0.259199978263454
48.1784122390865,10.1377735097702,0.259199978263454
48.1784122390865,10.1449680329416,0.263664964116902
48.1784122390865,10.1521625561129,0.2606031272047
48.1784122390865,10.1593570792843,0.259199978263454
48.1784122390865,10.1665516024557,0.259199978263454
48.1784122390865,10.1737461256271,0.259199978263454
48.1784122390865,10.1809406487984,0.259199978263454
48.1784122390865,10.1881351719698,0.263826134711996
48.1784122390865,10.1953296951412,0.259382066636179
48.1784122390865,10.2025242183126,0.259199978263454
48.1784122390865,10.2097187414839,0.259199978263454
48.1784122390865,10.2169132646553,0.259199978263454
48.1829779267086,10.0874118475706,0.259199978263454
48.1829779267086,10.094606370742,0.259199978263454
48.1829779267086,10.1018008939133,0.259199978263454
48.1829779267086,10.1089954170847,0.259199978263454
48.1829779267086,10.1161899402561,0.258699277290167
48.1829779267086,10.1233844634275,0.259199978263454
48.1829779267086,10.1305789865988,0.259199978263454
48.1829779267086,10.1377735097702,0.259199978263454
48.1829779267086,10.1449680329416,0.259199978263454
48.1829779267086,10.1521625561129,0.259199978263454
48.1829779267086,10.1593570792843,0.259199978263454
48.1829779267086,10.1665516024557,0.259199978263454
48.1829779267086,10.1737461256271,0.259199978263454
48.1829779267086,10.1809406487984,0.2619257722231
48.1829779267086,10.1881351719698,0.2622728999595
48.1829779267086,10.1953296951412,0.259199978263454
48.1829779267086,10.2025242183126,0.259199978263454
48.1829779267086,10.2097187414839,0.259199978263454
48.1829779267086,10.2169132646553,0.259199978263454
48.1829779267086,10.2241077878267,0.259199978263454
48.1829779267086,10.231302310998,0.259199978263454
48.1875436143306,10.0874118475706,0.259199978263454
48.1875436143306,10.094606370742,0.259199978263454
48.1875436143306,10.1018008939133,0.259199978263454
48.1875436143306,10.1089954170847,0.240045278582279
48.1875436143306,10.1161899402561,0.226283531697709
48.1875436143306,10.1233844634275,0.259381037455375
48.1875436143306,10.1305789865988,0.259199978263454
48.1875436143306,10.1377735097702,0.259199978263454
48.1875436143306,10.1449680329416,0.259199978263454
48.1875436143306,10.1521625561129,0.259199978263454
48.1875436143306,10.1593570792843,0.259199978263454
48.1875436143306,10.1665516024557,0.259199978263454
48.1875436143306,10.1737461256271,0.259199978263454
48.1875436143306,10.1809406487984,0.259199978263454
48.1875436143306,10.1881351719698,0.259199978263454
48.1875436143306,10.1953296951412,0.259199978263454
48.1875436143306,10.2025242183126,0.259199978263454
48.1875436143306,10.2097187414839,0.259199978263454
48.1875436143306,10.2169132646553,0.259199978263454
48.1921093019526,10.0874118475706,0.259199978263454
48.1921093019526,10.094606370742,0.259199978263454
48.1921093019526,10.1018008939133,0.259199978263454
48.1921093019526,10.1089954170847,0.259199978263454
48.1921093019526,10.1161899402561,0.259199978263454
48.1921093019526,10.1233844634275,0.259199978263454
48.1921093019526,10.1305789865988,0.259199978263454
48.1921093019526,10.1377735097702,0.259199978263454
48.1921093019526,10.1449680329416,0.259199978263454
48.1921093019526,10.1521625561129,0.259199978263454
48.1921093019526,10.1593570792843,0.259199978263454
48.1921093019526,10.1665516024557,0.231460174550356
48.1921093019526,10.1737461256271,0.24433788420199
48.1921093019526,10.1809406487984,0.259199978263454
48.1921093019526,10.1881351719698,0.258124211355575
48.1921093019526,10.1953296951412,0.259199978263454
48.1921093019526,10.2025242183126,0.259199978263454
48.1921093019526,10.2097187414839,0.259199978263454
48.1921093019526,10.2169132646553,0.259199978263454
48.1921093019526,10.2241077878267,0.259199978263454
48.1966749895747,10.0874118475706,0.259199978263454
48.1966749895747,10.094606370742,0.259199978263454
48.1966749895747,10.1018008939133,0.259199978263454
48.1966749895747,10.1089954170847,0.259199978263454
48.1966749895747,10.1161899402561,0.259605032833047
48.1966749895747,10.1233844634275,0.259199978263454
48.1966749895747,10.1305789865988,0.259199978263454
48.1966749895747,10.1377735097702,0.259199978263454
48.1966749895747,10.1449680329416,0.259199978263454
48.1966749895747,10.1521625561129,0.259199978263454
48.1966749895747,10.1593570792843,0.259199978263454
48.1966749895747,10.1665516024557,0.279489684190684
48.1966749895747,10.1737461256271,0.242791642927691
48.1966749895747,10.1809406487984,0.272413553352218
48.1966749895747,10.1881351719698,0.23584051697405
48.1966749895747,10.1953296951412,0.251197124872122
48.1966749895747,10.2025242183126,0.259199978263454
48.1966749895747,10.2097187414839,0.272844940733102
48.1966749895747,10.2169132646553,0.286186645629424
48.1966749895747,10.2241077878267,0.259199978263454
48.1966749895747,10.231302310998,0.259199978263454
48.1966749895747,10.2384968341694,0.259199978263454
48.1966749895747,10.2456913573408,0.259199978263454
48.2012406771967,10.0874118475706,0.259199978263454
48.2012406771967,10.094606370742,0.259199978263454
48.2012406771967,10.1018008939133,0.259199978263454
48.2012406771967,10.1089954170847,0.210091099860772
48.2012406771967,10.1161899402561,0.311742740979146
48.2012406771967,10.1233844634275,0.259577082305267
48.2012406771967,10.1305789865988,0.259199978263454
48.2012406771967,10.1377735097702,0.259199978263454
48.2012406771967,10.1449680329416,0.259199978263454
48.2012406771967,10.1521625561129,0.249216658428163
48.2012406771967,10.1593570792843,0.240395128099521
48.2012406771967,10.1665516024557,0.259199978263454
48.2012406771967,10.1737461256271,0.260118863853801
48.2012406771967,10.1809406487984,0.259199978263454
48.2012406771967,10.1881351719698,0.259199978263454
48.2012406771967,10.1953296951412,0.259199978263454
48.2012406771967,10.2025242183126,0.259199978263454
48.2012406771967,10.2097187414839,0.26288218344185
48.2012406771967,10.2169132646553,0.273132114702828
48.2012406771967,10.2241077878267,0.259199978263454
48.2012406771967,10.231302310998,0.259199978263454
48.2012406771967,10.2384968341694,0.259199978263454
48.2012406771967,10.2456913573408,0.259199978263454
48.2012406771967,10.2528858805122,0.259199978263454
48.2058063648188,10.0874118475706,0.260518296188592
48.2058063648188,10.094606370742,0.260583704352664
48.2058063648188,10.1018008939133,0.261626230982534
48.2058063648188,10.1089954170847,0.253907246194242
48.2058063648188,10.1161899402561,0.262127665056996
48.2058063648188,10.1233844634275,0.260335476746022
48.2058063648188,10.1305789865988,0.259199978263454
48.2058063648188,10.1377735097702,0.259199978263454
48.2058063648188,10.1449680329416,0.259199978263454
48.2058063648188,10.1521625561129,0.259199978263454
48.2058063648188,10.1593570792843,0.255195673937611
48.2058063648188,10.1665516024557,0.259199978263454
48.2058063648188,10.1737461256271,0.259199978263454
48.2058063648188,10.1809406487984,0.259199978263454
48.2058063648188,10.1881351719698,0.259199978263454
48.2058063648188,10.1953296951412,0.259199978263454
48.2058063648188,10.2025242183126,0.259199978263454
48.2058063648188,10.2097187414839,0.259199978263454
48.2058063648188,10.2169132646553,0.259199978263454
48.2058063648188,10.2241077878267,0.259199978263454
48.2058063648188,10.231302310998,0.259199978263454
48.2058063648188,10.2384968341694,0.259199978263454
48.2058063648188,10.2456913573408,0.259199978263454
48.2058063648188,10.2528858805122,0.259199978263454
48.2103720524408,10.0802173243992,0.232623776560421
48.2103720524408,10.0874118475706,0.294349634343816
48.2103720524408,10.094606370742,0.265746884615506
48.2103720524408,10.1018008939133,0.259199978263454
48.2103720524408,10.1089954170847,0.259199978263454
48.2103720524408,10.1161899402561,0.259199978263454
48.2103720524408,10.1233844634275,0.259199978263454
48.2103720524408,10.1305789865988,0.259199978263454
48.2103720524408,10.1377735097702,0.259199978263454
48.2103720524408,10.1449680329416,0.259199978263454
48.2103720524408,10.1521625561129,0.259199978263454
48.2103720524408,10.1593570792843,0.259199978263454
48.2103720524408,10.1665516024557,0.259199978263454
48.2103720524408,10.1737461256271,0.259199978263454
48.2103720524408,10.1809406487984,0.259199978263454
48.2103720524408,10.1881351719698,0.259199978263454
48.2103720524408,10.1953296951412,0.259199978263454
48.2103720524408,10.2025242183126,0.259199978263454
48.2103720524408,10.2097187414839,0.259199978263454
48.2103720524408,10.2169132646553,0.259199978263454
48.2103720524408,10.2241077878267,0.259199978263454
48.2103720524408,10.231302310998,0.259199978263454
48.2103720524408,10.2384968341694,0.259199978263454
48.2103720524408,10.2456913573408,0.259199978263454
48.2103720524408,10.2528858805122,0.259199978263454
48.2149377400629,10.0802173243992,0.266202870803145
48.2149377400629,10.0874118475706,0.289950461269023
48.2149377400629,10.094606370742,0.339017004313853
48.2149377400629,10.1018008939133,0.237158717055209
48.2149377400629,10.1089954170847,0.337653713792741
48.2149377400629,10.1161899402561,0.284268727862357
48.2149377400629,10.1233844634275,0.264664597262874
48.2149377400629,10.1305789865988,0.261787910252456
48.2149377400629,10.1377735097702,0.259199978263454
48.2149377400629,10.1449680329416,0.259199978263454
48.2149377400629,10.1521625561129,0.259199978263454
48.2149377400629,10.1593570792843,0.259199978263454
48.2149377400629,10.1665516024557,0.259199978263454
48.2149377400629,10.1737461256271,0.262637155165506
48.2149377400629,10.1809406487984,0.260571175344533
48.2149377400629,10.1881351719698,0.259199978263454
48.2149377400629,10.1953296951412,0.259199978263454
48.2149377400629,10.2025242183126,0.259199978263454
48.2149377400629,10.2097187414839,0.262227361387957
48.2149377400629,10.2169132646553,0.259199978263454
48.2149377400629,10.2241077878267,0.259199978263454
48.2149377400629,10.231302310998,0.259199978263454
48.2149377400629,10.2384968341694,0.259199978263454
48.2149377400629,10.2456913573408,0.259199978263454
48.2149377400629,10.2528858805122,0.259199978263454
48.2195034276849,10.0802173243992,0.25878643055503
48.2195034276849,10.0874118475706,0.218033517128639
48.2195034276849,10.094606370742,0.351128374958887
48.2195034276849,10.1018008939133,0.476932435338444
48.2195034276849,10.1089954170847,0.491623822498596
48.2195034276849,10.1161899402561,0.275711671142727
48.2195034276849,10.1233844634275,0.276672800862929
48.2195034276849,10.1305789865988,0.24402878409237
48.2195034276849,10.1377735097702,0.259199978263454
48.2195034276849,10.1449680329416,0.259199978263454
48.2195034276849,10.1521625561129,0.259199978263454
48.2195034276849,10.1593570792843,0.259199978263454
48.2195034276849,10.1665516024557,0.259199978263454
48.2195034276849,10.1737461256271,0.259910714069358
48.2195034276849,10.1809406487984,0.266127701052264
48.2195034276849,10.1881351719698,0.259199978263454
48.2195034276849,10.1953296951412,0.259199978263454
48.2195034276849,10.2025242183126,0.259199978263454
48.2195034276849,10.2097187414839,0.262373345778189
48.2195034276849,10.2169132646553,0.259199978263454
48.2195034276849,10.2241077878267,0.259199978263454
48.2195034276849,10.231302310998,0.259199978263454
48.2195034276849,10.2384968341694,0.26366863780887
48.2195034276849,10.2456913573408,0.262874231472999
48.2195034276849,10.2528858805122,0.259199978263454
48.2240691153069,10.0730228012278,0.259199978263454
48.2240691153069,10.0802173243992,0.259199978263454
48.2240691153069,10.0874118475706,0.259199978263454
48.2240691153069,10.094606370742,0.34281571276041
48.2240691153069,10.1018008939133,0.474753677841081
48.2240691153069,10.1089954170847,0.540521315099816
48.2240691153069,10.1161899402561,0.365972317937999
48.2240691153069,10.1233844634275,0.26145359807942
48.2240691153069,10.1305789865988,0.258394232398921
48.2240691153069,10.1377735097702,0.259199978263454
48.2240691153069,10.1449680329416,0.259199978263454
48.2240691153069,10.1521625561129,0.259199978263454
48.2240691153069,10.1593570792843,0.259199978263454
48.2240691153069,10.1665516024557,0.259199978263454
48.2240691153069,10.1737461256271,0.283544370104459
48.2240691153069,10.1809406487984,0.273854267817835
48.2240691153069,10.1881351719698,0.259199978263454
48.2240691153069,10.1953296951412,0.259199978263454
48.2240691153069,10.2025242183126,0.259199978263454
48.2240691153069,10.2097187414839,0.259199978263454
48.2240691153069,10.2169132646553,0.259199978263454
48.2240691153069,10.2241077878267,0.259199978263454
48.2240691153069,10.231302310998,0.259199978263454
48.2240691153069,10.2384968341694,0.283654192732765
48.2240691153069,10.2456913573408,0.282416959232121
48.2240691153069,10.2528858805122,0.259199978263454
48.2240691153069,10.2600804036835,0.259199978263454
48.2240691153069,10.2672749268549,0.259199978263454
48.228634802929,10.0730228012278,0.259199978263454
48.228634802929,10.0802173243992,0.259199978263454
48.228634802929,10.0874118475706,0.258027603180601
48.228634802929,10.094606370742,0.247151847947806
48.228634802929,10.1018008939133,0.214310688171078
48.228634802929,10.1089954170847,0.320857507313255
48.228634802929,10.1161899402561,0.276639095293045
48.228634802929,10.1233844634275,0.254565202972935
48.228634802929,10.1305789865988,0.259199978263454
48.228634802929,10.1377735097702,0.259199978263454
48.228634802929,10.1449680329416,0.259199978263454
48.228634802929,10.1521625561129,0.259199978263454
48.228634802929,10.1593570792843,0.259199978263454
48.228634802929,10.1665516024557,0.259199978263454
48.228634802929,10.1737461256271,0.289859684699692
48.228634802929,10.1809406487984,0.379818578785591
48.228634802929,10.1881351719698,0.247781673233168
48.228634802929,10.1953296951412,0.259199978263454
48.228634802929,10.2025242183126,0.259199978263454
48.228634802929,10.2097187414839,0.259199978263454
48.228634802929,10.2169132646553,0.259199978263454
48.228634802929,10.2241077878267,0.263463850059002
48.228634802929,10.231302310998,0.259484314980363
48.228634802929,10.2384968341694,0.259199978263454
48.228634802929,10.2456913573408,0.259199978263454
48.228634802929,10.2528858805122,0.259199978263454
48.228634802929,10.2600804036835,0.259199978263454
48.228634802929,10.2672749268549,0.259199978263454
48.233200490551,10.0730228012278,0.259199978263454
48.233200490551,10.0802173243992,0.259199978263454
48.233200490551,10.0874118475706,0.259199978263454
48.233200490551,10.094606370742,0.260688827457381
48.233200490551,10.1018008939133,0.337850729425338
48.233200490551,10.1089954170847,0.345818835136671
48.233200490551,10.1161899402561,0.262702796384713
48.233200490551,10.1233844634275,0.259199978263454
48.233200490551,10.1305789865988,0.259199978263454
48.233200490551,10.1377735097702,0.267534379685366
48.233200490551,10.1449680329416,0.259199978263454
48.233200490551,10.1521625561129,0.259199978263454
48.233200490551,10.1593570792843,0.259199978263454
48.233200490551,10.1665516024557,0.266365077898253
48.233200490551,10.1737461256271,0.359321512588353
48.233200490551,10.1809406487984,0.325118314078006
48.233200490551,10.1881351719698,0.237631942783157
48.233200490551,10.1953296951412,0.259199978263454
48.233200490551,10.2025242183126,0.259199978263454
48.233200490551,10.2097187414839,0.259199978263454
48.233200490551,10.2169132646553,0.259199978263454
48.233200490551,10.2241077878267,0.260797337887397
48.233200490551,10.231302310998,0.259199978263454
48.233200490551,10.2384968341694,0.259199978263454
48.233200490551,10.2456913573408,0.259199978263454
48.233200490551,10.2528858805122,0.259199978263454
48.233200490551,10.2600804036835,0.259199978263454
48.233200490551,10.2672749268549,0.259199978263454
48.2377661781731,10.0658282780565,0.254392108635429
48.2377661781731,10.0730228012278,0.238593462951351
48.2377661781731,10.0802173243992,0.301852697628001
48.2377661781731,10.0874118475706,0.259199978263454
48.2377661781731,10.094606370742,0.266766605066001
48.2377661781731,10.1018008939133,0.33283563477614
48.2377661781731,10.1089954170847,0.352310175016074
48.2377661781731,10.1161899402561,0.259199978263454
48.2377661781731,10.1233844634275,0.259199978263454
48.2377661781731,10.1305789865988,0.341978912105834
48.2377661781731,10.1377735097702,0.299862062774846
48.2377661781731,10.1449680329416,0.259199978263454
48.2377661781731,10.1521625561129,0.259199978263454
48.2377661781731,10.1593570792843,0.259199978263454
48.2377661781731,10.1665516024557,0.260783275436224
48.2377661781731,10.1737461256271,0.324987881054702
48.2377661781731,10.1809406487984,0.316616807933677
48.2377661781731,10.1881351719698,0.259199978263454
48.2377661781731,10.1953296951412,0.261155349909643
48.2377661781731,10.2025242183126,0.262366153948001
48.2377661781731,10.2097187414839,0.259199978263454
48.2377661781731,10.2169132646553,0.247808106678297
48.2377661781731,10.2241077878267,0.259199978263454
48.2377661781731,10.231302310998,0.259199978263454
48.2377661781731,10.2384968341694,0.259199978263454
48.2377661781731,10.2456913573408,0.259199978263454
48.2377661781731,10.2528858805122,0.259199978263454
48.2377661781731,10.2600804036835,0.259199978263454
48.2377661781731,10.2672749268549,0.259199978263454
48.2423318657951,10.0658282780565,0.238464974364816
48.2423318657951,10.0730228012278,0.245011613010941
48.2423318657951,10.0802173243992,0.279778961491873
48.2423318657951,10.0874118475706,0.259199978263454
48.2423318657951,10.094606370742,0.283161894723149
48.2423318657951,10.1018008939133,0.268835927751705
48.2423318657951,10.1089954170847,0.31109878980709
48.2423318657951,10.1161899402561,0.265419487359164
48.2423318657951,10.1233844634275,0.259199978263454
48.2423318657951,10.1305789865988,0.422961085462948
48.2423318657951,10.1377735097702,0.376677210478045
48.2423318657951,10.1449680329416,0.281625309954694
48.2423318657951,10.1521625561129,0.259199978263454
48.2423318657951,10.1593570792843,0.259199978263454
48.2423318657951,10.1665516024557,0.259199978263454
48.2423318657951,10.1737461256271,0.262204470883978
48.2423318657951,10.1809406487984,0.275509632224861
48.2423318657951,10.1881351719698,0.259199978263454
48.2423318657951,10.1953296951412,0.259254844660335
48.2423318657951,10.2025242183126,0.260028081193193
48.2423318657951,10.2097187414839,0.259199978263454
48.2423318657951,10.2169132646553,0.214842699029164
48.2423318657951,10.2241077878267,0.259199978263454
48.2423318657951,10.231302310998,0.260068228932196
48.2423318657951,10.2384968341694,0.259199978263454
48.2423318657951,10.2456913573408,0.259199978263454
48.2423318657951,10.2528858805122,0.259199978263454
48.2423318657951,10.2600804036835,0.259199978263454
48.2423318657951,10.2672749268549,0.259199978263454
48.2423318657951,10.2744694500263,0.259199978263454
48.2423318657951,10.2816639731977,0.259199978263454
48.2468975534171,10.0658282780565,0.259199978263454
48.2468975534171,10.0730228012278,0.259199978263454
48.2468975534171,10.0802173243992,0.310507540022016
48.2468975534171,10.0874118475706,0.328247890852523
48.2468975534171,10.094606370742,0.281573648662227
48.2468975534171,10.1018008939133,0.26787420341378
48.2468975534171,10.1089954170847,0.262261449586294
48.2468975534171,10.1161899402561,0.297565592511806
48.2468975534171,10.1233844634275,0.300156677280132
48.2468975534171,10.1305789865988,0.259199978263454
48.2468975534171,10.1377735097702,0.259199978263454
48.2468975534171,10.1449680329416,0.259199978263454
48.2468975534171,10.1521625561129,0.259199978263454
48.2468975534171,10.1593570792843,0.259199978263454
48.2468975534171,10.1665516024557,0.259199978263454
48.2468975534171,10.1737461256271,0.268809180800745
48.2468975534171,10.1809406487984,0.278293113313541
48.2468975534171,10.1881351719698,0.259199978263454
48.2468975534171,10.1953296951412,0.259199978263454
48.2468975534171,10.2025242183126,0.259199978263454
48.2468975534171,10.2097187414839,0.259199978263454
48.2468975534171,10.2169132646553,0.259199978263454
48.2468975534171,10.2241077878267,0.264162480977017
48.2468975534171,10.231302310998,0.247370532637705
48.2468975534171,10.2384968341694,0.260221511583625
48.2468975534171,10.2456913573408,0.259199978263454
48.2468975534171,10.2528858805122,0.259199978263454
48.2468975534171,10.2600804036835,0.259199978263454
48.2468975534171,10.2672749268549,0.259199978263454
48.2468975534171,10.2744694500263,0.259199978263454
48.2468975534171,10.2816639731977,0.259199978263454
48.2514632410392,10.0730228012278,0.259199978263454
48.2514632410392,10.0802173243992,0.2996293367028
48.2514632410392,10.0874118475706,0.369438871522169
48.2514632410392,10.094606370742,0.460818240166641
48.2514632410392,10.1018008939133,0.302027902089903
48.2514632410392,10.1089954170847,0.259199978263454
48.2514632410392,10.1161899402561,0.275642603805526
48.2514632410392,10.1233844634275,0.264251053089185
48.2514632410392,10.1305789865988,0.259199978263454
48.2514632410392,10.1377735097702,0.259199978263454
48.2514632410392,10.1449680329416,0.259199978263454
48.2514632410392,10.1521625561129,0.259199978263454
48.2514632410392,10.1593570792843,0.259199978263454
48.2514632410392,10.1665516024557,0.259199978263454
48.2514632410392,10.1737461256271,0.259199978263454
48.2514632410392,10.1809406487984,0.257592656288877
48.2514632410392,10.1881351719698,0.259199978263454
48.2514632410392,10.1953296951412,0.259199978263454
48.2514632410392,10.2025242183126,0.259199978263454
48.2514632410392,10.2097187414839,0.259199978263454
48.2514632410392,10.2169132646553,0.259199978263454
48.2514632410392,10.2241077878267,0.259199978263454
48.2514632410392,10.231302310998,0.259397162349517
48.2514632410392,10.2384968341694,0.259199978263454
48.2514632410392,10.2456913573408,0.259199978263454
48.2514632410392,10.2528858805122,0.259199978263454
48.2514632410392,10.2600804036835,0.259199978263454
48.2514632410392,10.2672749268549,0.259199978263454
48.2514632410392,10.2744694500263,0.259199978263454
48.2514632410392,10.2816639731977,0.259199978263454
48.2560289286612,10.0658282780565,0.259199978263454
48.2560289286612,10.0730228012278,0.260115692834339
48.2560289286612,10.0802173243992,0.356854416165147
48.2560289286612,10.0874118475706,0.506022536334146
48.2560289286612,10.094606370742,0.654197882038573
48.2560289286612,10.1018008939133,0.298064048980676
48.2560289286612,10.1089954170847,0.259199978263454
48.2560289286612,10.1161899402561,0.259331586572422
48.2560289286612,10.1233844634275,0.259199978263454
48.2560289286612,10.1305789865988,0.259199978263454
48.2560289286612,10.1377735097702,0.259199978263454
48.2560289286612,10.1449680329416,0.259199978263454
48.2560289286612,10.1521625561129,0.259199978263454
48.2560289286612,10.1593570792843,0.259199978263454
48.2560289286612,10.1665516024557,0.259199978263454
48.2560289286612,10.1737461256271,0.26379844164768
48.2560289286612,10.1809406487984,0.259199978263454
48.2560289286612,10.1881351719698,0.259199978263454
48.2560289286612,10.1953296951412,0.259199978263454
48.2560289286612,10.2025242183126,0.259199978263454
48.2560289286612,10.2097187414839,0.259199978263454
48.2560289286612,10.2169132646553,0.259199978263454
48.2560289286612,10.2241077878267,0.259199978263454
48.2560289286612,10.231302310998,0.259199978263454
48.2560289286612,10.2384968341694,0.259199978263454
48.2560289286612,10.2456913573408,0.259199978263454
48.2560289286612,10.2528858805122,0.259199978263454
48.2560289286612,10.2600804036835,0.259199978263454
48.2560289286612,10.2672749268549,0.259199978263454
48.2560289286612,10.2744694500263,0.259199978263454
48.2560289286612,10.2816639731977,0.259199978263454
48.2605946162833,10.0658282780565,0.259199978263454
48.2605946162833,10.0730228012278,0.255763148267257
48.2605946162833,10.0802173243992,0.290730394739506
48.2605946162833,10.0874118475706,0.365630293023008
48.2605946162833,10.094606370742,0.386406336061321
48.2605946162833,10.1018008939133,0.232331430167325
48.2605946162833,10.1089954170847,0.259199978263454
48.2605946162833,10.1161899402561,0.259199978263454
48.2605946162833,10.1233844634275,0.259199978263454
48.2605946162833,10.1305789865988,0.259199978263454
48.2605946162833,10.1377735097702,0.259199978263454
48.2605946162833,10.1449680329416,0.259199978263454
48.2605946162833,10.1521625561129,0.259199978263454
48.2605946162833,10.1593570792843,0.259199978263454
48.2605946162833,10.1665516024557,0.259199978263454
48.2605946162833,10.1737461256271,0.260658158407688
48.2605946162833,10.1809406487984,0.259199978263454
48.2605946162833,10.1881351719698,0.259199978263454
48.2605946162833,10.1953296951412,0.259199978263454
48.2605946162833,10.2025242183126,0.259199978263454
48.2605946162833,10.2097187414839,0.259199978263454
48.2605946162833,10.2169132646553,0.240810550811689
48.2605946162833,10.2241077878267,0.253134883306427
48.2605946162833,10.231302310998,0.259199978263454
48.2605946162833,10.2384968341694,0.259199978263454
48.2605946162833,10.2456913573408,0.259199978263454
48.2605946162833,10.2528858805122,0.259199978263454
48.2605946162833,10.2600804036835,0.259199978263454
48.2605946162833,10.2672749268549,0.259199978263454
48.2605946162833,10.2744694500263,0.259199978263454
48.2605946162833,10.2816639731977,0.259199978263454
48.2651603039053,10.0658282780565,0.259199978263454
48.2651603039053,10.0730228012278,0.298701594631127
48.2651603039053,10.0802173243992,0.260162576174408
48.2651603039053,10.0874118475706,0.284399044644947
48.2651603039053,10.094606370742,0.315521286745346
48.2651603039053,10.1018008939133,0.256378355770369
48.2651603039053,10.1089954170847,0.259199978263454
48.2651603039053,10.1161899402561,0.259199978263454
48.2651603039053,10.1233844634275,0.259199978263454
48.2651603039053,10.1305789865988,0.259199978263454
48.2651603039053,10.1377735097702,0.259199978263454
48.2651603039053,10.1449680329416,0.259199978263454
48.2651603039053,10.1521625561129,0.259199978263454
48.2651603039053,10.1593570792843,0.259199978263454
48.2651603039053,10.1665516024557,0.259199978263454
48.2651603039053,10.1737461256271,0.259199978263454
48.2651603039053,10.1809406487984,0.259199978263454
48.2651603039053,10.1881351719698,0.259199978263454
48.2651603039053,10.1953296951412,0.259199978263454
48.2651603039053,10.2025242183126,0.259199978263454
48.2651603039053,10.2097187414839,0.261215219088901
48.2651603039053,10.2169132646553,0.247240595386212
48.2651603039053,10.2241077878267,0.263378665261858
48.2651603039053,10.231302310998,0.259199978263454
48.2651603039053,10.2384968341694,0.259199978263454
48.2651603039053,10.2456913573408,0.260272945953264
48.2651603039053,10.2528858805122,0.260473640491807
48.2651603039053,10.2600804036835,0.259199978263454
48.2651603039053,10.2672749268549,0.259199978263454
48.2651603039053,10.2744694500263,0.259199978263454
48.2651603039053,10.2816639731977,0.259199978263454
48.2697259915273,10.0658282780565,0.277957826573444
48.2697259915273,10.0730228012278,0.26546570602448
48.2697259915273,10.0802173243992,0.330811352151935
48.2697259915273,10.0874118475706,0.27149665516045
48.2697259915273,10.094606370742,0.259199978263454
48.2697259915273,10.1018008939133,0.27832484955681
48.2697259915273,10.1089954170847,0.288018297543914
48.2697259915273,10.1161899402561,0.259199978263454
48.2697259915273,10.1233844634275,0.259835062073181
48.2697259915273,10.1305789865988,0.259199978263454
48.2697259915273,10.1377735097702,0.259199978263454
48.2697259915273,10.1449680329416,0.259199978263454
48.2697259915273,10.1521625561129,0.259199978263454
48.2697259915273,10.1593570792843,0.259199978263454
48.2697259915273,10.1665516024557,0.259199978263454
48.2697259915273,10.1737461256271,0.259199978263454
48.2697259915273,10.1809406487984,0.259199978263454
48.2697259915273,10.1881351719698,0.259199978263454
48.2697259915273,10.1953296951412,0.259199978263454
48.2697259915273,10.2025242183126,0.259199978263454
48.2697259915273,10.2097187414839,0.261037444566906
48.2697259915273,10.2169132646553,0.260511878436346
48.2697259915273,10.2241077878267,0.261648406539598
48.2697259915273,10.231302310998,0.259309777362869
48.2697259915273,10.2384968341694,0.298524302534073
48.2697259915273,10.2456913573408,0.319374704405015
48.2697259915273,10.2528858805122,0.277110287628097
48.2697259915273,10.2600804036835,0.259199978263454
48.2697259915273,10.2672749268549,0.259199978263454
48.2697259915273,10.2744694500263,0.259199978263454
48.2697259915273,10.2816639731977,0.259199978263454
48.2742916791494,10.0658282780565,0.369869037298483
48.2742916791494,10.0730228012278,0.364411234661881
48.2742916791494,10.0802173243992,0.645530002933882
48.2742916791494,10.0874118475706,0.338030651405999
48.2742916791494,10.094606370742,0.259199978263454
48.2742916791494,10.1018008939133,0.259199978263454
48.2742916791494,10.1089954170847,0.259199978263454
48.2742916791494,10.1161899402561,0.259199978263454
48.2742916791494,10.1233844634275,0.264308574027477
48.2742916791494,10.1305789865988,0.259625616293159
48.2742916791494,10.1377735097702,0.259199978263454
48.2742916791494,10.1449680329416,0.259199978263454
48.2742916791494,10.1521625561129,0.259199978263454
48.2742916791494,10.1593570792843,0.234724058342401
48.2742916791494,10.1665516024557,0.253097799608628
48.2742916791494,10.1737461256271,0.259199978263454
48.2742916791494,10.1809406487984,0.259199978263454
48.2742916791494,10.1881351719698,0.259199978263454
48.2742916791494,10.1953296951412,0.259199978263454
48.2742916791494,10.2025242183126,0.259199978263454
48.2742916791494,10.2097187414839,0.259199978263454
48.2742916791494,10.2169132646553,0.259199978263454
48.2742916791494,10.2241077878267,0.383664298940481
48.2742916791494,10.231302310998,0.435320290437566
48.2742916791494,10.2384968341694,0.266716013813313
48.2742916791494,10.2456913573408,0.264212141696649
48.2742916791494,10.2528858805122,0.259199978263454
48.2742916791494,10.2600804036835,0.259199978263454
48.2742916791494,10.2672749268549,0.259199978263454
48.2742916791494,10.2744694500263,0.259199978263454
48.2742916791494,10.2816639731977,0.259199978263454
48.2788573667714,10.0730228012278,0.485877400467227
48.2788573667714,10.0802173243992,0.627850947653109
48.2788573667714,10.0874118475706,0.330539933206514
48.2788573667714,10.094606370742,0.259199978263454
48.2788573667714,10.1018008939133,0.259199978263454
48.2788573667714,10.1089954170847,0.259199978263454
48.2788573667714,10.1161899402561,0.259199978263454
48.2788573667714,10.1233844634275,0.259199978263454
48.2788573667714,10.1305789865988,0.259199978263454
48.2788573667714,10.1377735097702,0.259199978263454
48.2788573667714,10.1449680329416,0.259199978263454
48.2788573667714,10.1521625561129,0.259199978263454
48.2788573667714,10.1593570792843,0.256808189344242
48.2788573667714,10.1665516024557,0.309288183159837
48.2788573667714,10.1737461256271,0.238916409954462
48.2788573667714,10.1809406487984,0.259199978263454
48.2788573667714,10.1881351719698,0.259199978263454
48.2788573667714,10.1953296951412,0.259199978263454
48.2788573667714,10.2025242183126,0.259199978263454
48.2788573667714,10.2097187414839,0.259199978263454
48.2788573667714,10.2169132646553,0.363888616214218
48.2788573667714,10.2241077878267,0.252472673836653
48.2788573667714,10.231302310998,0.33141302031367
48.2788573667714,10.2384968341694,0.259199978263454
48.2788573667714,10.2456913573408,0.259199978263454
48.2788573667714,10.2528858805122,0.259199978263454
48.2788573667714,10.2600804036835,0.259199978263454
48.2788573667714,10.2672749268549,0.259199978263454
48.2788573667714,10.2744694500263,0.259199978263454
48.2788573667714,10.2816639731977,0.259199978263454
48.2834230543935,10.0658282780565,0.276226936258047
48.2834230543935,10.0730228012278,0.462681975372798
48.2834230543935,10.0802173243992,0.331429008448362
48.2834230543935,10.0874118475706,0.281336472661741
48.2834230543935,10.094606370742,0.255243672266161
48.2834230543935,10.1018008939133,0.259199978263454
48.2834230543935,10.1089954170847,0.259199978263454
48.2834230543935,10.1161899402561,0.30093307523094
48.2834230543935,10.1233844634275,0.259485222301023
48.2834230543935,10.1305789865988,0.259199978263454
48.2834230543935,10.1377735097702,0.259199978263454
48.2834230543935,10.1449680329416,0.259199978263454
48.2834230543935,10.1521625561129,0.259199978263454
48.2834230543935,10.1593570792843,0.259199978263454
48.2834230543935,10.1665516024557,0.26050714130934
48.2834230543935,10.1737461256271,0.259199978263454
48.2834230543935,10.1809406487984,0.259199978263454
48.2834230543935,10.1881351719698,0.259199978263454
48.2834230543935,10.1953296951412,0.259199978263454
48.2834230543935,10.2025242183126,0.259199978263454
48.2834230543935,10.2097187414839,0.273408750967114
48.2834230543935,10.2169132646553,0.376253902316443
48.2834230543935,10.2241077878267,0.248356768506025
48.2834230543935,10.231302310998,0.257632415456495
48.2834230543935,10.2384968341694,0.263070848854836
48.2834230543935,10.2456913573408,0.259199978263454
48.2834230543935,10.2528858805122,0.259199978263454
48.2834230543935,10.2600804036835,0.259199978263454
48.2834230543935,10.2672749268549,0.259199978263454
48.2834230543935,10.2744694500263,0.259199978263454
48.2834230543935,10.2816639731977,0.259199978263454
48.2879887420155,10.0586337548851,0.259199978263454
48.2879887420155,10.0658282780565,0.259199978263454
48.2879887420155,10.0730228012278,0.295174273252321
48.2879887420155,10.0802173243992,0.26597757065935
48.2879887420155,10.0874118475706,0.259199978263454
48.2879887420155,10.094606370742,0.251568821596228
48.2879887420155,10.1018008939133,0.287745576050766
48.2879887420155,10.1089954170847,0.273972869042828
48.2879887420155,10.1161899402561,0.248260200679373
48.2879887420155,10.1233844634275,0.259199978263454
48.2879887420155,10.1305789865988,0.259199978263454
48.2879887420155,10.1377735097702,0.257761515399717
48.2879887420155,10.1449680329416,0.259199978263454
48.2879887420155,10.1521625561129,0.259199978263454
48.2879887420155,10.1593570792843,0.259199978263454
48.2879887420155,10.1665516024557,0.259199978263454
48.2879887420155,10.1737461256271,0.259199978263454
48.2879887420155,10.1809406487984,0.259199978263454
48.2879887420155,10.1881351719698,0.259199978263454
48.2879887420155,10.1953296951412,0.263057125336594
48.2879887420155,10.2025242183126,0.262781866468046
48.2879887420155,10.2097187414839,0.243838152958914
48.2879887420155,10.2169132646553,0.21662755031672
48.2879887420155,10.2241077878267,0.284664730211066
48.2879887420155,10.231302310998,0.259199978263454
48.2879887420155,10.2384968341694,0.260469419039976
48.2879887420155,10.2456913573408,0.259199978263454
48.2879887420155,10.2528858805122,0.259199978263454
48.2879887420155,10.2600804036835,0.259199978263454
48.2879887420155,10.2672749268549,0.259199978263454
48.2879887420155,10.2744694500263,0.259199978263454
48.2879887420155,10.2816639731977,0.259199978263454
48.2925544296375,10.0514392317137,0.257402661496333
48.2925544296375,10.0586337548851,0.259199978263454
48.2925544296375,10.0658282780565,0.340562596089331
48.2925544296375,10.0730228012278,0.343294356250539
48.2925544296375,10.0802173243992,0.263865614157808
48.2925544296375,10.0874118475706,0.259199978263454
48.2925544296375,10.094606370742,0.263967364876615
48.2925544296375,10.1018008939133,0.291904907070267
48.2925544296375,10.1089954170847,0.267514310815746
48.2925544296375,10.1161899402561,0.265948046614061
48.2925544296375,10.1233844634275,0.259199978263454
48.2925544296375,10.1305789865988,0.259199978263454
48.2925544296375,10.1377735097702,0.24144004616739
48.2925544296375,10.1449680329416,0.256116135475752
48.2925544296375,10.1521625561129,0.259199978263454
48.2925544296375,10.1593570792843,0.263737640043492
48.2925544296375,10.1665516024557,0.259199978263454
48.2925544296375,10.1737461256271,0.259199978263454
48.2925544296375,10.1809406487984,0.259199978263454
48.2925544296375,10.1881351719698,0.259199978263454
48.2925544296375,10.1953296951412,0.259199978263454
48.2925544296375,10.2025242183126,0.259199978263454
48.2925544296375,10.2097187414839,0.259199978263454
48.2925544296375,10.2169132646553,0.268915163690639
48.2925544296375,10.2241077878267,0.263525355140262
48.2925544296375,10.231302310998,0.259199978263454
48.2925544296375,10.2384968341694,0.285900024568776
48.2925544296375,10.2456913573408,0.26531919607768
48.2925544296375,10.2528858805122,0.259199978263454
48.2925544296375,10.2600804036835,0.259199978263454
48.2925544296375,10.2672749268549,0.259199978263454
48.2925544296375,10.2744694500263,0.259199978263454
48.2925544296375,10.2816639731977,0.259199978263454
48.2971201172596,10.0442447085424,0.259199978263454
48.2971201172596,10.0514392317137,0.269869187077994
48.2971201172596,10.0586337548851,0.273084469935151
48.2971201172596,10.0658282780565,0.345318908923696
48.2971201172596,10.0730228012278,0.274635509931836
48.2971201172596,10.0802173243992,0.259199978263454
48.2971201172596,10.0874118475706,0.259199978263454
48.2971201172596,10.094606370742,0.259199978263454
48.2971201172596,10.1018008939133,0.332307245702042
48.2971201172596,10.1089954170847,0.277544573300684
48.2971201172596,10.1161899402561,0.259199978263454
48.2971201172596,10.1233844634275,0.259199978263454
48.2971201172596,10.1305789865988,0.270339080012243
48.2971201172596,10.1377735097702,0.291000523575909
48.2971201172596,10.1449680329416,0.283768249707908
48.2971201172596,10.1521625561129,0.298708174472189
48.2971201172596,10.1593570792843,0.380639036582889
48.2971201172596,10.1665516024557,0.356001492794529
48.2971201172596,10.1737461256271,0.299614001341256
48.2971201172596,10.1809406487984,0.257952502276255
48.2971201172596,10.1881351719698,0.259199978263454
48.2971201172596,10.1953296951412,0.259199978263454
48.2971201172596,10.2025242183126,0.259199978263454
48.2971201172596,10.2097187414839,0.263173690603976
48.2971201172596,10.2169132646553,0.260960142056009
48.2971201172596,10.2241077878267,0.260485105861053
48.2971201172596,10.231302310998,0.259199978263454
48.2971201172596,10.2384968341694,0.280491931911542
48.2971201172596,10.2456913573408,0.261899988880277
48.2971201172596,10.2528858805122,0.259199978263454
48.2971201172596,10.2600804036835,0.259199978263454
48.2971201172596,10.2672749268549,0.259199978263454
48.2971201172596,10.2744694500263,0.259199978263454
48.2971201172596,10.2816639731977,0.259199978263454
48.3016858048816,10.0442447085424,0.259199978263454
48.3016858048816,10.0514392317137,0.327173663148257
48.3016858048816,10.0586337548851,0.264654409150835
48.3016858048816,10.0658282780565,0.283478918605849
48.3016858048816,10.0730228012278,0.259199978263454
48.3016858048816,10.0802173243992,0.323377251881627
48.3016858048816,10.0874118475706,0.277166351091187
48.3016858048816,10.094606370742,0.259199978263454
48.3016858048816,10.1018008939133,0.26990238422607
48.3016858048816,10.1089954170847,0.259199978263454
48.3016858048816,10.1161899402561,0.259199978263454
48.3016858048816,10.1233844634275,0.259199978263454
48.3016858048816,10.1305789865988,0.259199978263454
48.3016858048816,10.1377735097702,0.245114139659864
48.3016858048816,10.1449680329416,0.326928610990196
48.3016858048816,10.1521625561129,0.485088665726566
48.3016858048816,10.1593570792843,0.559579669618683
48.3016858048816,10.1665516024557,0.374507172811613
48.3016858048816,10.1737461256271,0.31686575310369
48.3016858048816,10.1809406487984,0.292298182417175
48.3016858048816,10.1881351719698,0.259199978263454
48.3016858048816,10.1953296951412,0.259199978263454
48.3016858048816,10.2025242183126,0.259199978263454
48.3016858048816,10.2097187414839,0.259395158927511
48.3016858048816,10.2169132646553,0.259199978263454
48.3016858048816,10.2241077878267,0.259199978263454
48.3016858048816,10.231302310998,0.259199978263454
48.3016858048816,10.2384968341694,0.259199978263454
48.3016858048816,10.2456913573408,0.259199978263454
48.3016858048816,10.2528858805122,0.259199978263454
48.3016858048816,10.2600804036835,0.259199978263454
48.3016858048816,10.2672749268549,0.259199978263454
48.3016858048816,10.2744694500263,0.259199978263454
48.3016858048816,10.2816639731977,0.259199978263454
48.3062514925037,10.037050185371,0.259199978263454
48.3062514925037,10.0442447085424,0.324896621092174
48.3062514925037,10.0514392317137,0.300796741286936
48.3062514925037,10.0586337548851,0.259199978263454
48.3062514925037,10.0658282780565,0.259199978263454
48.3062514925037,10.0730228012278,0.259199978263454
48.3062514925037,10.0802173243992,0.30772640050929
48.3062514925037,10.0874118475706,0.268213442732978
48.3062514925037,10.094606370742,0.259199978263454
48.3062514925037,10.1018008939133,0.259199978263454
48.3062514925037,10.1089954170847,0.259199978263454
48.3062514925037,10.1161899402561,0.259199978263454
48.3062514925037,10.1233844634275,0.259199978263454
48.3062514925037,10.1305789865988,0.26867117422116
48.3062514925037,10.1377735097702,0.229144583659813
48.3062514925037,10.1449680329416,0.246387603429182
48.3062514925037,10.1521625561129,0.463461664833127
48.3062514925037,10.1593570792843,0.680539739488335
48.3062514925037,10.1665516024557,0.319723844645004
48.3062514925037,10.1737461256271,0.300239740602722
48.3062514925037,10.1809406487984,0.258772118737391
48.3062514925037,10.1881351719698,0.259199978263454
48.3062514925037,10.1953296951412,0.260681935849152
48.3062514925037,10.2025242183126,0.262784437159122
48.3062514925037,10.2097187414839,0.243577122673439
48.3062514925037,10.2169132646553,0.259199978263454
48.3062514925037,10.2241077878267,0.26118392987411
48.3062514925037,10.231302310998,0.260342520819081
48.3062514925037,10.2384968341694,0.259199978263454
48.3062514925037,10.2456913573408,0.259199978263454
48.3062514925037,10.2528858805122,0.259199978263454
48.3062514925037,10.2600804036835,0.259199978263454
48.3062514925037,10.2672749268549,0.259199978263454
48.3062514925037,10.2744694500263,0.259199978263454
48.3108171801257,10.037050185371,0.259324365897195
48.3108171801257,10.0442447085424,0.30827670986526
48.3108171801257,10.0514392317137,0.262188829057495
48.3108171801257,10.0586337548851,0.262621854209821
48.3108171801257,10.0658282780565,0.259199978263454
48.3108171801257,10.0730228012278,0.259199978263454
48.3108171801257,10.0802173243992,0.309737566352195
48.3108171801257,10.0874118475706,0.326912131295233
48.3108171801257,10.094606370742,0.250703873736869
48.3108171801257,10.1018008939133,0.317307755491992
48.3108171801257,10.1089954170847,0.259199978263454
48.3108171801257,10.1161899402561,0.259199978263454
48.3108171801257,10.1233844634275,0.259199978263454
48.3108171801257,10.1305789865988,0.314335177901948
48.3108171801257,10.1377735097702,0.310707835961442
48.3108171801257,10.1449680329416,0.247239957464446
48.3108171801257,10.1521625561129,0.433706265401161
48.3108171801257,10.1593570792843,0.449525108818929
48.3108171801257,10.1665516024557,0.259199978263454
48.3108171801257,10.1737461256271,0.26045288137079
48.3108171801257,10.1809406487984,0.259199978263454
48.3108171801257,10.1881351719698,0.260337639612572
48.3108171801257,10.1953296951412,0.262731574125444
48.3108171801257,10.2025242183126,0.342106868350933
48.3108171801257,10.2097187414839,0.28073013274
48.3108171801257,10.2169132646553,0.284295120143002
48.3108171801257,10.2241077878267,0.261372113380976
48.3108171801257,10.231302310998,0.26049905626175
48.3108171801257,10.2384968341694,0.259199978263454
48.3108171801257,10.2456913573408,0.259199978263454
48.3108171801257,10.2528858805122,0.259199978263454
48.3108171801257,10.2600804036835,0.259199978263454
48.3108171801257,10.2672749268549,0.259199978263454
48.3108171801257,10.2744694500263,0.259199978263454
48.3153828677477,10.0298556621996,0.254554122282687
48.3153828677477,10.037050185371,0.312479856516192
48.3153828677477,10.0442447085424,0.253264615434704
48.3153828677477,10.0514392317137,0.275698359018748
48.3153828677477,10.0586337548851,0.25760583662283
48.3153828677477,10.0658282780565,0.266070038075452
48.3153828677477,10.0730228012278,0.294826762942581
48.3153828677477,10.0802173243992,0.272568911512272
48.3153828677477,10.0874118475706,0.340546582713279
48.3153828677477,10.094606370742,0.235369750464759
48.3153828677477,10.1018008939133,0.454757825258667
48.3153828677477,10.1089954170847,0.305107193155556
48.3153828677477,10.1161899402561,0.259199978263454
48.3153828677477,10.1233844634275,0.259199978263454
48.3153828677477,10.1305789865988,0.259199978263454
48.3153828677477,10.1377735097702,0.259199978263454
48.3153828677477,10.1449680329416,0.259199978263454
48.3153828677477,10.1521625561129,0.264540021945027
48.3153828677477,10.1593570792843,0.267144114102942
48.3153828677477,10.1665516024557,0.235216411651766
48.3153828677477,10.1737461256271,0.259199978263454
48.3153828677477,10.1809406487984,0.259199978263454
48.3153828677477,10.1881351719698,0.259199978263454
48.3153828677477,10.1953296951412,0.259199978263454
48.3153828677477,10.2025242183126,0.259199978263454
48.3153828677477,10.2097187414839,0.314829287182639
48.3153828677477,10.2169132646553,0.306765655206896
48.3153828677477,10.2241077878267,0.259041774001376
48.3153828677477,10.231302310998,0.259199978263454
48.3153828677477,10.2384968341694,0.259199978263454
48.3153828677477,10.2456913573408,0.259199978263454
48.3153828677477,10.2528858805122,0.259199978263454
48.3153828677477,10.2600804036835,0.259199978263454
48.3153828677477,10.2744694500263,0.259199978263454
48.3199485553698,10.0298556621996,0.259199978263454
48.3199485553698,10.037050185371,0.29487713745377
48.3199485553698,10.0442447085424,0.383192649349488
48.3199485553698,10.0514392317137,0.316147205582937
48.3199485553698,10.0586337548851,0.347199303586253
48.3199485553698,10.0658282780565,0.277615154838168
48.3199485553698,10.0730228012278,0.338095498231611
48.3199485553698,10.0802173243992,0.260508635287373
48.3199485553698,10.0874118475706,0.250274114254705
48.3199485553698,10.094606370742,0.254446257240772
48.3199485553698,10.1018008939133,0.296939344537652
48.3199485553698,10.1089954170847,0.259986202136064
48.3199485553698,10.1161899402561,0.259199978263454
48.3199485553698,10.1233844634275,0.259199978263454
48.3199485553698,10.1305789865988,0.259199978263454
48.3199485553698,10.1377735097702,0.259199978263454
48.3199485553698,10.1449680329416,0.259199978263454
48.3199485553698,10.1521625561129,0.260326799108289
48.3199485553698,10.1593570792843,0.259199978263454
48.3199485553698,10.1665516024557,0.257197340650381
48.3199485553698,10.1737461256271,0.259199978263454
48.3199485553698,10.1809406487984,0.259199978263454
48.3199485553698,10.1881351719698,0.259199978263454
48.3199485553698,10.1953296951412,0.259199978263454
48.3199485553698,10.2025242183126,0.259199978263454
48.3199485553698,10.2097187414839,0.259199978263454
48.3199485553698,10.2169132646553,0.253562210200019
48.3199485553698,10.2241077878267,0.259199978263454
48.3199485553698,10.231302310998,0.259199978263454
48.3199485553698,10.2384968341694,0.259199978263454
48.3199485553698,10.2456913573408,0.259199978263454
48.3199485553698,10.2528858805122,0.259199978263454
48.3199485553698,10.2600804036835,0.259199978263454
48.3245142429918,10.0226611390282,0.23781999668576
48.3245142429918,10.0298556621996,0.331991846114184
48.3245142429918,10.037050185371,0.391074506882861
48.3245142429918,10.0442447085424,0.591619336445077
48.3245142429918,10.0514392317137,0.525430254496218
48.3245142429918,10.0586337548851,0.447829996805005
48.3245142429918,10.0658282780565,0.276995326185975
48.3245142429918,10.0730228012278,0.249798591039594
48.3245142429918,10.0802173243992,0.259199978263454
48.3245142429918,10.0874118475706,0.268697911008998
48.3245142429918,10.094606370742,0.288297339816352
48.3245142429918,10.1018008939133,0.259199978263454
48.3245142429918,10.1089954170847,0.259199978263454
48.3245142429918,10.1161899402561,0.259199978263454
48.3245142429918,10.1233844634275,0.259199978263454
48.3245142429918,10.1305789865988,0.259199978263454
48.3245142429918,10.1377735097702,0.259199978263454
48.3245142429918,10.1449680329416,0.259199978263454
48.3245142429918,10.1521625561129,0.327803823899995
48.3245142429918,10.1593570792843,0.256949809139881
48.3245142429918,10.1665516024557,0.280861711157802
48.3245142429918,10.1737461256271,0.259199978263454
48.3245142429918,10.1809406487984,0.259199978263454
48.3245142429918,10.1881351719698,0.259199978263454
48.3245142429918,10.1953296951412,0.259199978263454
48.3245142429918,10.2025242183126,0.259199978263454
48.3245142429918,10.2097187414839,0.386518741229056
48.3245142429918,10.2169132646553,0.308956477626479
48.3245142429918,10.2241077878267,0.259199978263454
48.3245142429918,10.231302310998,0.259199978263454
48.3245142429918,10.2384968341694,0.259199978263454
48.3245142429918,10.2456913573408,0.259199978263454
48.3245142429918,10.2528858805122,0.259199978263454
48.3245142429918,10.2600804036835,0.259199978263454
48.3245142429918,10.2672749268549,0.259199978263454
48.3290799306139,10.0154666158569,0.259199978263454
48.3290799306139,10.0226611390282,0.246725259655957
48.3290799306139,10.0298556621996,0.30387259568312
48.3290799306139,10.037050185371,0.452830839147668
48.3290799306139,10.0442447085424,0.268185505366876
48.3290799306139,10.0514392317137,0.445356202648856
48.3290799306139,10.0586337548851,0.384232273237473
48.3290799306139,10.0658282780565,0.259199978263454
48.3290799306139,10.0730228012278,0.259199978263454
48.3290799306139,10.0802173243992,0.259199978263454
48.3290799306139,10.0874118475706,0.259199978263454
48.3290799306139,10.094606370742,0.216251355086325
48.3290799306139,10.1018008939133,0.25717320004157
48.3290799306139,10.1089954170847,0.259199978263454
48.3290799306139,10.1161899402561,0.259199978263454
48.3290799306139,10.1233844634275,0.259199978263454
48.3290799306139,10.1305789865988,0.259199978263454
48.3290799306139,10.1377735097702,0.259199978263454
48.3290799306139,10.1449680329416,0.259199978263454
48.3290799306139,10.1521625561129,0.308401976493456
48.3290799306139,10.1593570792843,0.276512657189603
48.3290799306139,10.1665516024557,0.26498936283268
48.3290799306139,10.1737461256271,0.259199978263454
48.3290799306139,10.1809406487984,0.259199978263454
48.3290799306139,10.1881351719698,0.241599224535182
48.3290799306139,10.1953296951412,0.258737352659298
48.3290799306139,10.2025242183126,0.259199978263454
48.3290799306139,10.2097187414839,0.283065645359986
48.3290799306139,10.2169132646553,0.259199978263454
48.3290799306139,10.2241077878267,0.259199978263454
48.3290799306139,10.231302310998,0.259199978263454
48.3290799306139,10.2384968341694,0.259199978263454
48.3290799306139,10.2456913573408,0.259199978263454
48.3290799306139,10.2528858805122,0.259199978263454
48.3290799306139,10.2600804036835,0.259199978263454
48.3290799306139,10.2672749268549,0.259199978263454
48.3336456182359,10.0154666158569,0.259199978263454
48.3336456182359,10.0226611390282,0.233949965105004
48.3336456182359,10.0298556621996,0.299375572497645
48.3336456182359,10.037050185371,0.699831410280593
48.3336456182359,10.0442447085424,0.405623954269977
48.3336456182359,10.0514392317137,0.248056521952453
48.3336456182359,10.0586337548851,0.283241559023414
48.3336456182359,10.0658282780565,0.328647845429622
48.3336456182359,10.0730228012278,0.263373864286585
48.3336456182359,10.0802173243992,0.259199978263454
48.3336456182359,10.0874118475706,0.259199978263454
48.3336456182359,10.094606370742,0.259199978263454
48.3336456182359,10.1018008939133,0.259199978263454
48.3336456182359,10.1089954170847,0.259199978263454
48.3336456182359,10.1161899402561,0.259199978263454
48.3336456182359,10.1233844634275,0.259199978263454
48.3336456182359,10.1305789865988,0.259199978263454
48.3336456182359,10.1377735097702,0.259199978263454
48.3336456182359,10.1449680329416,0.259199978263454
48.3336456182359,10.1521625561129,0.259199978263454
48.3336456182359,10.1593570792843,0.259199978263454
48.3336456182359,10.1665516024557,0.259199978263454
48.3336456182359,10.1737461256271,0.259199978263454
48.3336456182359,10.1809406487984,0.259199978263454
48.3336456182359,10.1881351719698,0.245263912976377
48.3336456182359,10.1953296951412,0.259199978263454
48.3336456182359,10.2025242183126,0.259199978263454
48.3336456182359,10.2097187414839,0.259474094325728
48.3336456182359,10.2169132646553,0.329448692313355
48.3336456182359,10.2241077878267,0.259199978263454
48.3336456182359,10.231302310998,0.259199978263454
48.3336456182359,10.2384968341694,0.259199978263454
48.3336456182359,10.2456913573408,0.259199978263454
48.3336456182359,10.2528858805122,0.259199978263454
48.3336456182359,10.2600804036835,0.259199978263454
48.3336456182359,10.2672749268549,0.259199978263454
48.3382113058579,10.0154666158569,0.257422293592223
48.3382113058579,10.0226611390282,0.258004135692011
48.3382113058579,10.0298556621996,0.259561144698875
48.3382113058579,10.037050185371,0.270184350853095
48.3382113058579,10.0442447085424,0.291452468281697
48.3382113058579,10.0514392317137,0.252224926706476
48.3382113058579,10.0586337548851,0.319041908916087
48.3382113058579,10.0658282780565,0.410875150999954
48.3382113058579,10.0730228012278,0.31416233459908
48.3382113058579,10.0802173243992,0.259199978263454
48.3382113058579,10.0874118475706,0.259199978263454
48.3382113058579,10.094606370742,0.300634676199927
48.3382113058579,10.1018008939133,0.300257879479963
48.3382113058579,10.1089954170847,0.259199978263454
48.3382113058579,10.1161899402561,0.259199978263454
48.3382113058579,10.1233844634275,0.259199978263454
48.3382113058579,10.1305789865988,0.259199978263454
48.3382113058579,10.1377735097702,0.264231862812793
48.3382113058579,10.1449680329416,0.259199978263454
48.3382113058579,10.1521625561129,0.259199978263454
48.3382113058579,10.1593570792843,0.259199978263454
48.3382113058579,10.1665516024557,0.259199978263454
48.3382113058579,10.1737461256271,0.259199978263454
48.3382113058579,10.1809406487984,0.259199978263454
48.3382113058579,10.1881351719698,0.259199978263454
48.3382113058579,10.1953296951412,0.259199978263454
48.3382113058579,10.2025242183126,0.259199978263454
48.3382113058579,10.2097187414839,0.234775528315519
48.3382113058579,10.2169132646553,0.339650743306497
48.3382113058579,10.2241077878267,0.259199978263454
48.3382113058579,10.231302310998,0.259199978263454
48.3382113058579,10.2384968341694,0.259199978263454
48.3382113058579,10.2456913573408,0.259199978263454
48.3382113058579,10.2528858805122,0.259199978263454
48.3382113058579,10.2672749268549,0.259199978263454
48.34277699348,10.0154666158569,0.259199978263454
48.34277699348,10.0226611390282,0.245734676973662
48.34277699348,10.0298556621996,0.312926563744569
48.34277699348,10.037050185371,0.372554104295365
48.34277699348,10.0442447085424,0.261660877845947
48.34277699348,10.0514392317137,0.259199978263454
48.34277699348,10.0586337548851,0.259199978263454
48.34277699348,10.0658282780565,0.255117297946433
48.34277699348,10.0730228012278,0.260836472427069
48.34277699348,10.0802173243992,0.259199978263454
48.34277699348,10.0874118475706,0.259199978263454
48.34277699348,10.094606370742,0.266666357197736
48.34277699348,10.1018008939133,0.256265935264059
48.34277699348,10.1089954170847,0.259199978263454
48.34277699348,10.1161899402561,0.259199978263454
48.34277699348,10.1233844634275,0.259199978263454
48.34277699348,10.1305789865988,0.260737614916523
48.34277699348,10.1377735097702,0.260342940319575
48.34277699348,10.1449680329416,0.259199978263454
48.34277699348,10.1521625561129,0.281508682746018
48.34277699348,10.1593570792843,0.260194254153675
48.34277699348,10.1665516024557,0.259199978263454
48.34277699348,10.1737461256271,0.259199978263454
48.34277699348,10.1809406487984,0.259199978263454
48.34277699348,10.1881351719698,0.259199978263454
48.34277699348,10.1953296951412,0.262539440563735
48.34277699348,10.2025242183126,0.261027063770729
48.34277699348,10.2097187414839,0.259199978263454
48.34277699348,10.2169132646553,0.261854006099453
48.34277699348,10.2241077878267,0.259199978263454
48.34277699348,10.231302310998,0.259199978263454
48.34277699348,10.2384968341694,0.259199978263454
48.34277699348,10.2456913573408,0.259199978263454
48.34277699348,10.2528858805122,0.259199978263454
48.347342681102,10.0010775695141,0.259199978263454
48.347342681102,10.0082720926855,0.259199978263454
48.347342681102,10.0154666158569,0.259199978263454
48.347342681102,10.0226611390282,0.232706192176613
48.347342681102,10.0298556621996,0.384042360322767
48.347342681102,10.037050185371,0.450122669489968
48.347342681102,10.0442447085424,0.262447876721679
48.347342681102,10.0514392317137,0.259199978263454
48.347342681102,10.0586337548851,0.259199978263454
48.347342681102,10.0658282780565,0.261257349520232
48.347342681102,10.0730228012278,0.259199978263454
48.347342681102,10.0802173243992,0.259199978263454
48.347342681102,10.0874118475706,0.289232167380996
48.347342681102,10.094606370742,0.442730017952257
48.347342681102,10.1018008939133,0.281089291047073
48.347342681102,10.1089954170847,0.259199978263454
48.347342681102,10.1161899402561,0.259199978263454
48.347342681102,10.1233844634275,0.259199978263454
48.347342681102,10.1305789865988,0.318498268113397
48.347342681102,10.1377735097702,0.269660520242384
48.347342681102,10.1449680329416,0.259199978263454
48.347342681102,10.1521625561129,0.362755170238528
48.347342681102,10.1593570792843,0.335794670504881
48.347342681102,10.1665516024557,0.255064007847141
48.347342681102,10.1737461256271,0.259199978263454
48.347342681102,10.1809406487984,0.259199978263454
48.347342681102,10.1881351719698,0.259199978263454
48.347342681102,10.1953296951412,0.260064270358024
48.347342681102,10.2025242183126,0.259199978263454
48.347342681102,10.2097187414839,0.27604216196876
48.347342681102,10.2169132646553,0.269371866896259
48.347342681102,10.2241077878267,0.259199978263454
48.347342681102,10.231302310998,0.259199978263454
48.347342681102,10.2528858805122,0.259199978263454
48.347342681102,10.2600804036835,0.259199978263454
48.3519083687241,10.0010775695141,0.265981509937675
48.3519083687241,10.0082720926855,0.259199978263454
48.3519083687241,10.0154666158569,0.259199978263454
48.3519083687241,10.0226611390282,0.259199978263454
48.3519083687241,10.0298556621996,0.259199978263454
48.3519083687241,10.037050185371,0.251636406272426
48.3519083687241,10.0442447085424,0.276993601991873
48.3519083687241,10.0514392317137,0.259199978263454
48.3519083687241,10.0586337548851,0.243210977166083
48.3519083687241,10.0658282780565,0.226375295487461
48.3519083687241,10.0730228012278,0.259828560247419
48.3519083687241,10.0802173243992,0.259199978263454
48.3519083687241,10.0874118475706,0.259199978263454
48.3519083687241,10.094606370742,0.327558195244481
48.3519083687241,10.1018008939133,0.259645198562117
48.3519083687241,10.1089954170847,0.259199978263454
48.3519083687241,10.1161899402561,0.259199978263454
48.3519083687241,10.1233844634275,0.259199978263454
48.3519083687241,10.1305789865988,0.259199978263454
48.3519083687241,10.1377735097702,0.244334901874178
48.3519083687241,10.1449680329416,0.259199978263454
48.3519083687241,10.1521625561129,0.34517274683809
48.3519083687241,10.1593570792843,0.419202337762116
48.3519083687241,10.1665516024557,0.2833697132664
48.3519083687241,10.1737461256271,0.263860280884314
48.3519083687241,10.1809406487984,0.260437269704903
48.3519083687241,10.1881351719698,0.259199978263454
48.3519083687241,10.1953296951412,0.254579111791009
48.3519083687241,10.2025242183126,0.259199978263454
48.3519083687241,10.2097187414839,0.279232334019054
48.3519083687241,10.2169132646553,0.272266597472242
48.3519083687241,10.2241077878267,0.259199978263454
48.3519083687241,10.231302310998,0.259199978263454
48.3519083687241,10.2600804036835,0.259199978263454
48.3519083687241,10.2672749268549,0.259199978263454
48.3564740563461,10.0010775695141,0.29123178149149
48.3564740563461,10.0082720926855,0.272580775366866
48.3564740563461,10.0154666158569,0.259199978263454
48.3564740563461,10.0226611390282,0.259199978263454
48.3564740563461,10.0298556621996,0.259199978263454
48.3564740563461,10.037050185371,0.259199978263454
48.3564740563461,10.0442447085424,0.290693960746155
48.3564740563461,10.0514392317137,0.347670056005892
48.3564740563461,10.0586337548851,0.259199978263454
48.3564740563461,10.0658282780565,0.374356823899771
48.3564740563461,10.0730228012278,0.288276949963126
48.3564740563461,10.0802173243992,0.263898301467938
48.3564740563461,10.0874118475706,0.259199978263454
48.3564740563461,10.094606370742,0.259199978263454
48.3564740563461,10.1018008939133,0.259199978263454
48.3564740563461,10.1089954170847,0.259199978263454
48.3564740563461,10.1161899402561,0.259199978263454
48.3564740563461,10.1233844634275,0.259199978263454
48.3564740563461,10.1305789865988,0.259199978263454
48.3564740563461,10.1377735097702,0.242314423579604
48.3564740563461,10.1449680329416,0.259199978263454
48.3564740563461,10.1521625561129,0.272160926419535
48.3564740563461,10.1593570792843,0.439341083049125
48.3564740563461,10.1665516024557,0.297368376645157
48.3564740563461,10.1737461256271,0.259199978263454
48.3564740563461,10.1809406487984,0.259199978263454
48.3564740563461,10.1881351719698,0.261877477880735
48.3564740563461,10.1953296951412,0.244732920080835
48.3564740563461,10.2025242183126,0.26135729814547
48.3564740563461,10.2097187414839,0.259199978263454
48.3564740563461,10.2169132646553,0.259199978263454
48.3564740563461,10.2241077878267,0.259199978263454
48.3564740563461,10.2672749268549,0.259199978263454
48.3610397439681,10.0010775695141,0.234717781564871
48.3610397439681,10.0082720926855,0.250015720251627
48.3610397439681,10.0154666158569,0.253469688542241
48.3610397439681,10.0226611390282,0.244780347073298
48.3610397439681,10.0298556621996,0.259199978263454
48.3610397439681,10.037050185371,0.249026649634417
48.3610397439681,10.0442447085424,0.247980747548381
48.3610397439681,10.0514392317137,0.260571120598017
48.3610397439681,10.0586337548851,0.259199978263454
48.3610397439681,10.0658282780565,0.340175872147044
48.3610397439681,10.0730228012278,0.315427912243373
48.3610397439681,10.0802173243992,0.239862907585844
48.3610397439681,10.0874118475706,0.259199978263454
48.3610397439681,10.094606370742,0.259199978263454
48.3610397439681,10.1018008939133,0.259199978263454
48.3610397439681,10.1089954170847,0.262200201060639
48.3610397439681,10.1161899402561,0.26151752579001
48.3610397439681,10.1233844634275,0.259199978263454
48.3610397439681,10.1305789865988,0.259199978263454
48.3610397439681,10.1377735097702,0.259199978263454
48.3610397439681,10.1449680329416,0.259510148139759
48.3610397439681,10.1521625561129,0.264594816864663
48.3610397439681,10.1593570792843,0.363876161980855
48.3610397439681,10.1665516024557,0.259199978263454
48.3610397439681,10.1737461256271,0.259199978263454
48.3610397439681,10.1809406487984,0.259199978263454
48.3610397439681,10.1881351719698,0.251876269958068
48.3610397439681,10.1953296951412,0.260131722567367
48.3610397439681,10.2025242183126,0.25978043400002
48.3610397439681,10.2097187414839,0.259199978263454
48.3610397439681,10.2169132646553,0.259199978263454
48.3656054315902,9.979494,0.259199978263454
48.3656054315902,9.99388304634275,0.259199978263454
48.3656054315902,10.0010775695141,0.375362283131581
48.3656054315902,10.0082720926855,0.275162431775179
48.3656054315902,10.0154666158569,0.266772517713158
48.3656054315902,10.0226611390282,0.402915462995622
48.3656054315902,10.0298556621996,0.265477104090521
48.3656054315902,10.037050185371,0.251244935656451
48.3656054315902,10.0442447085424,0.250090738402372
48.3656054315902,10.0514392317137,0.259199978263454
48.3656054315902,10.0586337548851,0.259199978263454
48.3656054315902,10.0658282780565,0.280356776300747
48.3656054315902,10.0730228012278,0.270511225579848
48.3656054315902,10.0802173243992,0.238564348590643
48.3656054315902,10.0874118475706,0.259199978263454
48.3656054315902,10.094606370742,0.259199978263454
48.3656054315902,10.1018008939133,0.259199978263454
48.3656054315902,10.1089954170847,0.259709133440673
48.3656054315902,10.1161899402561,0.259294460381138
48.3656054315902,10.1233844634275,0.259199978263454
48.3656054315902,10.1305789865988,0.259199978263454
48.3656054315902,10.1377735097702,0.259199978263454
48.3656054315902,10.1449680329416,0.285901171406729
48.3656054315902,10.1521625561129,0.283763704417392
48.3656054315902,10.1593570792843,0.287530253998817
48.3656054315902,10.1665516024557,0.259199978263454
48.3656054315902,10.1737461256271,0.259199978263454
48.3656054315902,10.1809406487984,0.259199978263454
48.3656054315902,10.1881351719698,0.259199978263454
48.3656054315902,10.1953296951412,0.259199978263454
48.3656054315902,10.2025242183126,0.259199978263454
48.3701711192122,9.979494,0.259199978263454
48.3701711192122,9.98668852317137,0.300476094876628
48.3701711192122,9.99388304634275,0.295483544224122
48.3701711192122,10.0010775695141,0.384543028051511
48.3701711192122,10.0082720926855,0.353092385740177
48.3701711192122,10.0154666158569,0.367576265859946
48.3701711192122,10.0226611390282,0.344076369823733
48.3701711192122,10.0298556621996,0.259199978263454
48.3701711192122,10.037050185371,0.259199978263454
48.3701711192122,10.0442447085424,0.274773949980471
48.3701711192122,10.0514392317137,0.259199978263454
48.3701711192122,10.0586337548851,0.259199978263454
48.3701711192122,10.0658282780565,0.259199978263454
48.3701711192122,10.0730228012278,0.259199978263454
48.3701711192122,10.0802173243992,0.259199978263454
48.3701711192122,10.0874118475706,0.259199978263454
48.3701711192122,10.094606370742,0.259199978263454
48.3701711192122,10.1018008939133,0.259199978263454
48.3701711192122,10.1089954170847,0.259199978263454
48.3701711192122,10.1161899402561,0.259199978263454
48.3701711192122,10.1233844634275,0.259199978263454
48.3701711192122,10.1305789865988,0.259199978263454
48.3701711192122,10.1377735097702,0.259199978263454
48.3701711192122,10.1449680329416,0.259199978263454
48.3701711192122,10.1521625561129,0.259199978263454
48.3701711192122,10.1593570792843,0.259199978263454
48.3701711192122,10.1665516024557,0.259199978263454
48.3701711192122,10.1737461256271,0.259199978263454
48.3701711192122,10.1809406487984,0.259199978263454
48.3701711192122,10.1881351719698,0.259199978263454
48.3747368068343,9.979494,0.259199978263454
48.3747368068343,9.98668852317137,0.344031454364703
48.3747368068343,9.99388304634275,0.339831601505581
48.3747368068343,10.0010775695141,0.405080561523833
48.3747368068343,10.0082720926855,0.465390979566193
48.3747368068343,10.0154666158569,0.366180062370438
48.3747368068343,10.0226611390282,0.228353255393396
48.3747368068343,10.0298556621996,0.225125724198662
48.3747368068343,10.037050185371,0.259199978263454
48.3747368068343,10.0442447085424,0.262317786506522
48.3747368068343,10.0514392317137,0.259199978263454
48.3747368068343,10.0586337548851,0.259199978263454
48.3747368068343,10.0658282780565,0.259199978263454
48.3747368068343,10.0730228012278,0.259199978263454
48.3747368068343,10.0802173243992,0.259199978263454
48.3747368068343,10.0874118475706,0.259199978263454
48.3747368068343,10.094606370742,0.266143073608012
48.3747368068343,10.1018008939133,0.281373355961676
48.3747368068343,10.1089954170847,0.261019850356035
48.3747368068343,10.1161899402561,0.259199978263454
48.3747368068343,10.1233844634275,0.259470832157144
48.3747368068343,10.1305789865988,0.259199978263454
48.3747368068343,10.1377735097702,0.259199978263454
48.3747368068343,10.1449680329416,0.259199978263454
48.3747368068343,10.1521625561129,0.259199978263454
48.3747368068343,10.1593570792843,0.259199978263454
48.3747368068343,10.1665516024557,0.259199978263454
48.3747368068343,10.1737461256271,0.259199978263454
48.3747368068343,10.1809406487984,0.259199978263454
48.3793024944563,9.979494,0.382137456475945
48.3793024944563,9.98668852317137,0.330677651746381
48.3793024944563,9.99388304634275,0.384527837410145
48.3793024944563,10.0010775695141,0.378287673687181
48.3793024944563,10.0082720926855,0.50752232171906
48.3793024944563,10.0154666158569,0.381569419057395
48.3793024944563,10.0226611390282,0.267163178031932
48.3793024944563,10.0298556621996,0.295280706781363
48.3793024944563,10.037050185371,0.2725248236247
48.3793024944563,10.0442447085424,0.259199978263454
48.3793024944563,10.0514392317137,0.259199978263454
48.3793024944563,10.0586337548851,0.259199978263454
48.3793024944563,10.0658282780565,0.259199978263454
48.3793024944563,10.0730228012278,0.275776977966275
48.3793024944563,10.0802173243992,0.265752776286812
48.3793024944563,10.0874118475706,0.260425810755724
48.3793024944563,10.094606370742,0.219411167089656
48.3793024944563,10.1018008939133,0.365246856473486
48.3793024944563,10.1089954170847,0.371053602237477
48.3793024944563,10.1161899402561,0.259199978263454
48.3793024944563,10.1233844634275,0.265026686405195
48.3793024944563,10.1305789865988,0.260525562266152
48.3793024944563,10.1377735097702,0.262510393558855
48.3793024944563,10.1449680329416,0.298986767463877
48.3793024944563,10.1521625561129,0.270029542042841
48.3793024944563,10.1593570792843,0.259199978263454
48.3793024944563,10.1665516024557,0.259199978263454
48.3793024944563,10.1737461256271,0.26048332286713
48.3793024944563,10.1809406487984,0.256252125983338
48.3838681820784,9.98668852317137,0.361909373338675
48.3838681820784,9.99388304634275,0.364866546275587
48.3838681820784,10.0010775695141,0.484094586724159
48.3838681820784,10.0082720926855,0.463519124475433
48.3838681820784,10.0154666158569,0.349649179293904
48.3838681820784,10.0226611390282,0.278032965446406
48.3838681820784,10.0298556621996,0.343593109811642
48.3838681820784,10.037050185371,0.275552575459897
48.3838681820784,10.0442447085424,0.265605386741103
48.3838681820784,10.0514392317137,0.259199978263454
48.3838681820784,10.0586337548851,0.265816807581463
48.3838681820784,10.0658282780565,0.259199978263454
48.3838681820784,10.0730228012278,0.296998889448601
48.3838681820784,10.0802173243992,0.295081948069078
48.3838681820784,10.0874118475706,0.25968352131496
48.3838681820784,10.094606370742,0.263568833099304
48.3838681820784,10.1018008939133,0.256485273592842
48.3838681820784,10.1089954170847,0.295027163825514
48.3838681820784,10.1161899402561,0.259199978263454
48.3838681820784,10.1233844634275,0.259199978263454
48.3838681820784,10.1305789865988,0.259233622759275
48.3838681820784,10.1377735097702,0.260657059975712
48.3838681820784,10.1449680329416,0.270262760830841
48.3838681820784,10.1521625561129,0.242198321343373
48.3838681820784,10.1593570792843,0.259199978263454
48.3838681820784,10.1665516024557,0.259199978263454
48.3838681820784,10.1737461256271,0.245144036109384
48.3838681820784,10.1809406487984,0.224859476708585
48.3884338697004,9.98668852317137,0.264467037305021
48.3884338697004,9.99388304634275,0.477016564352774
48.3884338697004,10.0010775695141,0.543782502964211
48.3884338697004,10.0082720926855,0.366175387456629
48.3884338697004,10.0154666158569,0.392089202420257
48.3884338697004,10.0226611390282,0.283904294626828
48.3884338697004,10.0298556621996,0.258649795116253
48.3884338697004,10.037050185371,0.34808353638135
48.3884338697004,10.0442447085424,0.267271570439168
48.3884338697004,10.0514392317137,0.259075079507406
48.3884338697004,10.0586337548851,0.290118641414883
48.3884338697004,10.0658282780565,0.268926959269781
48.3884338697004,10.0730228012278,0.318168087855112
48.3884338697004,10.0802173243992,0.285002177493322
48.3884338697004,10.0874118475706,0.259199978263454
48.3884338697004,10.094606370742,0.259199978263454
48.3884338697004,10.1018008939133,0.253821918000473
48.3884338697004,10.1089954170847,0.280945252716002
48.3884338697004,10.1161899402561,0.259199978263454
48.3884338697004,10.1233844634275,0.259199978263454
48.3884338697004,10.1305789865988,0.259199978263454
48.3884338697004,10.1377735097702,0.259199978263454
48.3884338697004,10.1449680329416,0.259199978263454
48.3884338697004,10.1521625561129,0.259199978263454
48.3884338697004,10.1593570792843,0.26097994643938
48.3884338697004,10.1737461256271,0.259199978263454
48.3929995573224,9.99388304634275,0.489392215674342
48.3929995573224,10.0010775695141,0.6997131550648
48.3929995573224,10.0082720926855,0.535792814272375
48.3929995573224,10.0154666158569,0.370087900701422
48.3929995573224,10.0226611390282,0.382736773339938
48.3929995573224,10.0298556621996,0.322256072086598
48.3929995573224,10.037050185371,0.165299940817228
48.3929995573224,10.0442447085424,0.238617686323349
48.3929995573224,10.0514392317137,0.259199978263454
48.3929995573224,10.0586337548851,0.259199978263454
48.3929995573224,10.0658282780565,0.259199978263454
48.3929995573224,10.0730228012278,0.292226952523267
48.3929995573224,10.0802173243992,0.259199978263454
48.3929995573224,10.0874118475706,0.259199978263454
48.3929995573224,10.094606370742,0.259199978263454
48.3929995573224,10.1018008939133,0.259199978263454
48.3929995573224,10.1089954170847,0.259199978263454
48.3929995573224,10.1161899402561,0.259199978263454
48.3929995573224,10.1233844634275,0.259199978263454
48.3929995573224,10.1305789865988,0.259199978263454
48.3929995573224,10.1377735097702,0.259199978263454
48.3929995573224,10.1449680329416,0.259199978263454
48.3929995573224,10.1521625561129,0.259199978263454
48.3929995573224,10.1593570792843,0.259199978263454
48.3929995573224,10.1665516024557,0.259199978263454
48.3975652449445,10.0010775695141,0.721373515541617
48.3975652449445,10.0082720926855,0.75427616970849
48.3975652449445,10.0154666158569,0.641034442973415
48.3975652449445,10.0226611390282,0.622626013710589
48.3975652449445,10.0298556621996,0.419589493627605
48.3975652449445,10.037050185371,0.244546420776053
48.3975652449445,10.0442447085424,0.269747693807818
48.3975652449445,10.0514392317137,0.259199978263454
48.3975652449445,10.0586337548851,0.259199978263454
48.3975652449445,10.0658282780565,0.259199978263454
48.3975652449445,10.0730228012278,0.259199978263454
48.3975652449445,10.0802173243992,0.259199978263454
48.3975652449445,10.0874118475706,0.259199978263454
48.3975652449445,10.094606370742,0.229109897976705
48.3975652449445,10.1018008939133,0.285602406943665
48.3975652449445,10.1089954170847,0.280471074746696
48.3975652449445,10.1161899402561,0.259199978263454
48.3975652449445,10.1233844634275,0.259199978263454
48.3975652449445,10.1305789865988,0.259199978263454
48.3975652449445,10.1377735097702,0.259199978263454
48.3975652449445,10.1449680329416,0.259199978263454
48.3975652449445,10.1521625561129,0.259199978263454
48.3975652449445,10.1593570792843,0.259199978263454
48.4021309325665,10.0154666158569,0.490081908394211
48.4021309325665,10.0226611390282,0.325342485869426
48.4021309325665,10.0298556621996,0.322022987099766
48.4021309325665,10.037050185371,0.256587620669781
48.4021309325665,10.0442447085424,0.348219900554583
48.4021309325665,10.0514392317137,0.259199978263454
48.4021309325665,10.0586337548851,0.259199978263454
48.4021309325665,10.0658282780565,0.259199978263454
48.4021309325665,10.0730228012278,0.259199978263454
48.4021309325665,10.0802173243992,0.259199978263454
48.4021309325665,10.0874118475706,0.259199978263454
48.4021309325665,10.094606370742,0.259199978263454
48.4021309325665,10.1018008939133,0.29914131418947
48.4021309325665,10.1089954170847,0.288982797373825
48.4021309325665,10.1161899402561,0.259199978263454
48.4021309325665,10.1233844634275,0.259199978263454
48.4021309325665,10.1305789865988,0.259199978263454
48.4021309325665,10.1377735097702,0.259199978263454
48.4021309325665,10.1449680329416,0.259199978263454
48.4021309325665,10.1521625561129,0.259199978263454
48.4021309325665,10.1593570792843,0.25712573438228
48.4021309325665,10.1665516024557,0.259199978263454
48.4066966201886,10.0226611390282,0.384714990760948
48.4066966201886,10.0298556621996,0.357474867473882
48.4066966201886,10.037050185371,0.380088337205107
48.4066966201886,10.0442447085424,0.397108780534724
48.4066966201886,10.0514392317137,0.262225726921368
48.4066966201886,10.0586337548851,0.259199978263454
48.4066966201886,10.0658282780565,0.268861454389302
48.4066966201886,10.0730228012278,0.25918037334521
48.4066966201886,10.0802173243992,0.259199978263454
48.4066966201886,10.0874118475706,0.259199978263454
48.4066966201886,10.094606370742,0.259199978263454
48.4066966201886,10.1018008939133,0.259199978263454
48.4066966201886,10.1089954170847,0.259199978263454
48.4066966201886,10.1161899402561,0.259199978263454
48.4066966201886,10.1233844634275,0.259199978263454
48.4066966201886,10.1305789865988,0.259199978263454
48.4066966201886,10.1377735097702,0.259199978263454
48.4066966201886,10.1449680329416,0.259199978263454
48.4066966201886,10.1521625561129,0.258188849604962
48.4066966201886,10.1593570792843,0.228317040278885
48.4112623078106,10.0226611390282,0.306078703049808
48.4112623078106,10.0298556621996,0.2197833535937
48.4112623078106,10.037050185371,0.409159742793533
48.4112623078106,10.0442447085424,0.362113127928647
48.4112623078106,10.0514392317137,0.313374288838933
48.4112623078106,10.0586337548851,0.26764330229426
48.4112623078106,10.0658282780565,0.381636438284065
48.4112623078106,10.0730228012278,0.319804500081403
48.4112623078106,10.0802173243992,0.259199978263454
48.4112623078106,10.0874118475706,0.259199978263454
48.4112623078106,10.094606370742,0.259199978263454
48.4112623078106,10.1018008939133,0.259199978263454
48.4112623078106,10.1089954170847,0.259199978263454
48.4112623078106,10.1161899402561,0.259199978263454
48.4112623078106,10.1233844634275,0.259199978263454
48.4112623078106,10.1305789865988,0.266916888172789
48.4112623078106,10.1377735097702,0.260439909906028
48.4112623078106,10.1449680329416,0.314215248189909
48.4112623078106,10.1521625561129,0.263199559025455
48.4112623078106,10.1593570792843,0.253239412551275
48.4112623078106,10.1665516024557,0.259199978263454
48.4158279954326,10.0226611390282,0.254690953876398
48.4158279954326,10.0298556621996,0.258054136311602
48.4158279954326,10.037050185371,0.261227951661119
48.4158279954326,10.0442447085424,0.295073731809512
48.4158279954326,10.0514392317137,0.279507689548871
48.4158279954326,10.0586337548851,0.245930905812484
48.4158279954326,10.0658282780565,0.389413691403879
48.4158279954326,10.0730228012278,0.338119742015103
48.4158279954326,10.0802173243992,0.261241899232529
48.4158279954326,10.0874118475706,0.259199978263454
48.4158279954326,10.094606370742,0.283145565611533
48.4158279954326,10.1018008939133,0.240387236187261
48.4158279954326,10.1089954170847,0.259199978263454
48.4158279954326,10.1161899402561,0.259199978263454
48.4158279954326,10.1233844634275,0.259199978263454
48.4158279954326,10.1305789865988,0.23057118874085
48.4158279954326,10.1377735097702,0.225517565507341
48.4158279954326,10.1449680329416,0.341578147113195
48.4158279954326,10.1521625561129,0.241095966556989
48.4158279954326,10.1593570792843,0.268786632084585
48.4158279954326,10.1665516024557,0.259199978263454
48.4203936830547,10.0226611390282,0.270782237122324
48.4203936830547,10.0298556621996,0.284694765622927
48.4203936830547,10.037050185371,0.362250965121002
48.4203936830547,10.0442447085424,0.264831607604171
48.4203936830547,10.0514392317137,0.259199978263454
48.4203936830547,10.0586337548851,0.284379140015112
48.4203936830547,10.0658282780565,0.306187909310732
48.4203936830547,10.0730228012278,0.257297357531766
48.4203936830547,10.0802173243992,0.297738984568285
48.4203936830547,10.0874118475706,0.259199978263454
48.4203936830547,10.094606370742,0.259199978263454
48.4203936830547,10.1018008939133,0.261949840295478
48.4203936830547,10.1089954170847,0.259199978263454
48.4203936830547,10.1161899402561,0.247199931763341
48.4203936830547,10.1233844634275,0.257696188586474
48.4203936830547,10.1305789865988,0.235539040059178
48.4203936830547,10.1377735097702,0.2490782370632
48.4203936830547,10.1449680329416,0.3115816651394
48.4203936830547,10.1521625561129,0.290189023159243
48.4203936830547,10.1593570792843,0.288096636587768
48.4203936830547,10.1665516024557,0.267828421488774
48.4249593706767,10.037050185371,0.328333271905919
48.4249593706767,10.0442447085424,0.27383317023952
48.4249593706767,10.0514392317137,0.259199978263454
48.4249593706767,10.0586337548851,0.299306250279207
48.4249593706767,10.0658282780565,0.336640194253286
48.4249593706767,10.0730228012278,0.259199978263454
48.4249593706767,10.0802173243992,0.351468788884041
48.4249593706767,10.0874118475706,0.259199978263454
48.4249593706767,10.094606370742,0.259199978263454
48.4249593706767,10.1018008939133,0.259199978263454
48.4249593706767,10.1089954170847,0.309976759845508
48.4249593706767,10.1161899402561,0.407059224346587
48.4249593706767,10.1233844634275,0.42723714997138
48.4249593706767,10.1305789865988,0.278934098644308
48.4249593706767,10.1377735097702,0.239303015275375
48.4249593706767,10.1449680329416,0.264551492786639
48.4249593706767,10.1521625561129,0.211409935542352
48.4249593706767,10.1593570792843,0.270809038573874
48.4249593706767,10.1665516024557,0.283929134167927
48.4249593706767,10.1737461256271,0.268366816921783
48.4295250582988,10.0442447085424,0.341615713681837
48.4295250582988,10.0514392317137,0.260927623477095
48.4295250582988,10.0586337548851,0.259199978263454
48.4295250582988,10.0658282780565,0.259199978263454
48.4295250582988,10.0730228012278,0.259199978263454
48.4295250582988,10.0802173243992,0.259199978263454
48.4295250582988,10.0874118475706,0.259199978263454
48.4295250582988,10.094606370742,0.259199978263454
48.4295250582988,10.1018008939133,0.279517557499357
48.4295250582988,10.1089954170847,0.363806154228826
48.4295250582988,10.1161899402561,0.399752014402038
48.4295250582988,10.1233844634275,0.645348488572677
48.4295250582988,10.1305789865988,0.428254412333152
48.4295250582988,10.1377735097702,0.294793489350565
48.4295250582988,10.1449680329416,0.374755558307259
48.4295250582988,10.1521625561129,0.315292885987764
48.4295250582988,10.1593570792843,0.300913603478475
48.4295250582988,10.1665516024557,0.250299740278646
48.4295250582988,10.1737461256271,0.259199978263454
48.4295250582988,10.1809406487984,0.259199978263454
48.4340907459208,10.037050185371,0.259199978263454
48.4340907459208,10.0442447085424,0.293125404579161
48.4340907459208,10.0514392317137,0.405202697218334
48.4340907459208,10.0586337548851,0.236362891320131
48.4340907459208,10.0658282780565,0.23990158178281
48.4340907459208,10.0730228012278,0.259199978263454
48.4340907459208,10.0802173243992,0.259199978263454
48.4340907459208,10.0874118475706,0.259199978263454
48.4340907459208,10.094606370742,0.259199978263454
48.4340907459208,10.1018008939133,0.270372600489961
48.4340907459208,10.1089954170847,0.329431221209424
48.4340907459208,10.1161899402561,0.392452300557025
48.4340907459208,10.1233844634275,0.359177192211085
48.4340907459208,10.1305789865988,0.283141510553803
48.4340907459208,10.1377735097702,0.269585674662387
48.4340907459208,10.1449680329416,0.282406783578178
48.4340907459208,10.1521625561129,0.259785105209163
48.4340907459208,10.1593570792843,0.352198006650853
48.4340907459208,10.1665516024557,0.265092096104106
48.4340907459208,10.1737461256271,0.259199978263454
48.4340907459208,10.1809406487984,0.259199978263454
48.4386564335428,10.0298556621996,0.259199978263454
48.4386564335428,10.037050185371,0.259199978263454
48.4386564335428,10.0442447085424,0.240724657362878
48.4386564335428,10.0514392317137,0.443743208504256
48.4386564335428,10.0586337548851,0.273936827096683
48.4386564335428,10.0658282780565,0.259788604588166
48.4386564335428,10.0730228012278,0.259199978263454
48.4386564335428,10.0802173243992,0.259199978263454
48.4386564335428,10.0874118475706,0.259199978263454
48.4386564335428,10.094606370742,0.259199978263454
48.4386564335428,10.1018008939133,0.261588056253315
48.4386564335428,10.1089954170847,0.261658513583915
48.4386564335428,10.1161899402561,0.271472011953587
48.4386564335428,10.1233844634275,0.294398426733961
48.4386564335428,10.1305789865988,0.315627309543219
48.4386564335428,10.1377735097702,0.259199978263454
48.4386564335428,10.1449680329416,0.259199978263454
48.4386564335428,10.1521625561129,0.259199978263454
48.4386564335428,10.1593570792843,0.259199978263454
48.4386564335428,10.1665516024557,0.259199978263454
48.4386564335428,10.1737461256271,0.259199978263454
48.4386564335428,10.1809406487984,0.259199978263454
48.4432221211649,10.037050185371,0.259199978263454
48.4432221211649,10.0442447085424,0.259199978263454
48.4432221211649,10.0514392317137,0.259199978263454
48.4432221211649,10.0586337548851,0.260642741210708
48.4432221211649,10.0658282780565,0.259401824613346
48.4432221211649,10.0730228012278,0.234013769076062
48.4432221211649,10.0802173243992,0.246912928539223
48.4432221211649,10.0874118475706,0.253875849501631
48.4432221211649,10.094606370742,0.259199978263454
48.4432221211649,10.1018008939133,0.259199978263454
48.4432221211649,10.1089954170847,0.259199978263454
48.4432221211649,10.1161899402561,0.259199978263454
48.4432221211649,10.1233844634275,0.262111414364477
48.4432221211649,10.1305789865988,0.265726784457638
48.4432221211649,10.1377735097702,0.259199978263454
48.4432221211649,10.1449680329416,0.259199978263454
48.4432221211649,10.1521625561129,0.259199978263454
48.4432221211649,10.1593570792843,0.259199978263454
48.4432221211649,10.1737461256271,0.259199978263454
48.4477878087869,10.037050185371,0.259199978263454
48.4477878087869,10.0442447085424,0.259199978263454
48.4477878087869,10.0514392317137,0.259199978263454
48.4477878087869,10.0586337548851,0.259199978263454
48.4477878087869,10.0658282780565,0.269353754757573
48.4477878087869,10.0730228012278,0.283673875623895
48.4477878087869,10.0802173243992,0.408450303939902
48.4477878087869,10.0874118475706,0.331837772047595
48.4477878087869,10.094606370742,0.25034365709158
48.4477878087869,10.1018008939133,0.211686597243502
48.4477878087869,10.1089954170847,0.267167874604628
48.4477878087869,10.1161899402561,0.268171540175913
48.4477878087869,10.1233844634275,0.277712608973785
48.4477878087869,10.1305789865988,0.284908866379865
48.4477878087869,10.1377735097702,0.259199978263454
48.452353496409,10.037050185371,0.264143379746088
48.452353496409,10.0442447085424,0.259199978263454
48.452353496409,10.0514392317137,0.259199978263454
48.452353496409,10.0586337548851,0.259199978263454
48.452353496409,10.0658282780565,0.259199978263454
48.452353496409,10.0730228012278,0.305481774423354
48.452353496409,10.0802173243992,0.398272565220607
48.452353496409,10.0874118475706,0.427835757759359
48.452353496409,10.094606370742,0.374691856695295
48.452353496409,10.1018008939133,0.249783265153548
48.452353496409,10.1089954170847,0.282155577666307
48.452353496409,10.1161899402561,0.289572968624466
48.452353496409,10.1233844634275,0.259199978263454
48.452353496409,10.1305789865988,0.259199978263454
48.456919184031,10.037050185371,0.287478486172307
48.456919184031,10.0442447085424,0.259199978263454
48.456919184031,10.0514392317137,0.259199978263454
48.456919184031,10.0586337548851,0.259199978263454
48.456919184031,10.0658282780565,0.259199978263454
48.456919184031,10.0730228012278,0.259199978263454
48.456919184031,10.0802173243992,0.259199978263454
48.456919184031,10.0874118475706,0.253053609723024
48.456919184031,10.094606370742,0.283556034487518
48.456919184031,10.1018008939133,0.485825098455478
48.456919184031,10.1089954170847,0.500764501803238
48.456919184031,10.1161899402561,0.309590034118028
48.456919184031,10.1233844634275,0.259199978263454
48.456919184031,10.1305789865988,0.259199978263454
