nan,nan,4.060820607482570344e-01
1.095754347721351607e+01,5.415311414863601414e+01,4.175923937242423389e-01
1.067767342334983205e+01,5.418434915467162227e+01,4.286510064203330472e-01
1.108705663596691338e+01,5.422025681489952831e+01,4.414489040802817565e-01
1.081856033388356764e+01,5.410653180109733285e+01,4.557484133766413481e-01
1.106151352268073218e+01,5.419458162825873160e+01,4.668759988394926563e-01
1.066203603002539246e+01,5.392241291009569437e+01,4.789134335944540410e-01
1.088620620793918903e+01,5.409618926747214118e+01,4.899644796197039076e-01
1.113427911793587199e+01,5.441590521303270123e+01,5.009045241663910852e-01
1.098339705541346234e+01,5.415756605252561684e+01,5.118947403133630170e-01
1.049147706223906695e+01,5.417158965707259455e+01,5.228362923818344887e-01
