nan,nan,3.009175590037144188e-01
1.283949650341769733e+01,5.081524617923325593e+01,3.143442655502453054e-01
1.289608705628656082e+01,5.086639727044087067e+01,3.261595616480712501e-01
1.294953987060369194e+01,5.078921802471555225e+01,3.372413163209240228e-01
1.283648098976177643e+01,5.083211807587210274e+01,3.489080822922686620e-01
1.297489788199305494e+01,5.076757126462705827e+01,3.617427514470341610e-01
1.285514680649687591e+01,5.083452581717909879e+01,3.751920019535924244e-01
1.302000021419980591e+01,5.079992865173271355e+01,3.871479773568727856e-01
1.285003913738074033e+01,5.086566856907365519e+01,3.980434124897720971e-01
1.291438556262768067e+01,5.087424562858809907e+01,4.104178948610458511e-01
1.281945036176360198e+01,5.081134155891238180e+01,4.242566883968923452e-01
