nan,nan,0.000000000000000000e+00
7.066505785383228044e+00,4.947155210511229484e+01,1.337919922680688538e-02
7.052214678898820033e+00,4.957121484868480366e+01,2.700708428811932071e-02
7.252392340595387843e+00,4.954892173149998769e+01,3.887808732262177519e-02
7.077922739204234759e+00,4.942580464412785091e+01,5.189919743546106412e-02
7.081095474445057825e+00,4.951375067332509872e+01,6.446465818015072180e-02
7.149486399049195029e+00,4.946928947541677957e+01,7.817692677244515720e-02
7.168330794080012502e+00,4.942905850897339093e+01,9.041192951984834691e-02
7.169280329151424880e+00,4.953003571259257853e+01,1.037508347378232471e-01
7.050825509777980393e+00,4.944955480466385467e+01,1.162000514982935717e-01
7.164691767115979104e+00,4.946802167827454610e+01,1.285775789757807874e-01
