51.4175768,7.46721750601216,0.259199978263454
51.4175768,7.47441204264908,0.259199978263454
51.4175768,7.48160657928599,0.279620643466284
51.4175768,7.48880111592291,0.333299275958553
51.4175768,7.49599565255983,0.286997629646061
51.4221102440329,7.46721750601216,0.252538963626898
51.4221102440329,7.47441204264908,0.2691213520396
51.4221102440329,7.48160657928599,0.336539138768569
51.4221102440329,7.48880111592291,0.459893299747847
51.4221102440329,7.49599565255983,0.346037003736683
51.4221102440329,7.50319018919674,0.281651902741369
51.4266436880657,7.46721750601216,0.240545351324017
51.4266436880657,7.47441204264908,0.259199978263454
51.4266436880657,7.48160657928599,0.26990382049441
51.4266436880657,7.48880111592291,0.248050689272632
51.4266436880657,7.49599565255983,0.259199978263454
51.4266436880657,7.50319018919674,0.259199978263454
51.4311771320986,7.47441204264908,0.259199978263454
51.4311771320986,7.48160657928599,0.259199978263454
51.4311771320986,7.48880111592291,0.249526856999659
51.4311771320986,7.49599565255983,0.259199978263454
51.4311771320986,7.50319018919674,0.308390424015394
51.4311771320986,7.51038472583366,0.320339830140151
51.4357105761314,7.42405028619066,0.259199978263454
51.4357105761314,7.43124482282758,0.259199978263454
51.4357105761314,7.4384393594645,0.259199978263454
51.4357105761314,7.44563389610141,0.259199978263454
51.4357105761314,7.46721750601216,0.259199978263454
51.4357105761314,7.47441204264908,0.265899915708585
51.4357105761314,7.48160657928599,0.270124360712728
51.4357105761314,7.48880111592291,0.250460682089779
51.4357105761314,7.49599565255983,0.248292203435368
51.4357105761314,7.50319018919674,0.259199978263454
51.4357105761314,7.51038472583366,0.263140037406279
51.4357105761314,7.51757926247058,0.263191577973217
51.4402440201643,7.42405028619066,0.259199978263454
51.4402440201643,7.43124482282758,0.259199978263454
51.4402440201643,7.4384393594645,0.259199978263454
51.4402440201643,7.44563389610141,0.259199978263454
51.4402440201643,7.45282843273833,0.263086833506089
51.4402440201643,7.46002296937524,0.26288872775437
51.4402440201643,7.46721750601216,0.259199978263454
51.4402440201643,7.47441204264908,0.259199978263454
51.4402440201643,7.48160657928599,0.259199978263454
51.4402440201643,7.48880111592291,0.27506163206569
51.4402440201643,7.49599565255983,0.247983747888584
51.4402440201643,7.50319018919674,0.259199978263454
51.4402440201643,7.51038472583366,0.265745795597752
51.4402440201643,7.51757926247058,0.283976355043061
51.4402440201643,7.52477379910749,0.292777843496169
51.4402440201643,7.53196833574441,0.259199978263454
51.4447774641972,7.42405028619066,0.259199978263454
51.4447774641972,7.43124482282758,0.259199978263454
51.4447774641972,7.4384393594645,0.259199978263454
51.4447774641972,7.44563389610141,0.259199978263454
51.4447774641972,7.45282843273833,0.339444948937182
51.4447774641972,7.46002296937524,0.361262669108256
51.4447774641972,7.46721750601216,0.259199978263454
51.4447774641972,7.47441204264908,0.259199978263454
51.4447774641972,7.48160657928599,0.259199978263454
51.4447774641972,7.48880111592291,0.275262082672465
51.4447774641972,7.49599565255983,0.259199978263454
51.4447774641972,7.50319018919674,0.263712301729911
51.4447774641972,7.51038472583366,0.259199978263454
51.4447774641972,7.51757926247058,0.375205661777009
51.4447774641972,7.52477379910749,0.466651339377517
51.4447774641972,7.53196833574441,0.270528279240072
51.44931090823,7.41685574955375,0.259199978263454
51.44931090823,7.42405028619066,0.259199978263454
51.44931090823,7.43124482282758,0.259199978263454
51.44931090823,7.4384393594645,0.259199978263454
51.44931090823,7.44563389610141,0.259199978263454
51.44931090823,7.45282843273833,0.305800214876616
51.44931090823,7.46002296937524,0.374748961948662
51.44931090823,7.46721750601216,0.260236977175147
51.44931090823,7.47441204264908,0.259199978263454
51.44931090823,7.48160657928599,0.258982264261467
51.44931090823,7.48880111592291,0.151419847560001
51.44931090823,7.49599565255983,0.249272772429494
51.44931090823,7.50319018919674,0.301714434808328
51.44931090823,7.51038472583366,0.2822951000174
51.44931090823,7.51757926247058,0.261684005554597
51.44931090823,7.52477379910749,0.287941782674357
51.44931090823,7.53196833574441,0.259199978263454
51.4538443522629,7.40966121291683,0.344732563108123
51.4538443522629,7.41685574955375,0.296284586728067
51.4538443522629,7.42405028619066,0.30195038701967
51.4538443522629,7.43124482282758,0.259199978263454
51.4538443522629,7.4384393594645,0.284026469658298
51.4538443522629,7.44563389610141,0.2218553517133
51.4538443522629,7.45282843273833,0.357606739437993
51.4538443522629,7.46002296937524,0.37881874333796
51.4538443522629,7.46721750601216,0.259625320821766
51.4538443522629,7.47441204264908,0.264159475131987
51.4538443522629,7.48160657928599,0.282817919380909
51.4538443522629,7.48880111592291,0.256683244113019
51.4538443522629,7.49599565255983,0.259199978263454
51.4538443522629,7.50319018919674,0.261544029921167
51.4538443522629,7.51038472583366,0.309143036334089
51.4538443522629,7.51757926247058,0.299236460568758
51.4538443522629,7.52477379910749,0.259679809650072
51.4538443522629,7.53196833574441,0.259199978263454
51.4538443522629,7.53916287238132,0.259199978263454
51.4583777962957,7.395272139643,0.259199978263454
51.4583777962957,7.40246667627991,0.26970105063735
51.4583777962957,7.40966121291683,0.272117118558107
51.4583777962957,7.41685574955375,0.257860901238861
51.4583777962957,7.42405028619066,0.259199978263454
51.4583777962957,7.43124482282758,0.259199978263454
51.4583777962957,7.4384393594645,0.387884749048363
51.4583777962957,7.44563389610141,0.315901003538868
51.4583777962957,7.45282843273833,0.33056406053464
51.4583777962957,7.46002296937524,0.329447731544554
51.4583777962957,7.46721750601216,0.376456583490158
51.4583777962957,7.47441204264908,0.396987542082358
51.4583777962957,7.48160657928599,0.416930634129758
51.4583777962957,7.48880111592291,0.356437819440486
51.4583777962957,7.49599565255983,0.259199978263454
51.4583777962957,7.50319018919674,0.26811685529695
51.4583777962957,7.51038472583366,0.24736498261545
51.4583777962957,7.51757926247058,0.354215497946033
51.4583777962957,7.52477379910749,0.409311573100837
51.4583777962957,7.53196833574441,0.263285116209537
51.4583777962957,7.53916287238132,0.259199978263454
51.4583777962957,7.54635740901824,0.259199978263454
51.4629112403286,7.395272139643,0.259199978263454
51.4629112403286,7.40246667627991,0.259199978263454
51.4629112403286,7.40966121291683,0.262959072524644
51.4629112403286,7.41685574955375,0.260890208058191
51.4629112403286,7.42405028619066,0.259199978263454
51.4629112403286,7.43124482282758,0.260100830854541
51.4629112403286,7.4384393594645,0.293966408234909
51.4629112403286,7.44563389610141,0.356092165629223
51.4629112403286,7.45282843273833,0.418427342553195
51.4629112403286,7.46002296937524,0.481042523169555
51.4629112403286,7.46721750601216,0.372202590029418
51.4629112403286,7.47441204264908,0.273257277157041
51.4629112403286,7.48160657928599,0.295307595551825
51.4629112403286,7.48880111592291,0.317402826873575
51.4629112403286,7.49599565255983,0.340535407743199
51.4629112403286,7.50319018919674,0.290692332369394
51.4629112403286,7.51038472583366,0.259199978263454
51.4629112403286,7.51757926247058,0.304710379298465
51.4629112403286,7.52477379910749,0.385346932528145
51.4629112403286,7.53196833574441,0.260515040443426
51.4629112403286,7.53916287238132,0.259199978263454
51.4674446843614,7.395272139643,0.259199978263454
51.4674446843614,7.40246667627991,0.259199978263454
51.4674446843614,7.40966121291683,0.254515222889005
51.4674446843614,7.41685574955375,0.259199978263454
51.4674446843614,7.42405028619066,0.293152049328793
51.4674446843614,7.43124482282758,0.423538899793713
51.4674446843614,7.4384393594645,0.385938156650973
51.4674446843614,7.44563389610141,0.384109937612234
51.4674446843614,7.45282843273833,0.270544983654674
51.4674446843614,7.46002296937524,0.182507930813606
51.4674446843614,7.46721750601216,0.274107055722587
51.4674446843614,7.47441204264908,0.259199978263454
51.4674446843614,7.48160657928599,0.250117041121301
51.4674446843614,7.48880111592291,0.414292920666204
51.4674446843614,7.49599565255983,0.322807161546615
51.4674446843614,7.50319018919674,0.288660092781562
51.4674446843614,7.51038472583366,0.262420397704323
51.4674446843614,7.51757926247058,0.308322692884859
51.4674446843614,7.52477379910749,0.306037828283251
51.4674446843614,7.53196833574441,0.259199978263454
51.4674446843614,7.53916287238132,0.259199978263454
51.4674446843614,7.54635740901824,0.259199978263454
51.4674446843614,7.58952462883974,0.259199978263454
51.4719781283943,7.395272139643,0.259199978263454
51.4719781283943,7.40246667627991,0.24035350260533
51.4719781283943,7.40966121291683,0.263247074023039
51.4719781283943,7.41685574955375,0.329457326285621
51.4719781283943,7.42405028619066,0.287720842120976
51.4719781283943,7.43124482282758,0.358262204378622
51.4719781283943,7.4384393594645,0.346077938027569
51.4719781283943,7.44563389610141,0.426640521229053
51.4719781283943,7.45282843273833,0.41317990803957
51.4719781283943,7.46002296937524,0.323771302732999
51.4719781283943,7.46721750601216,0.431007096492642
51.4719781283943,7.47441204264908,0.357990122614717
51.4719781283943,7.48160657928599,0.271459803103702
51.4719781283943,7.48880111592291,0.353119341948858
51.4719781283943,7.49599565255983,0.38802403287675
51.4719781283943,7.50319018919674,0.3101334732828
51.4719781283943,7.51038472583366,0.364851608076332
51.4719781283943,7.51757926247058,0.274046464127667
51.4719781283943,7.52477379910749,0.253802354203536
51.4719781283943,7.53196833574441,0.283519553381341
51.4719781283943,7.53916287238132,0.27038272586297
51.4719781283943,7.54635740901824,0.236069966600887
51.4719781283943,7.55355194565516,0.294916759447037
51.4719781283943,7.56074648229207,0.259199978263454
51.4719781283943,7.58233009220282,0.259199978263454
51.4719781283943,7.58952462883974,0.263791177839521
51.4719781283943,7.59671916547666,0.286246627679373
51.4765115724272,7.38807760300608,0.259199978263454
51.4765115724272,7.395272139643,0.259199978263454
51.4765115724272,7.40246667627991,0.27858713347129
51.4765115724272,7.40966121291683,0.400399386703589
51.4765115724272,7.41685574955375,0.323088779811051
51.4765115724272,7.42405028619066,0.448117951840227
51.4765115724272,7.43124482282758,0.552573800875881
51.4765115724272,7.4384393594645,0.588959881384359
51.4765115724272,7.44563389610141,0.59437404764786
51.4765115724272,7.45282843273833,0.317460043927792
51.4765115724272,7.46002296937524,0.259884217263259
51.4765115724272,7.46721750601216,0.363809808269311
51.4765115724272,7.47441204264908,0.360821339704341
51.4765115724272,7.48160657928599,0.384505516413914
51.4765115724272,7.48880111592291,0.303950941973946
51.4765115724272,7.49599565255983,0.486373746227558
51.4765115724272,7.50319018919674,0.375531137963456
51.4765115724272,7.51038472583366,0.494229938245375
51.4765115724272,7.51757926247058,0.257072171954146
51.4765115724272,7.52477379910749,0.31365052879295
51.4765115724272,7.53196833574441,0.544295024706579
51.4765115724272,7.53916287238132,0.433346202962322
51.4765115724272,7.54635740901824,0.286383694239697
51.4765115724272,7.55355194565516,0.259199978263454
51.4765115724272,7.56074648229207,0.259199978263454
51.4765115724272,7.56794101892899,0.259199978263454
51.4765115724272,7.57513555556591,0.259199978263454
51.4765115724272,7.58233009220282,0.259199978263454
51.4765115724272,7.58952462883974,0.262376543870869
51.4765115724272,7.59671916547666,0.286654191799336
51.4765115724272,7.60391370211357,0.263902665635845
51.48104501646,7.35929945645842,0.319260661726679
51.48104501646,7.37368852973225,0.242542267777167
51.48104501646,7.38088306636916,0.259199978263454
51.48104501646,7.38807760300608,0.259199978263454
51.48104501646,7.395272139643,0.203984032897451
51.48104501646,7.40246667627991,0.363185852923142
51.48104501646,7.40966121291683,0.523194103753992
51.48104501646,7.41685574955375,0.465434778161959
51.48104501646,7.42405028619066,0.267794700619167
51.48104501646,7.43124482282758,0.402972075317652
51.48104501646,7.4384393594645,0.404895921783221
51.48104501646,7.44563389610141,0.413873798453778
51.48104501646,7.45282843273833,0.35283187800338
51.48104501646,7.46002296937524,0.327570223359487
51.48104501646,7.46721750601216,0.413726092391112
51.48104501646,7.47441204264908,0.269579888088555
51.48104501646,7.48160657928599,0.370262819082797
51.48104501646,7.48880111592291,0.347048441160377
51.48104501646,7.49599565255983,0.430944062583047
51.48104501646,7.50319018919674,0.378818018713486
51.48104501646,7.51038472583366,0.273595583314614
51.48104501646,7.51757926247058,0.246173196565942
51.48104501646,7.52477379910749,0.249968084359122
51.48104501646,7.53196833574441,0.472256034512785
51.48104501646,7.53916287238132,0.350365773817706
51.48104501646,7.54635740901824,0.325056292730674
51.48104501646,7.55355194565516,0.288519742423215
51.48104501646,7.56074648229207,0.352696760766477
51.48104501646,7.56794101892899,0.263969805925011
51.48104501646,7.57513555556591,0.259199978263454
51.48104501646,7.58233009220282,0.259199978263454
51.48104501646,7.58952462883974,0.270762490517249
51.48104501646,7.59671916547666,0.238402890330232
51.48104501646,7.60391370211357,0.251771388279362
51.4855784604929,7.34491038318458,0.259199978263454
51.4855784604929,7.3521049198215,0.259199978263454
51.4855784604929,7.35929945645842,0.318296863451904
51.4855784604929,7.36649399309533,0.511284087033025
51.4855784604929,7.37368852973225,0.287257084980898
51.4855784604929,7.38088306636916,0.507916917870539
51.4855784604929,7.38807760300608,0.38435673752971
51.4855784604929,7.395272139643,0.253860408456662
51.4855784604929,7.40246667627991,0.288159005235648
51.4855784604929,7.40966121291683,0.457307363515918
51.4855784604929,7.41685574955375,0.447208570448344
51.4855784604929,7.42405028619066,0.468345393404545
51.4855784604929,7.43124482282758,0.336954026112901
51.4855784604929,7.4384393594645,0.468933714446735
51.4855784604929,7.44563389610141,0.416976008809473
51.4855784604929,7.45282843273833,0.281222089227203
51.4855784604929,7.46002296937524,0.403558331659229
51.4855784604929,7.46721750601216,0.419161094999602
51.4855784604929,7.47441204264908,0.294063152917834
51.4855784604929,7.48160657928599,0.297024007052536
51.4855784604929,7.48880111592291,0.483648184876976
51.4855784604929,7.49599565255983,0.692154132807571
51.4855784604929,7.50319018919674,0.557430905830448
51.4855784604929,7.51038472583366,0.343618916260028
51.4855784604929,7.51757926247058,0.24173787056957
51.4855784604929,7.52477379910749,0.254290631754251
51.4855784604929,7.53196833574441,0.259536444871056
51.4855784604929,7.53916287238132,0.280061052168262
51.4855784604929,7.54635740901824,0.453359537200477
51.4855784604929,7.55355194565516,0.241652226022885
51.4855784604929,7.56074648229207,0.311886191019752
51.4855784604929,7.56794101892899,0.272989124231947
51.4855784604929,7.57513555556591,0.255217281444399
51.4855784604929,7.58233009220282,0.259199978263454
51.4855784604929,7.58952462883974,0.276897126964034
51.4855784604929,7.59671916547666,0.34901652136073
51.4855784604929,7.60391370211357,0.259199978263454
51.4901119045257,7.32332677327383,0.275234510970934
51.4901119045257,7.34491038318458,0.297685300589988
51.4901119045257,7.3521049198215,0.317303361572803
51.4901119045257,7.35929945645842,0.243094790551433
51.4901119045257,7.36649399309533,0.481418399008065
51.4901119045257,7.37368852973225,0.242524013558279
51.4901119045257,7.38088306636916,0.402524657669017
51.4901119045257,7.38807760300608,0.271510205148485
51.4901119045257,7.395272139643,0.325975323486723
51.4901119045257,7.40246667627991,0.399688164527277
51.4901119045257,7.40966121291683,0.533867798518588
51.4901119045257,7.41685574955375,0.515302776451538
51.4901119045257,7.42405028619066,0.465617547138625
51.4901119045257,7.43124482282758,0.463517572024825
51.4901119045257,7.4384393594645,0.361397094223428
51.4901119045257,7.44563389610141,0.394176104379212
51.4901119045257,7.45282843273833,0.346300029735762
51.4901119045257,7.46002296937524,0.305322447809728
51.4901119045257,7.46721750601216,0.289976984810553
51.4901119045257,7.47441204264908,0.323495861946845
51.4901119045257,7.48160657928599,0.428577690797269
51.4901119045257,7.48880111592291,0.55203933654223
51.4901119045257,7.49599565255983,0.499597445689264
51.4901119045257,7.50319018919674,0.697658141023352
51.4901119045257,7.51038472583366,0.370323457250713
51.4901119045257,7.51757926247058,0.296744631303651
51.4901119045257,7.52477379910749,0.286880257586241
51.4901119045257,7.53196833574441,0.290189949442584
51.4901119045257,7.53916287238132,0.288220245603117
51.4901119045257,7.54635740901824,0.272033810304331
51.4901119045257,7.55355194565516,0.476664866711052
51.4901119045257,7.56074648229207,0.393375298886821
51.4901119045257,7.56794101892899,0.385803261533352
51.4901119045257,7.57513555556591,0.271641536692347
51.4901119045257,7.58233009220282,0.340985022574595
51.4901119045257,7.58952462883974,0.326859426545157
51.4901119045257,7.59671916547666,0.266285370174359
51.4946453485586,7.32332677327383,0.298659582784952
51.4946453485586,7.33052130991075,0.290035638299458
51.4946453485586,7.34491038318458,0.298916201290417
51.4946453485586,7.3521049198215,0.571854456213163
51.4946453485586,7.35929945645842,0.376874861827645
51.4946453485586,7.36649399309533,0.339724432280767
51.4946453485586,7.37368852973225,0.269761516573019
51.4946453485586,7.38088306636916,0.316582202942699
51.4946453485586,7.38807760300608,0.238777916920273
51.4946453485586,7.395272139643,0.281420982676293
51.4946453485586,7.40246667627991,0.311348094705185
51.4946453485586,7.40966121291683,0.421879435612347
51.4946453485586,7.41685574955375,0.612076675623849
51.4946453485586,7.42405028619066,0.388788995235681
51.4946453485586,7.43124482282758,0.519969395514203
51.4946453485586,7.4384393594645,0.364040429106345
51.4946453485586,7.44563389610141,0.42096971670583
51.4946453485586,7.45282843273833,0.515865496628165
51.4946453485586,7.46002296937524,0.337189626793535
51.4946453485586,7.46721750601216,0.250011654558391
51.4946453485586,7.47441204264908,0.456600505190168
51.4946453485586,7.48160657928599,0.590560036585756
51.4946453485586,7.48880111592291,0.419221614889234
51.4946453485586,7.49599565255983,0.523114121222319
51.4946453485586,7.50319018919674,0.400852841314297
51.4946453485586,7.51038472583366,0.435371538112102
51.4946453485586,7.51757926247058,0.212565065515219
51.4946453485586,7.52477379910749,0.226492720437796
51.4946453485586,7.53196833574441,0.243452071474565
51.4946453485586,7.53916287238132,0.277084643068273
51.4946453485586,7.54635740901824,0.336947112878247
51.4946453485586,7.55355194565516,0.554812880039389
51.4946453485586,7.56074648229207,0.640789687848981
51.4946453485586,7.56794101892899,0.266212198338999
51.4946453485586,7.57513555556591,0.340070935517195
51.4946453485586,7.58233009220282,0.294323936298096
51.4946453485586,7.58952462883974,0.437161521449334
51.4946453485586,7.59671916547666,0.228643123591484
51.4991787925915,7.32332677327383,0.428870217147686
51.4991787925915,7.33052130991075,0.476747629939313
51.4991787925915,7.33771584654767,0.642759669343649
51.4991787925915,7.34491038318458,0.422017278436243
51.4991787925915,7.3521049198215,0.507757617984948
51.4991787925915,7.35929945645842,0.488091728244482
51.4991787925915,7.36649399309533,0.3789285581012
51.4991787925915,7.37368852973225,0.355237168511797
51.4991787925915,7.38088306636916,0.33069699416691
51.4991787925915,7.38807760300608,0.259199978263454
51.4991787925915,7.395272139643,0.29302690625629
51.4991787925915,7.40246667627991,0.386585691125275
51.4991787925915,7.40966121291683,0.486211508617884
51.4991787925915,7.41685574955375,0.409614447798307
51.4991787925915,7.42405028619066,0.438917679904529
51.4991787925915,7.43124482282758,0.34811742792719
51.4991787925915,7.4384393594645,0.339816298407487
51.4991787925915,7.44563389610141,0.406494315597913
51.4991787925915,7.45282843273833,0.66197820398413
51.4991787925915,7.46002296937524,0.531824895084469
51.4991787925915,7.46721750601216,0.427183965953272
51.4991787925915,7.47441204264908,0.49147034665486
51.4991787925915,7.48160657928599,0.642876277863964
51.4991787925915,7.48880111592291,0.416073040881951
51.4991787925915,7.49599565255983,0.516605789670834
51.4991787925915,7.50319018919674,0.378282361592621
51.4991787925915,7.51038472583366,0.368318778633347
51.4991787925915,7.51757926247058,0.309805420360607
51.4991787925915,7.52477379910749,0.364294619186413
51.4991787925915,7.53196833574441,0.28824688880681
51.4991787925915,7.53916287238132,0.329194042379084
51.4991787925915,7.54635740901824,0.365033472407223
51.4991787925915,7.55355194565516,0.30656474965486
51.4991787925915,7.56074648229207,0.291521383355663
51.4991787925915,7.56794101892899,0.27063025834687
51.4991787925915,7.57513555556591,0.304749627879064
51.4991787925915,7.58233009220282,0.344278883934925
51.4991787925915,7.58952462883974,0.424955406044057
51.4991787925915,7.59671916547666,0.284886140882112
51.5037122366243,7.3089377,0.285911643545304
51.5037122366243,7.32332677327383,0.459218918044862
51.5037122366243,7.33052130991075,0.443210260509935
51.5037122366243,7.33771584654767,0.465711781010532
51.5037122366243,7.34491038318458,0.286328060261384
51.5037122366243,7.3521049198215,0.362888806491168
51.5037122366243,7.35929945645842,0.342474480424338
51.5037122366243,7.36649399309533,0.279232569258415
51.5037122366243,7.37368852973225,0.329220366375411
51.5037122366243,7.38088306636916,0.27320189784908
51.5037122366243,7.38807760300608,0.282820142965871
51.5037122366243,7.395272139643,0.378840208502977
51.5037122366243,7.40246667627991,0.441671744804837
51.5037122366243,7.40966121291683,0.495593554804
51.5037122366243,7.41685574955375,0.359652410492883
51.5037122366243,7.42405028619066,0.289580629899673
51.5037122366243,7.43124482282758,0.286037541436251
51.5037122366243,7.4384393594645,0.570925438670078
51.5037122366243,7.44563389610141,0.596719994576524
51.5037122366243,7.45282843273833,0.70820457731647
51.5037122366243,7.46002296937524,0.662342683162786
51.5037122366243,7.46721750601216,0.607402141679335
51.5037122366243,7.47441204264908,0.8129269272689
51.5037122366243,7.48160657928599,0.406431469169419
51.5037122366243,7.48880111592291,0.402324074412904
51.5037122366243,7.49599565255983,0.456688638180003
51.5037122366243,7.50319018919674,0.415100949400703
51.5037122366243,7.51038472583366,0.306392447585227
51.5037122366243,7.51757926247058,0.307857942776813
51.5037122366243,7.52477379910749,0.448060226569849
51.5037122366243,7.53196833574441,0.413206670585726
51.5037122366243,7.53916287238132,0.332817275768863
51.5037122366243,7.54635740901824,0.372229972114679
51.5037122366243,7.55355194565516,0.274364217862892
51.5037122366243,7.56074648229207,0.276754214141997
51.5037122366243,7.56794101892899,0.31487337992201
51.5037122366243,7.57513555556591,0.263400655481303
51.5037122366243,7.58233009220282,0.284281503813643
51.5037122366243,7.58952462883974,0.333113567840464
51.5037122366243,7.59671916547666,0.24568061048055
51.5082456806572,7.3089377,0.2597232817052
51.5082456806572,7.31613223663692,0.332870679409369
51.5082456806572,7.32332677327383,0.314221841605454
51.5082456806572,7.33052130991075,0.364571257258147
51.5082456806572,7.33771584654767,0.428993798120471
51.5082456806572,7.34491038318458,0.362916244375526
51.5082456806572,7.3521049198215,0.301082859549517
51.5082456806572,7.35929945645842,0.259199978263454
51.5082456806572,7.36649399309533,0.267861360161349
51.5082456806572,7.37368852973225,0.475478285778541
51.5082456806572,7.38088306636916,0.717077463231424
51.5082456806572,7.38807760300608,0.327309312076783
51.5082456806572,7.395272139643,0.2570962161298
51.5082456806572,7.40246667627991,0.295359114427937
51.5082456806572,7.40966121291683,0.387961198418769
51.5082456806572,7.41685574955375,0.376728602342379
51.5082456806572,7.42405028619066,0.267268632922073
51.5082456806572,7.43124482282758,0.275876906809141
51.5082456806572,7.4384393594645,0.42102456850691
51.5082456806572,7.44563389610141,0.690024137369082
51.5082456806572,7.45282843273833,0.712749034773947
51.5082456806572,7.46002296937524,0.616741956871205
51.5082456806572,7.46721750601216,0.660169297057042
51.5082456806572,7.47441204264908,0.594997886757603
51.5082456806572,7.48160657928599,0.397581411025897
51.5082456806572,7.48880111592291,0.506652350575924
51.5082456806572,7.49599565255983,0.405639524595629
51.5082456806572,7.50319018919674,0.466680685571045
51.5082456806572,7.51038472583366,0.416243707337235
51.5082456806572,7.51757926247058,0.458529534450622
51.5082456806572,7.52477379910749,0.34190082062035
51.5082456806572,7.53196833574441,0.386060050403103
51.5082456806572,7.53916287238132,0.281063264171639
51.5082456806572,7.54635740901824,0.248636546158405
51.5082456806572,7.55355194565516,0.332963594253113
51.5082456806572,7.56074648229207,0.293757640677943
51.5082456806572,7.56794101892899,0.275093268139041
51.5082456806572,7.57513555556591,0.254533153712189
51.5082456806572,7.58233009220282,0.259199978263454
51.5082456806572,7.58952462883974,0.237296526438133
51.5082456806572,7.59671916547666,0.246516822103835
51.51277912469,7.3089377,0.364435181243879
51.51277912469,7.31613223663692,0.36464235641161
51.51277912469,7.32332677327383,0.440338017762586
51.51277912469,7.33052130991075,0.280860399242854
51.51277912469,7.33771584654767,0.259199978263454
51.51277912469,7.34491038318458,0.290179644053836
51.51277912469,7.3521049198215,0.349196994617186
51.51277912469,7.35929945645842,0.259199978263454
51.51277912469,7.36649399309533,0.30837127184457
51.51277912469,7.37368852973225,0.253799417370616
51.51277912469,7.38088306636916,0.47418493871973
51.51277912469,7.38807760300608,0.242648176025901
51.51277912469,7.395272139643,0.259199978263454
51.51277912469,7.40246667627991,0.259199978263454
51.51277912469,7.40966121291683,0.3463448966155
51.51277912469,7.41685574955375,0.49720560899708
51.51277912469,7.42405028619066,0.823419469938384
51.51277912469,7.43124482282758,0.343793377707166
51.51277912469,7.4384393594645,0.4897007584882
51.51277912469,7.44563389610141,0.715675366983093
51.51277912469,7.45282843273833,0.830041520682239
51.51277912469,7.46002296937524,0.728432984728294
51.51277912469,7.46721750601216,0.764346501631275
51.51277912469,7.47441204264908,0.822914176325076
51.51277912469,7.48160657928599,0.608249109002792
51.51277912469,7.48880111592291,0.770528794720455
51.51277912469,7.49599565255983,0.657222587993919
51.51277912469,7.50319018919674,0.650804435303518
51.51277912469,7.51038472583366,0.509965763465857
51.51277912469,7.51757926247058,0.335156864726561
51.51277912469,7.52477379910749,0.296601413407183
51.51277912469,7.53196833574441,0.414858404377533
51.51277912469,7.53916287238132,0.374138811716036
51.51277912469,7.54635740901824,0.276944657648144
51.51277912469,7.55355194565516,0.397674304633843
51.51277912469,7.56074648229207,0.584110526151478
51.51277912469,7.56794101892899,0.297927865110701
51.51277912469,7.57513555556591,0.259199978263454
51.51277912469,7.58233009220282,0.259199978263454
51.51277912469,7.58952462883974,0.259199978263454
51.51277912469,7.59671916547666,0.259199978263454
51.51277912469,7.60391370211357,0.259199978263454
51.5173125687229,7.3089377,0.269164871236354
51.5173125687229,7.31613223663692,0.286329607482045
51.5173125687229,7.32332677327383,0.519328963721788
51.5173125687229,7.33052130991075,0.396965017831059
51.5173125687229,7.33771584654767,0.443245621793953
51.5173125687229,7.34491038318458,0.345241658174129
51.5173125687229,7.3521049198215,0.364564293823588
51.5173125687229,7.35929945645842,0.357367933996281
51.5173125687229,7.36649399309533,0.383919086934661
51.5173125687229,7.37368852973225,0.193614476259833
51.5173125687229,7.38088306636916,0.239607052955666
51.5173125687229,7.38807760300608,0.254148767090579
51.5173125687229,7.395272139643,0.2514828867572
51.5173125687229,7.40246667627991,0.280285208205213
51.5173125687229,7.40966121291683,0.344420398481148
51.5173125687229,7.41685574955375,0.405260232293859
51.5173125687229,7.42405028619066,0.379378048606365
51.5173125687229,7.43124482282758,0.287571390135922
51.5173125687229,7.4384393594645,0.289733764306533
51.5173125687229,7.44563389610141,0.521092155309453
51.5173125687229,7.45282843273833,0.525460643724532
51.5173125687229,7.46002296937524,0.815540057256422
51.5173125687229,7.46721750601216,0.786003184420741
51.5173125687229,7.47441204264908,0.583590232468301
51.5173125687229,7.48160657928599,0.347484650268618
51.5173125687229,7.48880111592291,0.425476495114086
51.5173125687229,7.49599565255983,0.425268940176774
51.5173125687229,7.50319018919674,0.624328591383715
51.5173125687229,7.51038472583366,0.66644636752388
51.5173125687229,7.51757926247058,0.48424402213624
51.5173125687229,7.52477379910749,0.517503309321607
51.5173125687229,7.53196833574441,0.36251892498533
51.5173125687229,7.53916287238132,0.278130920127404
51.5173125687229,7.54635740901824,0.254213455957383
51.5173125687229,7.55355194565516,0.268316318460554
51.5173125687229,7.56074648229207,0.417860666417002
51.5173125687229,7.56794101892899,0.337889604492195
51.5173125687229,7.57513555556591,0.259199978263454
51.5173125687229,7.58233009220282,0.259199978263454
51.5173125687229,7.58952462883974,0.26401685775248
51.5173125687229,7.59671916547666,0.267358688573623
51.5173125687229,7.60391370211357,0.259199978263454
51.5173125687229,7.61110823875049,0.259199978263454
51.5218460127558,7.31613223663692,0.30925102701405
51.5218460127558,7.32332677327383,0.658516618076395
51.5218460127558,7.33052130991075,0.383168028349195
51.5218460127558,7.34491038318458,0.259199978263454
51.5218460127558,7.3521049198215,0.241512813755989
51.5218460127558,7.35929945645842,0.263647934993162
51.5218460127558,7.36649399309533,0.391965172720625
51.5218460127558,7.37368852973225,0.482701698920988
51.5218460127558,7.38088306636916,0.343688258123298
51.5218460127558,7.38807760300608,0.267252258424112
51.5218460127558,7.395272139643,0.244120838572354
51.5218460127558,7.40246667627991,0.314453598639828
51.5218460127558,7.40966121291683,0.242977809089092
51.5218460127558,7.41685574955375,0.338606978250298
51.5218460127558,7.42405028619066,0.287739752729667
51.5218460127558,7.43124482282758,0.259199978263454
51.5218460127558,7.4384393594645,0.276144070805669
51.5218460127558,7.44563389610141,0.678546524562376
51.5218460127558,7.45282843273833,0.644997770273546
51.5218460127558,7.46002296937524,0.472241670837109
51.5218460127558,7.46721750601216,0.624374016854852
51.5218460127558,7.47441204264908,0.527882617726018
51.5218460127558,7.48160657928599,0.479332748918437
51.5218460127558,7.48880111592291,0.271092230653325
51.5218460127558,7.49599565255983,0.340970253425254
51.5218460127558,7.50319018919674,0.489656327303701
51.5218460127558,7.51038472583366,0.27304886327086
51.5218460127558,7.51757926247058,0.597440893611292
51.5218460127558,7.52477379910749,0.521729812973803
51.5218460127558,7.53196833574441,0.577931427252762
51.5218460127558,7.53916287238132,0.472202464993396
51.5218460127558,7.54635740901824,0.517006513718746
51.5218460127558,7.55355194565516,0.331616589515387
51.5218460127558,7.56074648229207,0.346529244045732
51.5218460127558,7.56794101892899,0.319687246941305
51.5218460127558,7.57513555556591,0.259199978263454
51.5218460127558,7.58233009220282,0.250679944817012
51.5218460127558,7.58952462883974,0.323216655032687
51.5218460127558,7.59671916547666,0.343310737251115
51.5218460127558,7.60391370211357,0.259199978263454
51.5218460127558,7.61110823875049,0.259199978263454
51.5218460127558,7.6183027753874,0.25782714256766
51.5218460127558,7.62549731202432,0.259199978263454
51.5263794567886,7.35929945645842,0.28081835070941
51.5263794567886,7.36649399309533,0.288098259536802
51.5263794567886,7.37368852973225,0.455570372849045
51.5263794567886,7.38088306636916,0.308523980377861
51.5263794567886,7.38807760300608,0.385306488963808
51.5263794567886,7.395272139643,0.420057896223736
51.5263794567886,7.40246667627991,0.288668729655959
51.5263794567886,7.40966121291683,0.257579725782004
51.5263794567886,7.41685574955375,0.293385290167815
51.5263794567886,7.42405028619066,0.268577459897385
51.5263794567886,7.43124482282758,0.259199978263454
51.5263794567886,7.4384393594645,0.369147105256154
51.5263794567886,7.44563389610141,0.605143134741217
51.5263794567886,7.45282843273833,0.476982903957606
51.5263794567886,7.46002296937524,0.667025410261716
51.5263794567886,7.46721750601216,0.666817538348502
51.5263794567886,7.47441204264908,0.492630201103153
51.5263794567886,7.48160657928599,0.451469167504166
51.5263794567886,7.48880111592291,0.341751790012075
51.5263794567886,7.49599565255983,0.382000058825317
51.5263794567886,7.50319018919674,0.311078951315407
51.5263794567886,7.51038472583366,0.234758177138499
51.5263794567886,7.51757926247058,0.419750543619091
51.5263794567886,7.52477379910749,0.345450964090933
51.5263794567886,7.53196833574441,0.364270516734181
51.5263794567886,7.53916287238132,0.349813589909746
51.5263794567886,7.54635740901824,0.514578821075687
51.5263794567886,7.55355194565516,0.428848527239083
51.5263794567886,7.56074648229207,0.259199978263454
51.5263794567886,7.56794101892899,0.259199978263454
51.5263794567886,7.57513555556591,0.228930558195865
51.5263794567886,7.58233009220282,0.325561980657891
51.5263794567886,7.58952462883974,0.300950062498405
51.5263794567886,7.59671916547666,0.236962975313091
51.5263794567886,7.60391370211357,0.300024862325137
51.5263794567886,7.61110823875049,0.300635660455083
51.5263794567886,7.6183027753874,0.235485247212667
51.5263794567886,7.62549731202432,0.259199978263454
51.5309129008215,7.36649399309533,0.259893155805023
51.5309129008215,7.37368852973225,0.261980656324131
51.5309129008215,7.38088306636916,0.340094664775723
51.5309129008215,7.38807760300608,0.424613120634277
51.5309129008215,7.395272139643,0.340716283157899
51.5309129008215,7.40246667627991,0.331330258651335
51.5309129008215,7.40966121291683,0.396564974380895
51.5309129008215,7.41685574955375,0.468097311607971
51.5309129008215,7.42405028619066,0.216133297522144
51.5309129008215,7.43124482282758,0.238332578753472
51.5309129008215,7.4384393594645,0.270117726937486
51.5309129008215,7.44563389610141,0.42519168915913
51.5309129008215,7.45282843273833,0.612040402588134
51.5309129008215,7.46002296937524,0.416120320256728
51.5309129008215,7.46721750601216,0.449723040740503
51.5309129008215,7.47441204264908,0.527701597300153
51.5309129008215,7.48160657928599,0.32814504612174
51.5309129008215,7.48880111592291,0.254437817646416
51.5309129008215,7.49599565255983,0.266375326225749
51.5309129008215,7.50319018919674,0.259199978263454
51.5309129008215,7.51038472583366,0.259199978263454
51.5309129008215,7.51757926247058,0.281873791915969
51.5309129008215,7.52477379910749,0.238625603997753
51.5309129008215,7.53196833574441,0.258705412512924
51.5309129008215,7.53916287238132,0.330149811767529
51.5309129008215,7.54635740901824,0.391767788830216
51.5309129008215,7.55355194565516,0.326649518019727
51.5309129008215,7.56074648229207,0.263042381397191
51.5309129008215,7.56794101892899,0.259199978263454
51.5309129008215,7.57513555556591,0.255356337021904
51.5309129008215,7.58233009220282,0.342673627461129
51.5309129008215,7.58952462883974,0.318226173601982
51.5309129008215,7.59671916547666,0.327324256099831
51.5309129008215,7.60391370211357,0.469196574256896
51.5309129008215,7.61110823875049,0.515773287987006
51.5309129008215,7.6183027753874,0.499193645429286
51.5309129008215,7.62549731202432,0.2466955990683
51.5354463448543,7.35929945645842,0.267682402939577
51.5354463448543,7.36649399309533,0.274231864665671
51.5354463448543,7.37368852973225,0.259199978263454
51.5354463448543,7.38088306636916,0.28073647618796
51.5354463448543,7.38807760300608,0.305800089699729
51.5354463448543,7.395272139643,0.319258529590224
51.5354463448543,7.40246667627991,0.430733105226292
51.5354463448543,7.40966121291683,0.451558377008186
51.5354463448543,7.41685574955375,0.377270797770588
51.5354463448543,7.42405028619066,0.259199978263454
51.5354463448543,7.43124482282758,0.155692271399576
51.5354463448543,7.4384393594645,0.248932875259438
51.5354463448543,7.44563389610141,0.371553125271104
51.5354463448543,7.45282843273833,0.431666715530644
51.5354463448543,7.46002296937524,0.413982266648068
51.5354463448543,7.46721750601216,0.434729132804843
51.5354463448543,7.47441204264908,0.264111398863813
51.5354463448543,7.48160657928599,0.285686016083413
51.5354463448543,7.48880111592291,0.232683883290051
51.5354463448543,7.49599565255983,0.247196353668436
51.5354463448543,7.50319018919674,0.324571664913406
51.5354463448543,7.51038472583366,0.259199978263454
51.5354463448543,7.51757926247058,0.259199978263454
51.5354463448543,7.52477379910749,0.259199978263454
51.5354463448543,7.53196833574441,0.27941102830704
51.5354463448543,7.53916287238132,0.321119426530214
51.5354463448543,7.54635740901824,0.259315769459008
51.5354463448543,7.55355194565516,0.319044236809256
51.5354463448543,7.56074648229207,0.317105217277495
51.5354463448543,7.56794101892899,0.259199978263454
51.5354463448543,7.57513555556591,0.343253705999447
51.5354463448543,7.58233009220282,0.326860438330291
51.5354463448543,7.58952462883974,0.268963127179641
51.5354463448543,7.59671916547666,0.267486467814603
51.5354463448543,7.60391370211357,0.345048627004068
51.5354463448543,7.61110823875049,0.444520751379544
51.5354463448543,7.6183027753874,0.468442374746583
51.5354463448543,7.62549731202432,0.330484098258272
51.5399797888872,7.3521049198215,0.259199978263454
51.5399797888872,7.35929945645842,0.273244864101471
51.5399797888872,7.36649399309533,0.304587668946533
51.5399797888872,7.37368852973225,0.358432141538474
51.5399797888872,7.38088306636916,0.27119203894589
51.5399797888872,7.38807760300608,0.267946381230773
51.5399797888872,7.395272139643,0.288079409586844
51.5399797888872,7.40246667627991,0.344288731162559
51.5399797888872,7.40966121291683,0.452703347919882
51.5399797888872,7.41685574955375,0.333662387533456
51.5399797888872,7.42405028619066,0.272921126965268
51.5399797888872,7.43124482282758,0.310171747208739
51.5399797888872,7.4384393594645,0.24803957004209
51.5399797888872,7.44563389610141,0.323698051619246
51.5399797888872,7.45282843273833,0.425792971366661
51.5399797888872,7.46002296937524,0.34165164398419
51.5399797888872,7.46721750601216,0.337385039547458
51.5399797888872,7.47441204264908,0.367029762772941
51.5399797888872,7.48160657928599,0.377238714402468
51.5399797888872,7.48880111592291,0.27056748706831
51.5399797888872,7.49599565255983,0.259199978263454
51.5399797888872,7.50319018919674,0.338032455504019
51.5399797888872,7.51038472583366,0.284277949924811
51.5399797888872,7.51757926247058,0.25966574029127
51.5399797888872,7.52477379910749,0.235143595061992
51.5399797888872,7.53196833574441,0.237905679241223
51.5399797888872,7.53916287238132,0.316497095447789
51.5399797888872,7.54635740901824,0.264757213645688
51.5399797888872,7.55355194565516,0.243405001786919
51.5399797888872,7.56074648229207,0.246524843065162
51.5399797888872,7.56794101892899,0.259199978263454
51.5399797888872,7.57513555556591,0.265936228606425
51.5399797888872,7.58233009220282,0.259199978263454
51.5399797888872,7.58952462883974,0.257476074977951
51.5399797888872,7.59671916547666,0.259199978263454
51.5399797888872,7.60391370211357,0.259199978263454
51.5399797888872,7.61110823875049,0.355576291967184
51.5399797888872,7.6183027753874,0.32942470188472
51.5399797888872,7.62549731202432,0.341891048985651
51.54451323292,7.3521049198215,0.259199978263454
51.54451323292,7.35929945645842,0.259199978263454
51.54451323292,7.36649399309533,0.317838281727072
51.54451323292,7.37368852973225,0.625055912694359
51.54451323292,7.38088306636916,0.416271884626187
51.54451323292,7.38807760300608,0.268501680311937
51.54451323292,7.395272139643,0.342688341021118
51.54451323292,7.40246667627991,0.266899824239414
51.54451323292,7.40966121291683,0.289883972149413
51.54451323292,7.41685574955375,0.239963285366167
51.54451323292,7.42405028619066,0.244177534632553
51.54451323292,7.43124482282758,0.339816809921016
51.54451323292,7.4384393594645,0.253492495224506
51.54451323292,7.44563389610141,0.239923933936979
51.54451323292,7.45282843273833,0.148066789957957
51.54451323292,7.46002296937524,0.294474225793939
51.54451323292,7.46721750601216,0.315689190839449
51.54451323292,7.47441204264908,0.30983802524247
51.54451323292,7.48160657928599,0.424892727110746
51.54451323292,7.48880111592291,0.26965194530235
51.54451323292,7.49599565255983,0.259199978263454
51.54451323292,7.50319018919674,0.268579974826096
51.54451323292,7.51038472583366,0.277944518414813
51.54451323292,7.51757926247058,0.287387798533586
51.54451323292,7.52477379910749,0.283964179761671
51.54451323292,7.53196833574441,0.431654949895278
51.54451323292,7.53916287238132,0.431179102525516
51.54451323292,7.54635740901824,0.279188135181063
51.54451323292,7.55355194565516,0.250395295766656
51.54451323292,7.56074648229207,0.234809094623674
51.54451323292,7.56794101892899,0.259199978263454
51.54451323292,7.57513555556591,0.259199978263454
51.54451323292,7.58233009220282,0.259199978263454
51.54451323292,7.58952462883974,0.259199978263454
51.54451323292,7.59671916547666,0.259199978263454
51.54451323292,7.60391370211357,0.259199978263454
51.54451323292,7.61110823875049,0.259199978263454
51.54451323292,7.6183027753874,0.259021920821544
51.54451323292,7.62549731202432,0.301728691363373
51.5490466769529,7.35929945645842,0.268947329642902
51.5490466769529,7.36649399309533,0.203689616779156
51.5490466769529,7.37368852973225,0.35513942258477
51.5490466769529,7.38088306636916,0.433036592095623
51.5490466769529,7.38807760300608,0.479934947616188
51.5490466769529,7.395272139643,0.316444540147804
51.5490466769529,7.40246667627991,0.291828572726635
51.5490466769529,7.40966121291683,0.302128221281763
51.5490466769529,7.41685574955375,0.256345450709443
51.5490466769529,7.42405028619066,0.254198284224757
51.5490466769529,7.43124482282758,0.283435216456244
51.5490466769529,7.4384393594645,0.259199978263454
51.5490466769529,7.44563389610141,0.280481873413897
51.5490466769529,7.45282843273833,0.294406201331571
51.5490466769529,7.46002296937524,0.456521375117819
51.5490466769529,7.46721750601216,0.510212279869658
51.5490466769529,7.47441204264908,0.422578740099051
51.5490466769529,7.48160657928599,0.420496541799288
51.5490466769529,7.48880111592291,0.252811769384076
51.5490466769529,7.49599565255983,0.322044916129821
51.5490466769529,7.50319018919674,0.274795392925608
51.5490466769529,7.51038472583366,0.274306523938624
51.5490466769529,7.51757926247058,0.259534989551417
51.5490466769529,7.52477379910749,0.276119374506927
51.5490466769529,7.53196833574441,0.293658111280677
51.5490466769529,7.53916287238132,0.264913250469077
51.5490466769529,7.54635740901824,0.404766186164836
51.5490466769529,7.55355194565516,0.259199978263454
51.5490466769529,7.56074648229207,0.259199978263454
51.5490466769529,7.56794101892899,0.259199978263454
51.5490466769529,7.57513555556591,0.259199978263454
51.5490466769529,7.58233009220282,0.259199978263454
51.5490466769529,7.58952462883974,0.259199978263454
51.5490466769529,7.59671916547666,0.259199978263454
51.5490466769529,7.60391370211357,0.283422267118966
51.5490466769529,7.61110823875049,0.259199978263454
51.5490466769529,7.6183027753874,0.259199978263454
51.5490466769529,7.62549731202432,0.259199978263454
51.5535801209858,7.3521049198215,0.259199978263454
51.5535801209858,7.35929945645842,0.395362763133378
51.5535801209858,7.36649399309533,0.208387455843825
51.5535801209858,7.37368852973225,0.288895017190037
51.5535801209858,7.38088306636916,0.377540347962034
51.5535801209858,7.38807760300608,0.393563343176518
51.5535801209858,7.395272139643,0.27331544357252
51.5535801209858,7.40246667627991,0.248054435201277
51.5535801209858,7.40966121291683,0.251944774271633
51.5535801209858,7.41685574955375,0.251443268875944
51.5535801209858,7.42405028619066,0.260349115970939
51.5535801209858,7.43124482282758,0.259199978263454
51.5535801209858,7.4384393594645,0.285175095854598
51.5535801209858,7.44563389610141,0.322264966532139
51.5535801209858,7.45282843273833,0.393370321792343
51.5535801209858,7.46002296937524,0.344143095555495
51.5535801209858,7.46721750601216,0.383825048508407
51.5535801209858,7.47441204264908,0.396090753045277
51.5535801209858,7.48160657928599,0.404299718833404
51.5535801209858,7.48880111592291,0.376508908269403
51.5535801209858,7.49599565255983,0.378754296061069
51.5535801209858,7.50319018919674,0.258884279189756
51.5535801209858,7.51038472583366,0.27218726582605
51.5535801209858,7.51757926247058,0.259199978263454
51.5535801209858,7.52477379910749,0.26142347114367
51.5535801209858,7.53196833574441,0.343796748180244
51.5535801209858,7.53916287238132,0.34317357074723
51.5535801209858,7.54635740901824,0.432114072057988
51.5535801209858,7.55355194565516,0.293212097901428
51.5535801209858,7.56074648229207,0.259199978263454
51.5535801209858,7.56794101892899,0.259199978263454
51.5535801209858,7.57513555556591,0.259199978263454
51.5535801209858,7.58233009220282,0.271119492112153
51.5535801209858,7.58952462883974,0.287575117007163
51.5535801209858,7.59671916547666,0.326352135868903
51.5535801209858,7.60391370211357,0.356115475488121
51.5581135650186,7.35929945645842,0.267628491592754
51.5581135650186,7.36649399309533,0.263514692902781
51.5581135650186,7.37368852973225,0.27957379992691
51.5581135650186,7.38088306636916,0.446138371693515
51.5581135650186,7.38807760300608,0.427969370288322
51.5581135650186,7.395272139643,0.324008064415827
51.5581135650186,7.40246667627991,0.247490326555312
51.5581135650186,7.40966121291683,0.252058649558906
51.5581135650186,7.41685574955375,0.251560387036615
51.5581135650186,7.42405028619066,0.259199978263454
51.5581135650186,7.43124482282758,0.259199978263454
51.5581135650186,7.4384393594645,0.259199978263454
51.5581135650186,7.44563389610141,0.311085852191753
51.5581135650186,7.45282843273833,0.320437273883938
51.5581135650186,7.46002296937524,0.308990584234826
51.5581135650186,7.46721750601216,0.38095295634502
51.5581135650186,7.47441204264908,0.389499982296425
51.5581135650186,7.48160657928599,0.279320979759067
51.5581135650186,7.48880111592291,0.254447670762778
51.5581135650186,7.49599565255983,0.298075623006231
51.5581135650186,7.50319018919674,0.322567685835796
51.5581135650186,7.51038472583366,0.304188779378785
51.5581135650186,7.51757926247058,0.332507846948109
51.5581135650186,7.52477379910749,0.259199978263454
51.5581135650186,7.53196833574441,0.289567536027397
51.5581135650186,7.53916287238132,0.47801452438484
51.5581135650186,7.54635740901824,0.42912396037894
51.5581135650186,7.55355194565516,0.371917656103593
51.5581135650186,7.56074648229207,0.259199978263454
51.5581135650186,7.56794101892899,0.259199978263454
51.5581135650186,7.57513555556591,0.273507469879177
51.5581135650186,7.58233009220282,0.278973791229281
51.5581135650186,7.58952462883974,0.268904353275419
51.5581135650186,7.59671916547666,0.402951159094518
51.5581135650186,7.60391370211357,0.282556826588987
51.5626470090515,7.3521049198215,0.259199978263454
51.5626470090515,7.35929945645842,0.287369276380917
51.5626470090515,7.36649399309533,0.509955421101921
51.5626470090515,7.37368852973225,0.507733394988978
51.5626470090515,7.38088306636916,0.51771392524026
51.5626470090515,7.38807760300608,0.373878800103699
51.5626470090515,7.395272139643,0.391214260757674
51.5626470090515,7.40246667627991,0.256084889766895
51.5626470090515,7.40966121291683,0.274585753894991
51.5626470090515,7.41685574955375,0.333629972178177
51.5626470090515,7.42405028619066,0.257611277128108
51.5626470090515,7.43124482282758,0.259199978263454
51.5626470090515,7.4384393594645,0.259199978263454
51.5626470090515,7.44563389610141,0.264839736187199
51.5626470090515,7.45282843273833,0.322666922681491
51.5626470090515,7.46002296937524,0.283820965230624
51.5626470090515,7.46721750601216,0.307814838118067
51.5626470090515,7.47441204264908,0.259199978263454
51.5626470090515,7.48160657928599,0.287622962190348
51.5626470090515,7.48880111592291,0.271907706413842
51.5626470090515,7.49599565255983,0.277732176610003
51.5626470090515,7.50319018919674,0.281323250126931
51.5626470090515,7.51038472583366,0.259199978263454
51.5626470090515,7.51757926247058,0.322690791055117
51.5626470090515,7.52477379910749,0.3082658458591
51.5626470090515,7.53196833574441,0.364157521558536
51.5626470090515,7.53916287238132,0.259199978263454
51.5626470090515,7.54635740901824,0.259018981137206
51.5626470090515,7.55355194565516,0.267253684419578
51.5626470090515,7.56074648229207,0.259199978263454
51.5626470090515,7.56794101892899,0.259199978263454
51.5626470090515,7.57513555556591,0.272416196265915
51.5626470090515,7.58233009220282,0.282746994735766
51.5626470090515,7.58952462883974,0.258232380866506
51.5626470090515,7.59671916547666,0.331220858268272
51.5626470090515,7.60391370211357,0.262086357272593
51.5671804530843,7.3521049198215,0.259199978263454
51.5671804530843,7.35929945645842,0.327957768923421
51.5671804530843,7.36649399309533,0.476081349412324
51.5671804530843,7.37368852973225,0.43236272811678
51.5671804530843,7.38088306636916,0.530758348122232
51.5671804530843,7.38807760300608,0.535352283865652
51.5671804530843,7.395272139643,0.316110828477239
51.5671804530843,7.40246667627991,0.259199978263454
51.5671804530843,7.40966121291683,0.259199978263454
51.5671804530843,7.41685574955375,0.258455057899725
51.5671804530843,7.42405028619066,0.259199978263454
51.5671804530843,7.43124482282758,0.259199978263454
51.5671804530843,7.4384393594645,0.259199978263454
51.5671804530843,7.44563389610141,0.259199978263454
51.5671804530843,7.45282843273833,0.259199978263454
51.5671804530843,7.46002296937524,0.267244026840581
51.5671804530843,7.46721750601216,0.257177084550799
51.5671804530843,7.47441204264908,0.292023579943708
51.5671804530843,7.48160657928599,0.259199978263454
51.5671804530843,7.48880111592291,0.259199978263454
51.5671804530843,7.49599565255983,0.259199978263454
51.5671804530843,7.50319018919674,0.259199978263454
51.5671804530843,7.51038472583366,0.268149159711751
51.5671804530843,7.51757926247058,0.385904688479458
51.5671804530843,7.52477379910749,0.309427568221744
51.5671804530843,7.53196833574441,0.24639673816717
51.5671804530843,7.53916287238132,0.259199978263454
51.5671804530843,7.54635740901824,0.259199978263454
51.5671804530843,7.55355194565516,0.259199978263454
51.5671804530843,7.56074648229207,0.259199978263454
51.5671804530843,7.56794101892899,0.26429030353189
51.5671804530843,7.57513555556591,0.312442693377321
51.5671804530843,7.58233009220282,0.316979993457234
51.5671804530843,7.58952462883974,0.259199978263454
51.5671804530843,7.60391370211357,0.259199978263454
51.5717138971172,7.34491038318458,0.259199978263454
51.5717138971172,7.3521049198215,0.259199978263454
51.5717138971172,7.35929945645842,0.26211753687629
51.5717138971172,7.36649399309533,0.374852066409364
51.5717138971172,7.37368852973225,0.361614402885061
51.5717138971172,7.38088306636916,0.770749184795605
51.5717138971172,7.38807760300608,0.380090015242933
51.5717138971172,7.395272139643,0.308150211106876
51.5717138971172,7.40246667627991,0.309436459042534
51.5717138971172,7.40966121291683,0.25981825641394
51.5717138971172,7.41685574955375,0.259199978263454
51.5717138971172,7.42405028619066,0.259199978263454
51.5717138971172,7.43124482282758,0.259199978263454
51.5717138971172,7.4384393594645,0.259199978263454
51.5717138971172,7.44563389610141,0.259199978263454
51.5717138971172,7.45282843273833,0.264846029328864
51.5717138971172,7.46002296937524,0.314945370270013
51.5717138971172,7.46721750601216,0.232304863143597
51.5717138971172,7.47441204264908,0.340372355555757
51.5717138971172,7.48160657928599,0.259199978263454
51.5717138971172,7.48880111592291,0.259199978263454
51.5717138971172,7.49599565255983,0.259199978263454
51.5717138971172,7.50319018919674,0.301440438307774
51.5717138971172,7.51038472583366,0.259199978263454
51.5717138971172,7.51757926247058,0.307628866289331
51.5717138971172,7.52477379910749,0.293980319820339
51.5717138971172,7.53196833574441,0.259199978263454
51.5717138971172,7.53916287238132,0.259199978263454
51.5717138971172,7.54635740901824,0.259199978263454
51.5717138971172,7.55355194565516,0.259199978263454
51.5717138971172,7.56074648229207,0.260142148763325
51.5717138971172,7.56794101892899,0.269528379544661
51.5717138971172,7.57513555556591,0.259824343689652
51.5717138971172,7.58233009220282,0.259199978263454
51.5717138971172,7.58952462883974,0.259199978263454
51.5762473411501,7.34491038318458,0.259199978263454
51.5762473411501,7.3521049198215,0.259199978263454
51.5762473411501,7.35929945645842,0.259199978263454
51.5762473411501,7.36649399309533,0.269245488542776
51.5762473411501,7.37368852973225,0.28047853107463
51.5762473411501,7.38088306636916,0.434991923920656
51.5762473411501,7.38807760300608,0.312333986084741
51.5762473411501,7.395272139643,0.379250223174285
51.5762473411501,7.40246667627991,0.38796241973705
51.5762473411501,7.40966121291683,0.27462726462695
51.5762473411501,7.41685574955375,0.259199978263454
51.5762473411501,7.42405028619066,0.259199978263454
51.5762473411501,7.43124482282758,0.259199978263454
51.5762473411501,7.4384393594645,0.259199978263454
51.5762473411501,7.44563389610141,0.259199978263454
51.5762473411501,7.45282843273833,0.294650657042358
51.5762473411501,7.46002296937524,0.451224981603635
51.5762473411501,7.46721750601216,0.26628078388189
51.5762473411501,7.47441204264908,0.259199978263454
51.5762473411501,7.48160657928599,0.259199978263454
51.5762473411501,7.48880111592291,0.259199978263454
51.5762473411501,7.49599565255983,0.267731060371718
51.5762473411501,7.50319018919674,0.341283265657002
51.5762473411501,7.51038472583366,0.259199978263454
51.5762473411501,7.51757926247058,0.444474042402431
51.5762473411501,7.52477379910749,0.331267142563731
51.5762473411501,7.53196833574441,0.259199978263454
51.5762473411501,7.53916287238132,0.259199978263454
51.5762473411501,7.54635740901824,0.259199978263454
51.5762473411501,7.55355194565516,0.259199978263454
51.5762473411501,7.56074648229207,0.358576334350848
51.5762473411501,7.56794101892899,0.251651417451476
51.5762473411501,7.57513555556591,0.244942737574755
51.5762473411501,7.58233009220282,0.259199978263454
51.5762473411501,7.58952462883974,0.259199978263454
51.5762473411501,7.59671916547666,0.259199978263454
51.5807807851829,7.3521049198215,0.259199978263454
51.5807807851829,7.35929945645842,0.259199978263454
51.5807807851829,7.36649399309533,0.259199978263454
51.5807807851829,7.37368852973225,0.256796208656308
51.5807807851829,7.38088306636916,0.278685334449921
51.5807807851829,7.38807760300608,0.204907402318022
51.5807807851829,7.395272139643,0.252569825705218
51.5807807851829,7.40246667627991,0.245890547515046
51.5807807851829,7.40966121291683,0.259199978263454
51.5807807851829,7.41685574955375,0.259199978263454
51.5807807851829,7.42405028619066,0.259199978263454
51.5807807851829,7.43124482282758,0.259199978263454
51.5807807851829,7.4384393594645,0.259199978263454
51.5807807851829,7.44563389610141,0.259199978263454
51.5807807851829,7.45282843273833,0.282908498890421
51.5807807851829,7.46002296937524,0.45908191498918
51.5807807851829,7.46721750601216,0.348092753378901
51.5807807851829,7.47441204264908,0.26018552880084
51.5807807851829,7.48160657928599,0.259199978263454
51.5807807851829,7.48880111592291,0.259199978263454
51.5807807851829,7.49599565255983,0.259199978263454
51.5807807851829,7.54635740901824,0.259199978263454
51.5807807851829,7.55355194565516,0.257838424496342
51.5807807851829,7.56074648229207,0.419156842945704
51.5807807851829,7.56794101892899,0.368497400409465
51.5807807851829,7.57513555556591,0.259199978263454
51.5807807851829,7.58233009220282,0.259199978263454
51.5807807851829,7.58952462883974,0.259199978263454
51.5853142292158,7.37368852973225,0.259199978263454
51.5853142292158,7.38088306636916,0.253696306023438
51.5853142292158,7.38807760300608,0.259199978263454
51.5853142292158,7.395272139643,0.237143899799812
51.5853142292158,7.40246667627991,0.207226899761086
51.5853142292158,7.40966121291683,0.259199978263454
51.5853142292158,7.41685574955375,0.259199978263454
51.5853142292158,7.42405028619066,0.259199978263454
51.5853142292158,7.46721750601216,0.287709101784681
51.5853142292158,7.47441204264908,0.274576922343009
51.5853142292158,7.48160657928599,0.258881181758259
51.5853142292158,7.48880111592291,0.253927683787172
51.5853142292158,7.49599565255983,0.259199978263454
51.5853142292158,7.50319018919674,0.259199978263454
51.5853142292158,7.56794101892899,0.259199978263454
51.5898476732486,7.37368852973225,0.259199978263454
51.5898476732486,7.40246667627991,0.256539931755701
51.5898476732486,7.40966121291683,0.259199978263454
51.5898476732486,7.41685574955375,0.259199978263454
51.5898476732486,7.47441204264908,0.259199978263454
51.5898476732486,7.48160657928599,0.248057753956808
51.5898476732486,7.48880111592291,0.233631468360762
51.5898476732486,7.49599565255983,0.259199978263454
