51.1236896,6.99803219186449,0.243240875960627
51.1236896,7.00522673023739,0.259199978263454
51.1236896,7.12033934420377,0.259199978263454
51.1236896,7.12753388257667,0.259199978263454
51.1236896,7.13472842094957,0.259199978263454
51.1236896,7.14192295932247,0.259199978263454
51.1236896,7.14911749769537,0.259199978263454
51.1282196094458,6.99803219186449,0.214977060983344
51.1282196094458,7.00522673023739,0.284657162943684
51.1282196094458,7.01242126861029,0.259199978263454
51.1282196094458,7.01961580698319,0.259199978263454
51.1282196094458,7.05558849884768,0.259199978263454
51.1282196094458,7.06278303722058,0.284833664198846
51.1282196094458,7.06997757559348,0.286676996107523
51.1282196094458,7.07717211396638,0.270354648403519
51.1282196094458,7.12033934420377,0.259199978263454
51.1282196094458,7.12753388257667,0.259199978263454
51.1282196094458,7.13472842094957,0.259199978263454
51.1282196094458,7.14192295932247,0.259199978263454
51.1282196094458,7.14911749769537,0.301800451874072
51.1327496188917,6.99803219186449,0.213719829436463
51.1327496188917,7.00522673023739,0.306815652677406
51.1327496188917,7.01242126861029,0.260873141274817
51.1327496188917,7.01961580698319,0.264647027213419
51.1327496188917,7.02681034535609,0.298630518772318
51.1327496188917,7.03400488372899,0.342731923019123
51.1327496188917,7.04119942210189,0.259199978263454
51.1327496188917,7.04839396047478,0.259199978263454
51.1327496188917,7.05558849884768,0.259199978263454
51.1327496188917,7.06278303722058,0.260794056942511
51.1327496188917,7.06997757559348,0.259545422114874
51.1327496188917,7.12033934420377,0.355763998717988
51.1327496188917,7.12753388257667,0.262496817453029
51.1327496188917,7.13472842094957,0.260588280962891
51.1327496188917,7.14192295932247,0.259199978263454
51.1327496188917,7.14911749769537,0.261090652061481
51.1372796283375,7.00522673023739,0.236280550643548
51.1372796283375,7.01242126861029,0.294681859505854
51.1372796283375,7.01961580698319,0.307404814591603
51.1372796283375,7.02681034535609,0.289478069675429
51.1372796283375,7.03400488372899,0.259199978263454
51.1372796283375,7.04119942210189,0.259199978263454
51.1372796283375,7.04839396047478,0.259199978263454
51.1372796283375,7.05558849884768,0.259199978263454
51.1372796283375,7.06278303722058,0.389367655430547
51.1372796283375,7.06997757559348,0.355756186988448
51.1372796283375,7.07717211396638,0.259199978263454
51.1372796283375,7.09156119071218,0.250149659433166
51.1372796283375,7.10595026745797,0.285540064236446
51.1372796283375,7.11314480583087,0.322109041508768
51.1372796283375,7.12033934420377,0.352887574848381
51.1372796283375,7.12753388257667,0.303280119965371
51.1372796283375,7.13472842094957,0.259879699415495
51.1372796283375,7.14192295932247,0.282158741492048
51.1372796283375,7.14911749769537,0.340115324969831
51.1418096377833,6.99803219186449,0.259199978263454
51.1418096377833,7.00522673023739,0.244053078838337
51.1418096377833,7.01242126861029,0.392555060453177
51.1418096377833,7.01961580698319,0.381074985165701
51.1418096377833,7.02681034535609,0.271138415476986
51.1418096377833,7.03400488372899,0.264167149712894
51.1418096377833,7.04119942210189,0.259591273892829
51.1418096377833,7.04839396047478,0.259199978263454
51.1418096377833,7.05558849884768,0.259199978263454
51.1418096377833,7.06278303722058,0.323399250138492
51.1418096377833,7.06997757559348,0.355616925684129
51.1418096377833,7.07717211396638,0.287548369947808
51.1418096377833,7.08436665233928,0.259777944870167
51.1418096377833,7.09156119071218,0.249327240484735
51.1418096377833,7.09875572908508,0.253463514123896
51.1418096377833,7.10595026745797,0.259199978263454
51.1418096377833,7.11314480583087,0.297642298947464
51.1418096377833,7.12033934420377,0.28620993537821
51.1418096377833,7.12753388257667,0.267601708055599
51.1418096377833,7.13472842094957,0.259199978263454
51.1418096377833,7.14192295932247,0.260323983013674
51.1418096377833,7.14911749769537,0.26742235441456
51.1463396472292,6.9620595,0.259199978263454
51.1463396472292,6.9836431151187,0.259416199226531
51.1463396472292,6.9908376534916,0.30957668445326
51.1463396472292,6.99803219186449,0.259199978263454
51.1463396472292,7.00522673023739,0.330684044700292
51.1463396472292,7.01242126861029,0.368952411786296
51.1463396472292,7.01961580698319,0.31129690544428
51.1463396472292,7.02681034535609,0.243735537955295
51.1463396472292,7.03400488372899,0.260348801075165
51.1463396472292,7.04119942210189,0.259199978263454
51.1463396472292,7.04839396047478,0.259199978263454
51.1463396472292,7.05558849884768,0.259199978263454
51.1463396472292,7.06278303722058,0.254139136360763
51.1463396472292,7.06997757559348,0.254067449446503
51.1463396472292,7.07717211396638,0.349719401561275
51.1463396472292,7.08436665233928,0.261443377264206
51.1463396472292,7.09156119071218,0.259199978263454
51.1463396472292,7.09875572908508,0.259199978263454
51.1463396472292,7.10595026745797,0.259199978263454
51.1463396472292,7.11314480583087,0.259199978263454
51.1463396472292,7.12033934420377,0.259199978263454
51.1463396472292,7.12753388257667,0.259199978263454
51.1463396472292,7.13472842094957,0.259199978263454
51.150869656675,6.9620595,0.259199978263454
51.150869656675,6.9692540383729,0.318855002909233
51.150869656675,6.9764485767458,0.36709008561816
51.150869656675,6.9836431151187,0.254804418800414
51.150869656675,6.9908376534916,0.348097989541718
51.150869656675,6.99803219186449,0.245671513701604
51.150869656675,7.00522673023739,0.309337983450068
51.150869656675,7.01242126861029,0.421846616457243
51.150869656675,7.01961580698319,0.411326753014911
51.150869656675,7.02681034535609,0.271942606680004
51.150869656675,7.03400488372899,0.270841649734884
51.150869656675,7.04119942210189,0.259199978263454
51.150869656675,7.04839396047478,0.259199978263454
51.150869656675,7.05558849884768,0.178542954126885
51.150869656675,7.06278303722058,0.365584471715487
51.150869656675,7.06997757559348,0.263604856040199
51.150869656675,7.07717211396638,0.432217266172094
51.150869656675,7.08436665233928,0.390958037329195
51.150869656675,7.09156119071218,0.27106805916455
51.150869656675,7.09875572908508,0.259522434212502
51.150869656675,7.10595026745797,0.320411238704663
51.150869656675,7.11314480583087,0.301153516405639
51.150869656675,7.12033934420377,0.255903629972453
51.150869656675,7.12753388257667,0.229078900010025
51.150869656675,7.13472842094957,0.259199978263454
51.1553996661209,6.9620595,0.251924242585345
51.1553996661209,6.9692540383729,0.390168728753478
51.1553996661209,6.9764485767458,0.316098345901489
51.1553996661209,6.9836431151187,0.244177276284658
51.1553996661209,6.9908376534916,0.424497064058691
51.1553996661209,6.99803219186449,0.311979976566057
51.1553996661209,7.00522673023739,0.41765315712791
51.1553996661209,7.01242126861029,0.391609804887058
51.1553996661209,7.01961580698319,0.377622617359131
51.1553996661209,7.02681034535609,0.235303861546735
51.1553996661209,7.03400488372899,0.259199978263454
51.1553996661209,7.04119942210189,0.288824577338686
51.1553996661209,7.04839396047478,0.29620562197244
51.1553996661209,7.05558849884768,0.222602516098418
51.1553996661209,7.06278303722058,0.345443260446549
51.1553996661209,7.06997757559348,0.300815464273616
51.1553996661209,7.07717211396638,0.338523992226598
51.1553996661209,7.08436665233928,0.45578598734774
51.1553996661209,7.09156119071218,0.373141566956093
51.1553996661209,7.09875572908508,0.287601225732549
51.1553996661209,7.10595026745797,0.281180501907039
51.1553996661209,7.11314480583087,0.351077989004824
51.1553996661209,7.12033934420377,0.345291361881224
51.1553996661209,7.12753388257667,0.257267448332713
51.1553996661209,7.13472842094957,0.259199978263454
51.1599296755667,6.9620595,0.211744919659718
51.1599296755667,6.9692540383729,0.226892517643626
51.1599296755667,6.9764485767458,0.222228068629035
51.1599296755667,6.9836431151187,0.221744372489749
51.1599296755667,6.9908376534916,0.360912919431914
51.1599296755667,6.99803219186449,0.58212405191849
51.1599296755667,7.00522673023739,0.515980560842177
51.1599296755667,7.01242126861029,0.550287793113698
51.1599296755667,7.01961580698319,0.455163211961623
51.1599296755667,7.02681034535609,0.259633155342472
51.1599296755667,7.03400488372899,0.305438120865394
51.1599296755667,7.04119942210189,0.279121681654245
51.1599296755667,7.04839396047478,0.301403739160281
51.1599296755667,7.05558849884768,0.326051741354448
51.1599296755667,7.06278303722058,0.266459947551203
51.1599296755667,7.06997757559348,0.288999506927674
51.1599296755667,7.07717211396638,0.627342063519915
51.1599296755667,7.08436665233928,0.563029141399199
51.1599296755667,7.09156119071218,0.313975139108036
51.1599296755667,7.09875572908508,0.461457844884642
51.1599296755667,7.10595026745797,0.482094095647584
51.1599296755667,7.11314480583087,0.331979728544452
51.1599296755667,7.12033934420377,0.302008099212265
51.1599296755667,7.12753388257667,0.259199978263454
51.1644596850125,6.9620595,0.259199978263454
51.1644596850125,6.9692540383729,0.259199978263454
51.1644596850125,6.9764485767458,0.285518522779706
51.1644596850125,6.9836431151187,0.268908803719189
51.1644596850125,6.9908376534916,0.450919405752087
51.1644596850125,6.99803219186449,0.598568130267651
51.1644596850125,7.00522673023739,0.474487432489046
51.1644596850125,7.01242126861029,0.423967350674216
51.1644596850125,7.01961580698319,0.582760474189961
51.1644596850125,7.02681034535609,0.443384854663287
51.1644596850125,7.03400488372899,0.320917270392996
51.1644596850125,7.04119942210189,0.276722337593362
51.1644596850125,7.04839396047478,0.271638170855721
51.1644596850125,7.05558849884768,0.286689757818168
51.1644596850125,7.06278303722058,0.258194699671453
51.1644596850125,7.06997757559348,0.339130532090098
51.1644596850125,7.07717211396638,0.546769691388674
51.1644596850125,7.08436665233928,0.518700993659002
51.1644596850125,7.09156119071218,0.355783602135508
51.1644596850125,7.09875572908508,0.315595246389025
51.1644596850125,7.10595026745797,0.356892789128355
51.1644596850125,7.11314480583087,0.322053511134171
51.1644596850125,7.12033934420377,0.253719636230485
51.1644596850125,7.12753388257667,0.259199978263454
51.1644596850125,7.13472842094957,0.266388415799146
51.1689896944584,6.9908376534916,0.386664628069625
51.1689896944584,6.99803219186449,0.365155164913914
51.1689896944584,7.00522673023739,0.421653777737751
51.1689896944584,7.01242126861029,0.361882984343764
51.1689896944584,7.01961580698319,0.320044386468605
51.1689896944584,7.02681034535609,0.289554223139773
51.1689896944584,7.03400488372899,0.420683542878142
51.1689896944584,7.04119942210189,0.310492950661366
51.1689896944584,7.04839396047478,0.292701820510992
51.1689896944584,7.05558849884768,0.279896174596436
51.1689896944584,7.06278303722058,0.329439921729468
51.1689896944584,7.06997757559348,0.301841139866528
51.1689896944584,7.07717211396638,0.46984620544268
51.1689896944584,7.08436665233928,0.615780830722752
51.1689896944584,7.09156119071218,0.458311841304692
51.1689896944584,7.09875572908508,0.292712177441641
51.1689896944584,7.10595026745797,0.407377101734623
51.1689896944584,7.11314480583087,0.277612561335399
51.1689896944584,7.12033934420377,0.241509247135822
51.1689896944584,7.12753388257667,0.259199978263454
51.1735197039042,6.9908376534916,0.280669830666987
51.1735197039042,6.99803219186449,0.259199978263454
51.1735197039042,7.00522673023739,0.30163837101614
51.1735197039042,7.01242126861029,0.263948681486572
51.1735197039042,7.01961580698319,0.379257622837696
51.1735197039042,7.02681034535609,0.342873678332594
51.1735197039042,7.03400488372899,0.339691280739764
51.1735197039042,7.04119942210189,0.325993895567221
51.1735197039042,7.04839396047478,0.468036831846129
51.1735197039042,7.05558849884768,0.362010460401695
51.1735197039042,7.06278303722058,0.315122308424018
51.1735197039042,7.06997757559348,0.357073747052103
51.1735197039042,7.07717211396638,0.421886466552072
51.1735197039042,7.08436665233928,0.749973266554299
51.1735197039042,7.09156119071218,0.340758618134139
51.1735197039042,7.09875572908508,0.384775377977248
51.1735197039042,7.10595026745797,0.265265989517713
51.1735197039042,7.11314480583087,0.261521402344307
51.1735197039042,7.12033934420377,0.259199978263454
51.1735197039042,7.12753388257667,0.259199978263454
51.17804971335,7.00522673023739,0.259199978263454
51.17804971335,7.01242126861029,0.259199978263454
51.17804971335,7.01961580698319,0.312672021824862
51.17804971335,7.02681034535609,0.357571377183634
51.17804971335,7.03400488372899,0.406453128603456
51.17804971335,7.04119942210189,0.441785690543614
51.17804971335,7.04839396047478,0.338930973859499
51.17804971335,7.05558849884768,0.385432772196834
51.17804971335,7.06278303722058,0.463784549363853
51.17804971335,7.06997757559348,0.470353816881612
51.17804971335,7.07717211396638,0.392283322630641
51.17804971335,7.08436665233928,0.803468612323503
51.17804971335,7.09156119071218,0.285438616092088
51.17804971335,7.09875572908508,0.289522068240686
51.17804971335,7.10595026745797,0.327589571073601
51.17804971335,7.11314480583087,0.276200099505698
51.17804971335,7.12033934420377,0.259199978263454
51.1825797227959,7.01961580698319,0.288128045797868
51.1825797227959,7.02681034535609,0.361597319779927
51.1825797227959,7.03400488372899,0.40299827048584
51.1825797227959,7.04119942210189,0.491142334053782
51.1825797227959,7.04839396047478,0.430057376998051
51.1825797227959,7.05558849884768,0.292671089207419
51.1825797227959,7.06278303722058,0.379844992223113
51.1825797227959,7.06997757559348,0.370035004938497
51.1825797227959,7.07717211396638,0.461595649280944
51.1825797227959,7.08436665233928,0.475407591612937
51.1825797227959,7.09156119071218,0.453950273393035
51.1825797227959,7.09875572908508,0.259359241173867
51.1825797227959,7.10595026745797,0.314019913788233
51.1825797227959,7.11314480583087,0.259199978263454
51.1825797227959,7.12033934420377,0.259199978263454
51.1871097322417,7.02681034535609,0.356221450356208
51.1871097322417,7.03400488372899,0.333786974526204
51.1871097322417,7.04119942210189,0.360481914504977
51.1871097322417,7.04839396047478,0.425801200872115
51.1871097322417,7.05558849884768,0.448530741010378
51.1871097322417,7.06278303722058,0.424903370967948
51.1871097322417,7.06997757559348,0.470720210299369
51.1871097322417,7.07717211396638,0.374984370051617
51.1871097322417,7.08436665233928,0.396603768458396
51.1871097322417,7.09156119071218,0.319085808781149
51.1871097322417,7.09875572908508,0.264364963399869
51.1871097322417,7.10595026745797,0.260902548010857
51.1871097322417,7.11314480583087,0.259199978263454
51.1916397416876,7.03400488372899,0.248736214007076
51.1916397416876,7.04119942210189,0.199510266666246
51.1916397416876,7.04839396047478,0.366428909925031
51.1916397416876,7.05558849884768,0.33934521886121
51.1916397416876,7.06278303722058,0.343740161360252
51.1916397416876,7.06997757559348,0.353781133625257
51.1916397416876,7.07717211396638,0.470996350715581
51.1916397416876,7.08436665233928,0.405493036841695
51.1916397416876,7.09156119071218,0.259199978263454
51.1916397416876,7.09875572908508,0.259199978263454
51.1916397416876,7.10595026745797,0.259199978263454
51.1961697511334,7.04119942210189,0.247499162190182
51.1961697511334,7.04839396047478,0.281979900932319
51.1961697511334,7.05558849884768,0.327047609251694
51.1961697511334,7.06278303722058,0.298455362085922
51.1961697511334,7.06997757559348,0.295214758514045
51.1961697511334,7.07717211396638,0.289123059539504
51.1961697511334,7.08436665233928,0.271728644602614
51.1961697511334,7.09156119071218,0.259996019154253
51.1961697511334,7.09875572908508,0.259199978263454
51.1961697511334,7.10595026745797,0.259199978263454
51.2006997605792,7.04119942210189,0.259199978263454
51.2006997605792,7.04839396047478,0.306512943118146
51.2006997605792,7.05558849884768,0.26979844175734
51.2006997605792,7.06278303722058,0.259199978263454
51.2006997605792,7.06997757559348,0.236895080255308
51.2006997605792,7.07717211396638,0.262054520660295
51.2006997605792,7.08436665233928,0.34548184246188
51.2006997605792,7.09156119071218,0.275655561546751
51.2006997605792,7.09875572908508,0.259199978263454
51.2006997605792,7.10595026745797,0.259199978263454
51.2052297700251,7.04839396047478,0.274832710673468
51.2052297700251,7.05558849884768,0.259199978263454
51.2052297700251,7.06278303722058,0.259199978263454
51.2052297700251,7.06997757559348,0.427683233376804
51.2052297700251,7.07717211396638,0.383260409927117
51.2052297700251,7.08436665233928,0.287255635694738
51.2052297700251,7.09156119071218,0.259199978263454
51.2052297700251,7.09875572908508,0.259199978263454
51.2097597794709,7.05558849884768,0.259199978263454
51.2097597794709,7.06278303722058,0.259199978263454
51.2097597794709,7.06997757559348,0.670126535507301
51.2097597794709,7.07717211396638,0.457579292828854
51.2097597794709,7.08436665233928,0.255234459592482
51.2097597794709,7.09156119071218,0.289462322702044
51.2097597794709,7.09875572908508,0.259199978263454
51.2097597794709,7.10595026745797,0.259199978263454
51.2142897889167,7.06997757559348,0.292487775367545
51.2142897889167,7.07717211396638,0.248325082347823
51.2142897889167,7.08436665233928,0.240434721444986
51.2142897889167,7.09156119071218,0.303934808948707
51.2142897889167,7.09875572908508,0.264393121700926
