nan,nan,1.618870667579937472e-01
1.060933216461718587e+01,4.765462879320571687e+01,1.732879073192698516e-01
1.063886452288330808e+01,4.782902988710215197e+01,1.861921242650194652e-01
1.057236026620617864e+01,4.791185471265967522e+01,1.988166819277881192e-01
1.072882937110738588e+01,4.800089000786213944e+01,2.105661629692900938e-01
1.073394766538019596e+01,4.759611675226499017e+01,2.219874804425998605e-01
1.060038658318333127e+01,4.769747269630876474e+01,2.337460702955952985e-01
1.072518573735272440e+01,4.761335301750905558e+01,2.455656843314859283e-01
1.056485696079383274e+01,4.758379077754691622e+01,2.570821573249067460e-01
1.059218246451748335e+01,4.781629001527264222e+01,2.684186878030919710e-01
1.057939587968418849e+01,4.756553573788182376e+01,2.795802822620890860e-01
