nan,nan,1.345644335280576087e-01
1.163895535821459326e+01,5.089382788758477716e+01,1.461457365839633482e-01
1.165565702999753306e+01,5.092917020825239405e+01,1.580429020605715884e-01
1.157486698672189895e+01,5.095828609491753980e+01,1.698225356032816435e-01
1.151054651874140511e+01,5.095581599582649091e+01,1.816764184522321190e-01
1.164048964310244827e+01,5.095447744286399683e+01,1.932851388171248630e-01
1.155506991108991244e+01,5.090430178905493364e+01,2.044723211747470348e-01
1.160929244563934226e+01,5.092187641629030281e+01,2.153781439457321256e-01
1.155922093479924051e+01,5.094783008057989804e+01,2.274481649038773423e-01
1.153535739417552719e+01,5.086590248360880651e+01,2.381988056880554039e-01
1.158562615938668650e+01,5.086973878538504579e+01,2.489480968786702553e-01
