nan,nan,8.042204597989063841e-02
1.100916761338949001e+01,5.039481047173082118e+01,9.257878979042030720e-02
1.122522233118018775e+01,5.039662298555688835e+01,1.040564625243538682e-01
1.118954432155648071e+01,5.036421936925347609e+01,1.154732353256658767e-01
1.122459000112501748e+01,5.047413653745347517e+01,1.271195457016554287e-01
1.106977136858769484e+01,5.047470686241099713e+01,1.384982401901215243e-01
1.116028169965328587e+01,5.048332543476250578e+01,1.515116341043505344e-01
1.112020417232851877e+01,5.050142326132969117e+01,1.632648048430225818e-01
1.111243419296470059e+01,5.041284221132404042e+01,1.748570276954192482e-01
1.100558766601716520e+01,5.052343935410402054e+01,1.865037267181202663e-01
1.118361146343194790e+01,5.049104513753979973e+01,1.987073535714770911e-01
