nan,nan,8.240187747341161384e-02
7.623507431193428552e+00,5.194985059614531764e+01,9.932164520780389916e-02
7.601423122623897299e+00,5.199704905039870795e+01,1.129830757121856877e-01
7.624676546053231085e+00,5.197179191150399902e+01,1.290017844976229511e-01
7.645611719066589984e+00,5.195562876168546040e+01,1.436199511580274757e-01
7.732650748600826240e+00,5.191836239547880183e+01,1.567372890310745059e-01
7.526913493792272369e+00,5.192516886154592726e+01,1.697563614941837440e-01
7.639793186673957237e+00,5.190345874900253165e+01,1.846169604760370120e-01
7.711086507790422928e+00,5.197803176933028624e+01,1.977247722609716540e-01
7.649101653967601777e+00,5.198623943322195373e+01,2.111046994406292621e-01
7.570009327108291330e+00,5.197288546126748088e+01,2.240007640688124468e-01
