51.755277,12.3088400043604,0.259199978263454
51.755277,12.3160345165348,0.259199978263454
51.7598762772461,12.2225058582674,0.259199978263454
51.7598762772461,12.3088400043604,0.259199978263454
51.7598762772461,12.3160345165348,0.273183842155706
51.7644755544921,12.2081168339186,0.259199978263454
51.7644755544921,12.215311346093,0.259199978263454
51.7644755544921,12.2225058582674,0.259199978263454
51.7644755544921,12.301645492186,0.259199978263454
51.7644755544921,12.3088400043604,0.25931213781571
51.7644755544921,12.3160345165348,0.293293244045915
51.7690748317382,12.1865332973953,0.259199978263454
51.7690748317382,12.1937278095697,0.259199978263454
51.7690748317382,12.2009223217442,0.259199978263454
51.7690748317382,12.2081168339186,0.259199978263454
51.7690748317382,12.215311346093,0.259199978263454
51.7690748317382,12.2225058582674,0.259199978263454
51.7690748317382,12.2297003704418,0.259199978263454
51.7690748317382,12.301645492186,0.259199978263454
51.7690748317382,12.3088400043604,0.261852749622082
51.7690748317382,12.3160345165348,0.215181491854557
51.7736741089842,12.1721442730465,0.259199978263454
51.7736741089842,12.1793387852209,0.259199978263454
51.7736741089842,12.1865332973953,0.259199978263454
51.7736741089842,12.1937278095697,0.259199978263454
51.7736741089842,12.2009223217442,0.259199978263454
51.7736741089842,12.2081168339186,0.259199978263454
51.7736741089842,12.215311346093,0.259199978263454
51.7736741089842,12.2225058582674,0.259199978263454
51.7736741089842,12.2297003704418,0.259199978263454
51.7736741089842,12.301645492186,0.259199978263454
51.7736741089842,12.3088400043604,0.259199978263454
51.7736741089842,12.3160345165348,0.244997251640374
51.7782733862303,12.1433662243488,0.259199978263454
51.7782733862303,12.1505607365232,0.259199978263454
51.7782733862303,12.1577552486977,0.259199978263454
51.7782733862303,12.1649497608721,0.259199978263454
51.7782733862303,12.1721442730465,0.259199978263454
51.7782733862303,12.1793387852209,0.259199978263454
51.7782733862303,12.1865332973953,0.259199978263454
51.7782733862303,12.1937278095697,0.259199978263454
51.7782733862303,12.2009223217442,0.259199978263454
51.7782733862303,12.2081168339186,0.259199978263454
51.7782733862303,12.215311346093,0.259199978263454
51.7782733862303,12.2225058582674,0.259199978263454
51.7782733862303,12.2297003704418,0.259199978263454
51.7782733862303,12.2368948826162,0.259199978263454
51.7782733862303,12.2944509800116,0.259199978263454
51.7782733862303,12.301645492186,0.259199978263454
51.7782733862303,12.3088400043604,0.259199978263454
51.7782733862303,12.3160345165348,0.259199978263454
51.7828726634763,12.1289772,0.259199978263454
51.7828726634763,12.1361717121744,0.259199978263454
51.7828726634763,12.1433662243488,0.259199978263454
51.7828726634763,12.1505607365232,0.259199978263454
51.7828726634763,12.1577552486977,0.253497446519391
51.7828726634763,12.1649497608721,0.259199978263454
51.7828726634763,12.1721442730465,0.259199978263454
51.7828726634763,12.1793387852209,0.259199978263454
51.7828726634763,12.1865332973953,0.259199978263454
51.7828726634763,12.1937278095697,0.259199978263454
51.7828726634763,12.2009223217442,0.259199978263454
51.7828726634763,12.2081168339186,0.259199978263454
51.7828726634763,12.215311346093,0.259199978263454
51.7828726634763,12.2225058582674,0.259199978263454
51.7828726634763,12.2297003704418,0.259199978263454
51.7828726634763,12.2368948826162,0.259199978263454
51.7828726634763,12.2728674434883,0.259199978263454
51.7828726634763,12.2944509800116,0.259199978263454
51.7828726634763,12.301645492186,0.259199978263454
51.7828726634763,12.3088400043604,0.259199978263454
51.7828726634763,12.3160345165348,0.259199978263454
51.7874719407224,12.1289772,0.259199978263454
51.7874719407224,12.1361717121744,0.259199978263454
51.7874719407224,12.1433662243488,0.259199978263454
51.7874719407224,12.1505607365232,0.32534383344248
51.7874719407224,12.1577552486977,0.301008073001292
51.7874719407224,12.1649497608721,0.250396425169516
51.7874719407224,12.1721442730465,0.259199978263454
51.7874719407224,12.1793387852209,0.259199978263454
51.7874719407224,12.1865332973953,0.259199978263454
51.7874719407224,12.1937278095697,0.259199978263454
51.7874719407224,12.2009223217442,0.259199978263454
51.7874719407224,12.2081168339186,0.259199978263454
51.7874719407224,12.215311346093,0.259199978263454
51.7874719407224,12.2225058582674,0.259199978263454
51.7874719407224,12.2297003704418,0.323964806437843
51.7874719407224,12.2368948826162,0.325143927131882
51.7874719407224,12.2440893947907,0.346540602606736
51.7874719407224,12.2512839069651,0.279649487224828
51.7874719407224,12.2584784191395,0.254025544657603
51.7874719407224,12.2656729313139,0.271466561356455
51.7874719407224,12.2728674434883,0.259199978263454
51.7874719407224,12.301645492186,0.259199978263454
51.7874719407224,12.3088400043604,0.259199978263454
51.7874719407224,12.3160345165348,0.259199978263454
51.7920712179685,12.1289772,0.259199978263454
51.7920712179685,12.1361717121744,0.259199978263454
51.7920712179685,12.1433662243488,0.259199978263454
51.7920712179685,12.1505607365232,0.259199978263454
51.7920712179685,12.1577552486977,0.259199978263454
51.7920712179685,12.1649497608721,0.259199978263454
51.7920712179685,12.1721442730465,0.259199978263454
51.7920712179685,12.1793387852209,0.279306788473374
51.7920712179685,12.1865332973953,0.259199978263454
51.7920712179685,12.1937278095697,0.259199978263454
51.7920712179685,12.2009223217442,0.259199978263454
51.7920712179685,12.2081168339186,0.259199978263454
51.7920712179685,12.215311346093,0.259199978263454
51.7920712179685,12.2225058582674,0.259199978263454
51.7920712179685,12.2297003704418,0.292267715825455
51.7920712179685,12.2368948826162,0.262297845869769
51.7920712179685,12.2440893947907,0.358853493891252
51.7920712179685,12.2512839069651,0.335921019451404
51.7920712179685,12.2584784191395,0.274278757356519
51.7920712179685,12.2656729313139,0.347363497836503
51.7920712179685,12.2872564678372,0.259199978263454
51.7920712179685,12.2944509800116,0.224829761136799
51.7920712179685,12.301645492186,0.253669848257642
51.7920712179685,12.3088400043604,0.259199978263454
51.7920712179685,12.3160345165348,0.259199978263454
51.7966704952145,12.1289772,0.260218164752276
51.7966704952145,12.1361717121744,0.244865967927579
51.7966704952145,12.1433662243488,0.24413268725474
51.7966704952145,12.1505607365232,0.259199978263454
51.7966704952145,12.1577552486977,0.259199978263454
51.7966704952145,12.1649497608721,0.259199978263454
51.7966704952145,12.1721442730465,0.262272096799976
51.7966704952145,12.1793387852209,0.398224397591588
51.7966704952145,12.1865332973953,0.278095074270178
51.7966704952145,12.1937278095697,0.314046799169147
51.7966704952145,12.2009223217442,0.259199978263454
51.7966704952145,12.2081168339186,0.259199978263454
51.7966704952145,12.215311346093,0.259199978263454
51.7966704952145,12.2225058582674,0.259199978263454
51.7966704952145,12.2297003704418,0.276346377731875
51.7966704952145,12.2368948826162,0.265004566652125
51.7966704952145,12.2440893947907,0.393770214270176
51.7966704952145,12.2512839069651,0.440707722957408
51.7966704952145,12.2584784191395,0.300649331035543
51.7966704952145,12.2656729313139,0.259199978263454
51.7966704952145,12.2728674434883,0.259199978263454
51.7966704952145,12.2872564678372,0.262896891692353
51.7966704952145,12.2944509800116,0.364899666496794
51.7966704952145,12.301645492186,0.260321054412421
51.7966704952145,12.3088400043604,0.259199978263454
51.7966704952145,12.3160345165348,0.259199978263454
51.8012697724606,12.1289772,0.297054988691168
51.8012697724606,12.1361717121744,0.252460723717346
51.8012697724606,12.1433662243488,0.221541588432319
51.8012697724606,12.1505607365232,0.266621348942284
51.8012697724606,12.1577552486977,0.259199978263454
51.8012697724606,12.1649497608721,0.259199978263454
51.8012697724606,12.1721442730465,0.30404745349843
51.8012697724606,12.1793387852209,0.408682020834127
51.8012697724606,12.1865332973953,0.318741558165317
51.8012697724606,12.1937278095697,0.361008807914383
51.8012697724606,12.2009223217442,0.259199978263454
51.8012697724606,12.2081168339186,0.259199978263454
51.8012697724606,12.215311346093,0.259199978263454
51.8012697724606,12.2225058582674,0.259199978263454
51.8012697724606,12.2297003704418,0.315796166667824
51.8012697724606,12.2368948826162,0.346571592763874
51.8012697724606,12.2440893947907,0.349270367467132
51.8012697724606,12.2512839069651,0.509514163042809
51.8012697724606,12.2584784191395,0.374193468464979
51.8012697724606,12.2656729313139,0.259199978263454
51.8012697724606,12.2728674434883,0.259199978263454
51.8012697724606,12.2800619556627,0.259199978263454
51.8012697724606,12.2872564678372,0.259199978263454
51.8012697724606,12.2944509800116,0.259199978263454
51.8012697724606,12.301645492186,0.259199978263454
51.8012697724606,12.3088400043604,0.259199978263454
51.8058690497066,12.1289772,0.259199978263454
51.8058690497066,12.1361717121744,0.259199978263454
51.8058690497066,12.1433662243488,0.251092028266277
51.8058690497066,12.1505607365232,0.307152809184366
51.8058690497066,12.1577552486977,0.270294788742058
51.8058690497066,12.1649497608721,0.259199978263454
51.8058690497066,12.1721442730465,0.259199978263454
51.8058690497066,12.1793387852209,0.280006660197448
51.8058690497066,12.1865332973953,0.259199978263454
51.8058690497066,12.1937278095697,0.259199978263454
51.8058690497066,12.2009223217442,0.259199978263454
51.8058690497066,12.2081168339186,0.259199978263454
51.8058690497066,12.215311346093,0.26119761472318
51.8058690497066,12.2225058582674,0.261179879998692
51.8058690497066,12.2297003704418,0.381191114034685
51.8058690497066,12.2368948826162,0.272347359498747
51.8058690497066,12.2440893947907,0.522151640002779
51.8058690497066,12.2512839069651,0.424072823011018
51.8058690497066,12.2584784191395,0.324699443082131
51.8058690497066,12.2656729313139,0.259199978263454
51.8058690497066,12.2728674434883,0.259199978263454
51.8058690497066,12.2800619556627,0.259199978263454
51.8058690497066,12.2872564678372,0.259199978263454
51.8058690497066,12.2944509800116,0.259199978263454
51.8058690497066,12.301645492186,0.259199978263454
51.8104683269527,12.1361717121744,0.259199978263454
51.8104683269527,12.1433662243488,0.262790677053017
51.8104683269527,12.1505607365232,0.28363994640274
51.8104683269527,12.1577552486977,0.28986894759589
51.8104683269527,12.1649497608721,0.259199978263454
51.8104683269527,12.1721442730465,0.259199978263454
51.8104683269527,12.1793387852209,0.259199978263454
51.8104683269527,12.1865332973953,0.259199978263454
51.8104683269527,12.1937278095697,0.259199978263454
51.8104683269527,12.2009223217442,0.259199978263454
51.8104683269527,12.2081168339186,0.259199978263454
51.8104683269527,12.215311346093,0.41682137065418
51.8104683269527,12.2225058582674,0.296004013534236
51.8104683269527,12.2297003704418,0.264328394881455
51.8104683269527,12.2368948826162,0.198742334734377
51.8104683269527,12.2440893947907,0.416899324551294
51.8104683269527,12.2512839069651,0.500714818165948
51.8104683269527,12.2584784191395,0.433625799138167
51.8104683269527,12.2656729313139,0.259199978263454
51.8104683269527,12.2728674434883,0.259199978263454
51.8104683269527,12.2800619556627,0.259199978263454
51.8104683269527,12.2872564678372,0.259199978263454
51.8104683269527,12.2944509800116,0.259199978263454
51.8104683269527,12.301645492186,0.261631836001377
51.8104683269527,12.3088400043604,0.257663732570016
51.8150676041988,12.1433662243488,0.249665452877574
51.8150676041988,12.1505607365232,0.33507886948509
51.8150676041988,12.1577552486977,0.353592481885639
51.8150676041988,12.1649497608721,0.268247095478307
51.8150676041988,12.1721442730465,0.294556019071381
51.8150676041988,12.1793387852209,0.31757544091736
51.8150676041988,12.1865332973953,0.374743939215952
51.8150676041988,12.1937278095697,0.352452772536121
51.8150676041988,12.2009223217442,0.332296859836825
51.8150676041988,12.2081168339186,0.267419577542362
51.8150676041988,12.215311346093,0.316116456356234
51.8150676041988,12.2225058582674,0.412341315348413
51.8150676041988,12.2297003704418,0.431703636669451
51.8150676041988,12.2368948826162,0.360288557978206
51.8150676041988,12.2440893947907,0.387246578097514
51.8150676041988,12.2512839069651,0.33807748093868
51.8150676041988,12.2584784191395,0.259199978263454
51.8150676041988,12.2656729313139,0.259199978263454
51.8150676041988,12.2728674434883,0.259199978263454
51.8150676041988,12.2800619556627,0.259199978263454
51.8150676041988,12.2872564678372,0.259199978263454
51.8150676041988,12.2944509800116,0.231190266507228
51.8150676041988,12.301645492186,0.209016504891698
51.8150676041988,12.3088400043604,0.246474432884397
51.8196668814448,12.1433662243488,0.259199978263454
51.8196668814448,12.1505607365232,0.292811663279664
51.8196668814448,12.1577552486977,0.26999445434607
51.8196668814448,12.1649497608721,0.259199978263454
51.8196668814448,12.1721442730465,0.32014191586864
51.8196668814448,12.1793387852209,0.369115212146144
51.8196668814448,12.1865332973953,0.424673098820971
51.8196668814448,12.1937278095697,0.361709109732658
51.8196668814448,12.2009223217442,0.407321420560366
51.8196668814448,12.2081168339186,0.38308190686831
51.8196668814448,12.215311346093,0.376177372756349
51.8196668814448,12.2225058582674,0.533265765826602
51.8196668814448,12.2297003704418,0.344354071730676
51.8196668814448,12.2368948826162,0.472957867415853
51.8196668814448,12.2440893947907,0.493488820228829
51.8196668814448,12.2512839069651,0.406359141491501
51.8196668814448,12.2584784191395,0.259199978263454
51.8196668814448,12.2656729313139,0.259199978263454
51.8196668814448,12.2728674434883,0.259199978263454
51.8196668814448,12.2800619556627,0.261131584864362
51.8196668814448,12.2872564678372,0.266896483302109
51.8196668814448,12.2944509800116,0.278359673617933
51.8196668814448,12.301645492186,0.250775229944472
51.8196668814448,12.3088400043604,0.284440505485914
51.8196668814448,12.3160345165348,0.317451148633751
51.8242661586909,12.1361717121744,0.259199978263454
51.8242661586909,12.1433662243488,0.259199978263454
51.8242661586909,12.1505607365232,0.259199978263454
51.8242661586909,12.1577552486977,0.259199978263454
51.8242661586909,12.1649497608721,0.259199978263454
51.8242661586909,12.1721442730465,0.296984908187679
51.8242661586909,12.1793387852209,0.328110831100859
51.8242661586909,12.1865332973953,0.282157016317649
51.8242661586909,12.1937278095697,0.419134807808802
51.8242661586909,12.2009223217442,0.335609018591968
51.8242661586909,12.2081168339186,0.416036470450629
51.8242661586909,12.215311346093,0.325625722306062
51.8242661586909,12.2225058582674,0.553555046816104
51.8242661586909,12.2297003704418,0.341599164485509
51.8242661586909,12.2368948826162,0.396881326440759
51.8242661586909,12.2440893947907,0.635517160347016
51.8242661586909,12.2512839069651,0.300224253482576
51.8242661586909,12.2584784191395,0.254261386401191
51.8242661586909,12.2656729313139,0.259199978263454
51.8242661586909,12.2728674434883,0.259199978263454
51.8242661586909,12.2800619556627,0.274829975235937
51.8242661586909,12.2872564678372,0.33466504891092
51.8242661586909,12.2944509800116,0.314738104616467
51.8242661586909,12.301645492186,0.25654832456502
51.8242661586909,12.3088400043604,0.259199978263454
51.8242661586909,12.3160345165348,0.259199978263454
51.8288654359369,12.1361717121744,0.259199978263454
51.8288654359369,12.1433662243488,0.259199978263454
51.8288654359369,12.1505607365232,0.259199978263454
51.8288654359369,12.1577552486977,0.259199978263454
51.8288654359369,12.1649497608721,0.259199978263454
51.8288654359369,12.1721442730465,0.259199978263454
51.8288654359369,12.1793387852209,0.259199978263454
51.8288654359369,12.1865332973953,0.259199978263454
51.8288654359369,12.1937278095697,0.270565637222523
51.8288654359369,12.2009223217442,0.24931115691067
51.8288654359369,12.2081168339186,0.301002682090018
51.8288654359369,12.215311346093,0.264772652025177
51.8288654359369,12.2225058582674,0.451312226410774
51.8288654359369,12.2297003704418,0.504377909342714
51.8288654359369,12.2368948826162,0.46101435187456
51.8288654359369,12.2440893947907,0.519756469551749
51.8288654359369,12.2512839069651,0.314517080638769
51.8288654359369,12.2584784191395,0.297450168601469
51.8288654359369,12.2656729313139,0.259199978263454
51.8288654359369,12.2728674434883,0.259199978263454
51.8288654359369,12.2800619556627,0.269296782883343
51.8288654359369,12.2872564678372,0.328618313561146
51.8288654359369,12.2944509800116,0.269127412508548
51.8288654359369,12.301645492186,0.282127044067499
51.8288654359369,12.3088400043604,0.339018326914369
51.8288654359369,12.3160345165348,0.273520076578609
51.833464713183,12.1361717121744,0.259199978263454
51.833464713183,12.1433662243488,0.259199978263454
51.833464713183,12.1505607365232,0.259199978263454
51.833464713183,12.1577552486977,0.259199978263454
51.833464713183,12.1649497608721,0.259199978263454
51.833464713183,12.1721442730465,0.259199978263454
51.833464713183,12.1793387852209,0.263100362747169
51.833464713183,12.1865332973953,0.261702094086403
51.833464713183,12.1937278095697,0.266871188524082
51.833464713183,12.2009223217442,0.262812191893372
51.833464713183,12.2081168339186,0.289794059404794
51.833464713183,12.215311346093,0.258847190756318
51.833464713183,12.2225058582674,0.328291575523508
51.833464713183,12.2297003704418,0.262482335786274
51.833464713183,12.2368948826162,0.490273347824346
51.833464713183,12.2440893947907,0.754880596858886
51.833464713183,12.2512839069651,0.508581730931006
51.833464713183,12.2584784191395,0.206370844985914
51.833464713183,12.2656729313139,0.267287345868036
51.833464713183,12.2728674434883,0.323363736854541
51.833464713183,12.2800619556627,0.304387643908624
51.833464713183,12.2872564678372,0.344037143825308
51.833464713183,12.2944509800116,0.259199978263454
51.833464713183,12.301645492186,0.259199978263454
51.833464713183,12.3088400043604,0.298471522399463
51.833464713183,12.3160345165348,0.259199978263454
51.838063990429,12.1361717121744,0.259199978263454
51.838063990429,12.1433662243488,0.259199978263454
51.838063990429,12.1505607365232,0.259199978263454
51.838063990429,12.1577552486977,0.259199978263454
51.838063990429,12.1649497608721,0.259199978263454
51.838063990429,12.1721442730465,0.267957749618229
51.838063990429,12.1793387852209,0.31861310146964
51.838063990429,12.1865332973953,0.404254306839284
51.838063990429,12.1937278095697,0.529777687637192
51.838063990429,12.2009223217442,0.39243372550213
51.838063990429,12.2081168339186,0.508236368722908
51.838063990429,12.215311346093,0.352924138289218
51.838063990429,12.2225058582674,0.469601448702046
51.838063990429,12.2297003704418,0.481947271736408
51.838063990429,12.2368948826162,0.741877960148489
51.838063990429,12.2440893947907,0.770492054052756
51.838063990429,12.2512839069651,0.585989128864276
51.838063990429,12.2584784191395,0.398789295472519
51.838063990429,12.2656729313139,0.272543778841503
51.838063990429,12.2728674434883,0.481910917727532
51.838063990429,12.2800619556627,0.354064466785688
51.838063990429,12.2872564678372,0.287230767991656
51.838063990429,12.2944509800116,0.259199978263454
51.838063990429,12.301645492186,0.259199978263454
51.838063990429,12.3088400043604,0.259199978263454
51.838063990429,12.3160345165348,0.259199978263454
51.8426632676751,12.1433662243488,0.259199978263454
51.8426632676751,12.1505607365232,0.259199978263454
51.8426632676751,12.1577552486977,0.259199978263454
51.8426632676751,12.1649497608721,0.259199978263454
51.8426632676751,12.1721442730465,0.288833374790503
51.8426632676751,12.1793387852209,0.441994050793487
51.8426632676751,12.1865332973953,0.390262335416123
51.8426632676751,12.1937278095697,0.288651864010847
51.8426632676751,12.2009223217442,0.417765268727687
51.8426632676751,12.2081168339186,0.362327301159945
51.8426632676751,12.215311346093,0.373850002438159
51.8426632676751,12.2225058582674,0.646181465275048
51.8426632676751,12.2297003704418,0.580519473375335
51.8426632676751,12.2368948826162,0.496281489279169
51.8426632676751,12.2440893947907,0.710424201296092
51.8426632676751,12.2512839069651,0.59786632506747
51.8426632676751,12.2584784191395,0.358378425939905
51.8426632676751,12.2656729313139,0.30488530919511
51.8426632676751,12.2728674434883,0.434974215252975
51.8426632676751,12.2800619556627,0.296460955604218
51.8426632676751,12.2872564678372,0.263534721555749
51.8426632676751,12.2944509800116,0.261069422372337
51.8426632676751,12.301645492186,0.259199978263454
51.8426632676751,12.3088400043604,0.259199978263454
51.8472625449212,12.1433662243488,0.259199978263454
51.8472625449212,12.1505607365232,0.259199978263454
51.8472625449212,12.1577552486977,0.259199978263454
51.8472625449212,12.1649497608721,0.259199978263454
51.8472625449212,12.1721442730465,0.265559570382084
51.8472625449212,12.1793387852209,0.378258469495957
51.8472625449212,12.1865332973953,0.332278392995415
51.8472625449212,12.1937278095697,0.259199978263454
51.8472625449212,12.2009223217442,0.422475118656522
51.8472625449212,12.2081168339186,0.384400583482741
51.8472625449212,12.215311346093,0.375153560865091
51.8472625449212,12.2225058582674,0.582072840592331
51.8472625449212,12.2297003704418,0.361542221211515
51.8472625449212,12.2368948826162,0.267916028709454
51.8472625449212,12.2440893947907,0.543303551728941
51.8472625449212,12.2512839069651,0.366355488229065
51.8472625449212,12.2584784191395,0.319850380235943
51.8472625449212,12.2656729313139,0.259199978263454
51.8472625449212,12.2728674434883,0.379554582141597
51.8472625449212,12.2800619556627,0.382080843086415
51.8472625449212,12.2872564678372,0.284003622673694
51.8472625449212,12.2944509800116,0.263265026558857
51.8472625449212,12.301645492186,0.259199978263454
51.8518618221672,12.1433662243488,0.259199978263454
51.8518618221672,12.1505607365232,0.259199978263454
51.8518618221672,12.1577552486977,0.259199978263454
51.8518618221672,12.1649497608721,0.259199978263454
51.8518618221672,12.1721442730465,0.288017029176952
51.8518618221672,12.1793387852209,0.286885018420527
51.8518618221672,12.1865332973953,0.311821188050871
51.8518618221672,12.1937278095697,0.330789830377336
51.8518618221672,12.2009223217442,0.263724665111763
51.8518618221672,12.2081168339186,0.26058884141366
51.8518618221672,12.215311346093,0.321478631589622
51.8518618221672,12.2225058582674,0.333651390933865
51.8518618221672,12.2297003704418,0.249306458507006
51.8518618221672,12.2368948826162,0.421306660943245
51.8518618221672,12.2440893947907,0.415503878079616
51.8518618221672,12.2512839069651,0.317587349084402
51.8518618221672,12.2584784191395,0.285826459015986
51.8518618221672,12.2656729313139,0.259199978263454
51.8518618221672,12.2728674434883,0.304759636239549
51.8518618221672,12.2800619556627,0.348755952960474
51.8518618221672,12.2872564678372,0.280353844121793
51.8518618221672,12.2944509800116,0.259199978263454
51.8564610994133,12.1433662243488,0.259199978263454
51.8564610994133,12.1505607365232,0.259199978263454
51.8564610994133,12.1577552486977,0.259199978263454
51.8564610994133,12.1649497608721,0.259199978263454
51.8564610994133,12.1721442730465,0.261501477694865
51.8564610994133,12.1793387852209,0.291017870314719
51.8564610994133,12.1865332973953,0.259199978263454
51.8564610994133,12.1937278095697,0.259199978263454
51.8564610994133,12.2009223217442,0.259199978263454
51.8564610994133,12.2081168339186,0.260305131264529
51.8564610994133,12.215311346093,0.391324320669607
51.8564610994133,12.2225058582674,0.303901987460379
51.8564610994133,12.2297003704418,0.253301989928378
51.8564610994133,12.2368948826162,0.276910632555666
51.8564610994133,12.2440893947907,0.207180725177605
51.8564610994133,12.2512839069651,0.326853705570365
51.8564610994133,12.2584784191395,0.354550340649909
51.8564610994133,12.2656729313139,0.259199978263454
51.8564610994133,12.2728674434883,0.259199978263454
51.8564610994133,12.2800619556627,0.266118080077233
51.8564610994133,12.2872564678372,0.281936030139984
51.8564610994133,12.2944509800116,0.259199978263454
51.8610603766593,12.1433662243488,0.259199978263454
51.8610603766593,12.1505607365232,0.259199978263454
51.8610603766593,12.1577552486977,0.259199978263454
51.8610603766593,12.1649497608721,0.259199978263454
51.8610603766593,12.1721442730465,0.259199978263454
51.8610603766593,12.1793387852209,0.259199978263454
51.8610603766593,12.1865332973953,0.259199978263454
51.8610603766593,12.1937278095697,0.259199978263454
51.8610603766593,12.2009223217442,0.259199978263454
51.8610603766593,12.2081168339186,0.259199978263454
51.8610603766593,12.215311346093,0.259199978263454
51.8610603766593,12.2225058582674,0.259199978263454
51.8610603766593,12.2297003704418,0.316124710551429
51.8610603766593,12.2368948826162,0.341955222795926
51.8610603766593,12.2440893947907,0.251026852565952
51.8610603766593,12.2512839069651,0.278865589684376
51.8610603766593,12.2584784191395,0.275841894608811
51.8610603766593,12.2656729313139,0.259199978263454
51.8610603766593,12.2728674434883,0.259199978263454
51.8610603766593,12.2800619556627,0.259199978263454
51.8656596539054,12.1505607365232,0.259199978263454
51.8656596539054,12.1577552486977,0.259199978263454
51.8656596539054,12.1649497608721,0.259199978263454
51.8656596539054,12.1721442730465,0.259199978263454
51.8656596539054,12.1793387852209,0.259199978263454
51.8656596539054,12.1865332973953,0.259199978263454
51.8656596539054,12.1937278095697,0.259199978263454
51.8656596539054,12.2009223217442,0.259199978263454
51.8656596539054,12.2081168339186,0.259199978263454
51.8656596539054,12.215311346093,0.259199978263454
51.8656596539054,12.2225058582674,0.259199978263454
51.8656596539054,12.2297003704418,0.259199978263454
51.8656596539054,12.2368948826162,0.259199978263454
51.8656596539054,12.2440893947907,0.259199978263454
51.8656596539054,12.2512839069651,0.259199978263454
51.8656596539054,12.2584784191395,0.259199978263454
51.8656596539054,12.2656729313139,0.259199978263454
51.8656596539054,12.2728674434883,0.259199978263454
51.8656596539054,12.2800619556627,0.259199978263454
51.8702589311514,12.1361717121744,0.259199978263454
51.8702589311514,12.1433662243488,0.259199978263454
51.8702589311514,12.1505607365232,0.259199978263454
51.8702589311514,12.1577552486977,0.259199978263454
51.8702589311514,12.1649497608721,0.259199978263454
51.8702589311514,12.1721442730465,0.259199978263454
51.8702589311514,12.1793387852209,0.259199978263454
51.8702589311514,12.1865332973953,0.259199978263454
51.8702589311514,12.1937278095697,0.259199978263454
51.8702589311514,12.2009223217442,0.259199978263454
51.8702589311514,12.2081168339186,0.259199978263454
51.8702589311514,12.215311346093,0.259199978263454
51.8702589311514,12.2225058582674,0.259199978263454
51.8702589311514,12.2297003704418,0.259199978263454
51.8702589311514,12.2368948826162,0.259199978263454
51.8702589311514,12.2440893947907,0.259199978263454
51.8702589311514,12.2512839069651,0.259199978263454
51.8702589311514,12.2584784191395,0.259199978263454
51.8702589311514,12.2656729313139,0.259199978263454
51.8702589311514,12.2728674434883,0.259199978263454
51.8702589311514,12.2800619556627,0.259199978263454
51.8702589311514,12.2872564678372,0.259199978263454
51.8748582083975,12.1289772,0.259199978263454
51.8748582083975,12.1361717121744,0.259199978263454
51.8748582083975,12.1433662243488,0.371476254114393
51.8748582083975,12.1505607365232,0.426680668793448
51.8748582083975,12.1577552486977,0.259199978263454
51.8748582083975,12.1649497608721,0.259199978263454
51.8748582083975,12.1721442730465,0.259199978263454
51.8748582083975,12.1793387852209,0.259199978263454
51.8748582083975,12.1865332973953,0.259199978263454
51.8748582083975,12.1937278095697,0.259199978263454
51.8748582083975,12.2009223217442,0.259199978263454
51.8748582083975,12.2081168339186,0.259199978263454
51.8748582083975,12.215311346093,0.259199978263454
51.8748582083975,12.2225058582674,0.259199978263454
51.8748582083975,12.2297003704418,0.259199978263454
51.8748582083975,12.2368948826162,0.259407018761146
51.8748582083975,12.2440893947907,0.259199978263454
51.8748582083975,12.2512839069651,0.259199978263454
51.8748582083975,12.2584784191395,0.259199978263454
51.8748582083975,12.2656729313139,0.259199978263454
51.8748582083975,12.2728674434883,0.259199978263454
51.8748582083975,12.2800619556627,0.259199978263454
51.8748582083975,12.2872564678372,0.259199978263454
51.8794574856436,12.1289772,0.259199978263454
51.8794574856436,12.1361717121744,0.259199978263454
51.8794574856436,12.1433662243488,0.259199978263454
51.8794574856436,12.1505607365232,0.259199978263454
51.8794574856436,12.1577552486977,0.259199978263454
51.8794574856436,12.1649497608721,0.259199978263454
51.8794574856436,12.1721442730465,0.259199978263454
51.8794574856436,12.1793387852209,0.259199978263454
51.8794574856436,12.1865332973953,0.259199978263454
51.8794574856436,12.1937278095697,0.286872813900951
51.8794574856436,12.2009223217442,0.319994619206756
51.8794574856436,12.2081168339186,0.259199978263454
51.8794574856436,12.215311346093,0.259199978263454
51.8794574856436,12.2225058582674,0.259199978263454
51.8794574856436,12.2297003704418,0.291403428816622
51.8794574856436,12.2368948826162,0.310838381042909
51.8794574856436,12.2440893947907,0.268482986580779
51.8794574856436,12.2512839069651,0.259199978263454
51.8794574856436,12.2584784191395,0.259199978263454
51.8794574856436,12.2656729313139,0.259199978263454
51.8794574856436,12.2728674434883,0.259199978263454
51.8794574856436,12.2800619556627,0.259199978263454
51.8794574856436,12.2872564678372,0.259199978263454
51.8794574856436,12.2944509800116,0.259199978263454
51.8840567628896,12.1289772,0.259199978263454
51.8840567628896,12.1361717121744,0.259199978263454
51.8840567628896,12.1433662243488,0.259199978263454
51.8840567628896,12.1505607365232,0.259199978263454
51.8840567628896,12.1577552486977,0.259199978263454
51.8840567628896,12.1649497608721,0.259199978263454
51.8840567628896,12.1721442730465,0.259199978263454
51.8840567628896,12.1793387852209,0.237345164583357
51.8840567628896,12.1865332973953,0.259199978263454
51.8840567628896,12.1937278095697,0.272761581509506
51.8840567628896,12.2009223217442,0.300437541630407
51.8840567628896,12.2081168339186,0.259199978263454
51.8840567628896,12.215311346093,0.267071889536625
51.8840567628896,12.2225058582674,0.310964734466875
51.8840567628896,12.2297003704418,0.350057771707848
51.8840567628896,12.2368948826162,0.345431331600146
51.8840567628896,12.2440893947907,0.320085965143619
51.8840567628896,12.2512839069651,0.266238852623837
51.8840567628896,12.2584784191395,0.263542034504495
51.8840567628896,12.2656729313139,0.259199978263454
51.8840567628896,12.2728674434883,0.259199978263454
51.8840567628896,12.2800619556627,0.259199978263454
51.8840567628896,12.2872564678372,0.259199978263454
51.8840567628896,12.2944509800116,0.259199978263454
51.8840567628896,12.301645492186,0.259199978263454
51.8886560401357,12.1289772,0.259199978263454
51.8886560401357,12.1361717121744,0.259199978263454
51.8886560401357,12.1433662243488,0.259199978263454
51.8886560401357,12.1505607365232,0.259199978263454
51.8886560401357,12.1577552486977,0.25959873613909
51.8886560401357,12.1649497608721,0.250677655691515
51.8886560401357,12.1721442730465,0.259199978263454
51.8886560401357,12.1793387852209,0.247657595000471
51.8886560401357,12.1865332973953,0.259199978263454
51.8886560401357,12.1937278095697,0.259199978263454
51.8886560401357,12.2009223217442,0.27442932168459
51.8886560401357,12.2081168339186,0.259199978263454
51.8886560401357,12.215311346093,0.280783972131159
51.8886560401357,12.2225058582674,0.321050789837037
51.8886560401357,12.2297003704418,0.375081735990984
51.8886560401357,12.2368948826162,0.369684973159562
51.8886560401357,12.2440893947907,0.414923061365768
51.8886560401357,12.2512839069651,0.380876002570245
51.8886560401357,12.2584784191395,0.260628457506323
51.8886560401357,12.2656729313139,0.260186063382491
51.8886560401357,12.2728674434883,0.176133267711955
51.8886560401357,12.2800619556627,0.259199978263454
51.8886560401357,12.2872564678372,0.259199978263454
51.8886560401357,12.2944509800116,0.259199978263454
51.8886560401357,12.301645492186,0.259199978263454
51.8886560401357,12.3088400043604,0.259199978263454
51.8886560401357,12.3160345165348,0.259199978263454
51.8932553173817,12.1289772,0.259199978263454
51.8932553173817,12.1361717121744,0.259199978263454
51.8932553173817,12.1433662243488,0.259199978263454
51.8932553173817,12.1505607365232,0.259199978263454
51.8932553173817,12.1577552486977,0.246289835068176
51.8932553173817,12.1649497608721,0.220656158520368
51.8932553173817,12.1721442730465,0.259199978263454
51.8932553173817,12.1793387852209,0.259199978263454
51.8932553173817,12.1865332973953,0.259199978263454
51.8932553173817,12.1937278095697,0.318336361125057
51.8932553173817,12.2009223217442,0.288391187076058
51.8932553173817,12.2081168339186,0.270010674199436
51.8932553173817,12.215311346093,0.264907695188654
51.8932553173817,12.2225058582674,0.197786173475033
51.8932553173817,12.2297003704418,0.240921858510568
51.8932553173817,12.2368948826162,0.265341426542284
51.8932553173817,12.2440893947907,0.317868907766006
51.8932553173817,12.2512839069651,0.261485541329069
51.8932553173817,12.2584784191395,0.299598612246318
51.8932553173817,12.2656729313139,0.287150110271386
51.8932553173817,12.2728674434883,0.237061982871955
51.8932553173817,12.2800619556627,0.259199978263454
51.8932553173817,12.2872564678372,0.259199978263454
51.8932553173817,12.2944509800116,0.259199978263454
51.8932553173817,12.301645492186,0.259199978263454
51.8932553173817,12.3088400043604,0.259199978263454
51.8932553173817,12.3160345165348,0.259199978263454
51.8978545946278,12.1433662243488,0.259199978263454
51.8978545946278,12.1505607365232,0.259199978263454
51.8978545946278,12.1577552486977,0.259199978263454
51.8978545946278,12.1649497608721,0.259199978263454
51.8978545946278,12.1721442730465,0.259199978263454
51.8978545946278,12.1793387852209,0.259199978263454
51.8978545946278,12.1865332973953,0.259199978263454
51.8978545946278,12.1937278095697,0.284876209895031
51.8978545946278,12.2009223217442,0.23615393343128
51.8978545946278,12.2081168339186,0.275450010195884
51.8978545946278,12.215311346093,0.23234824220578
51.8978545946278,12.2225058582674,0.260903005991429
51.8978545946278,12.2297003704418,0.251773930784122
51.8978545946278,12.2368948826162,0.227283742379212
51.8978545946278,12.2440893947907,0.258706117286251
51.8978545946278,12.2512839069651,0.252838751603105
51.8978545946278,12.2584784191395,0.264629616336475
51.8978545946278,12.2656729313139,0.237925570461406
51.8978545946278,12.2728674434883,0.221185008734016
51.8978545946278,12.2800619556627,0.259199978263454
51.8978545946278,12.2872564678372,0.259199978263454
51.8978545946278,12.2944509800116,0.259199978263454
51.8978545946278,12.301645492186,0.259199978263454
51.8978545946278,12.3088400043604,0.259199978263454
51.8978545946278,12.3160345165348,0.259199978263454
51.9024538718739,12.1433662243488,0.259199978263454
51.9024538718739,12.1505607365232,0.259199978263454
51.9024538718739,12.1721442730465,0.259199978263454
51.9024538718739,12.1865332973953,0.259199978263454
51.9024538718739,12.1937278095697,0.259199978263454
51.9024538718739,12.2009223217442,0.214164221916395
51.9024538718739,12.2081168339186,0.259199978263454
51.9024538718739,12.215311346093,0.272620730752569
51.9024538718739,12.2225058582674,0.261135872157507
51.9024538718739,12.2297003704418,0.259199978263454
51.9024538718739,12.2368948826162,0.258092665361058
51.9024538718739,12.2440893947907,0.259199978263454
51.9024538718739,12.2512839069651,0.259199978263454
51.9024538718739,12.2584784191395,0.243735009936245
51.9024538718739,12.2656729313139,0.259199978263454
51.9024538718739,12.2728674434883,0.253612180950782
51.9024538718739,12.2800619556627,0.259199978263454
51.9024538718739,12.2872564678372,0.259199978263454
51.9024538718739,12.2944509800116,0.259199978263454
51.9024538718739,12.301645492186,0.259199978263454
51.9024538718739,12.3088400043604,0.259199978263454
51.9024538718739,12.3160345165348,0.259199978263454
51.9070531491199,12.1865332973953,0.259199978263454
51.9070531491199,12.1937278095697,0.259199978263454
51.9070531491199,12.2009223217442,0.259199978263454
51.9070531491199,12.2081168339186,0.259199978263454
51.9070531491199,12.215311346093,0.287241689313364
51.9070531491199,12.2225058582674,0.271288675612804
51.9070531491199,12.2297003704418,0.259199978263454
51.9070531491199,12.2368948826162,0.259199978263454
51.9070531491199,12.2440893947907,0.272566758093473
51.9070531491199,12.2512839069651,0.346371014348474
51.9070531491199,12.2584784191395,0.244362439862026
51.9070531491199,12.2656729313139,0.259199978263454
51.9070531491199,12.2728674434883,0.259199978263454
51.9070531491199,12.2800619556627,0.259199978263454
51.9070531491199,12.2872564678372,0.259199978263454
51.9070531491199,12.2944509800116,0.259199978263454
51.9070531491199,12.301645492186,0.259199978263454
51.9070531491199,12.3088400043604,0.259199978263454
51.911652426366,12.1793387852209,0.259199978263454
51.911652426366,12.1865332973953,0.259199978263454
51.911652426366,12.1937278095697,0.259199978263454
51.911652426366,12.2009223217442,0.259199978263454
51.911652426366,12.2081168339186,0.259199978263454
51.911652426366,12.215311346093,0.259199978263454
51.911652426366,12.2225058582674,0.259199978263454
51.911652426366,12.2297003704418,0.259199978263454
51.911652426366,12.2368948826162,0.259199978263454
51.911652426366,12.2440893947907,0.269169143768837
51.911652426366,12.2512839069651,0.401854028509906
51.911652426366,12.2584784191395,0.323514954582415
51.911652426366,12.2656729313139,0.298200702745104
51.911652426366,12.2728674434883,0.259199978263454
51.911652426366,12.2800619556627,0.259199978263454
51.911652426366,12.2872564678372,0.259199978263454
51.911652426366,12.2944509800116,0.256611067703726
51.911652426366,12.301645492186,0.23519255032591
51.911652426366,12.3088400043604,0.259199978263454
51.911652426366,12.3160345165348,0.259199978263454
51.916251703612,12.1721442730465,0.259199978263454
51.916251703612,12.1793387852209,0.259199978263454
51.916251703612,12.1865332973953,0.259199978263454
51.916251703612,12.1937278095697,0.259199978263454
51.916251703612,12.2009223217442,0.259199978263454
51.916251703612,12.2081168339186,0.259199978263454
51.916251703612,12.215311346093,0.259199978263454
51.916251703612,12.2225058582674,0.259199978263454
51.916251703612,12.2297003704418,0.259199978263454
51.916251703612,12.2368948826162,0.259199978263454
51.916251703612,12.2440893947907,0.259199978263454
51.916251703612,12.2512839069651,0.294354662973621
51.916251703612,12.2584784191395,0.267937123366862
51.916251703612,12.2656729313139,0.261684960417218
51.916251703612,12.2728674434883,0.259199978263454
51.916251703612,12.2800619556627,0.259199978263454
51.916251703612,12.2872564678372,0.259199978263454
51.916251703612,12.2944509800116,0.259199978263454
51.916251703612,12.301645492186,0.250556520976051
51.916251703612,12.3088400043604,0.259199978263454
51.9208509808581,12.1649497608721,0.259199978263454
51.9208509808581,12.1721442730465,0.259199978263454
51.9208509808581,12.1793387852209,0.259199978263454
51.9208509808581,12.1865332973953,0.259199978263454
51.9208509808581,12.1937278095697,0.259199978263454
51.9208509808581,12.2009223217442,0.259199978263454
51.9208509808581,12.2081168339186,0.259199978263454
51.9208509808581,12.215311346093,0.259199978263454
51.9208509808581,12.2225058582674,0.259199978263454
51.9208509808581,12.2297003704418,0.259199978263454
51.9208509808581,12.2368948826162,0.259199978263454
51.9208509808581,12.2440893947907,0.259199978263454
51.9208509808581,12.2512839069651,0.259199978263454
51.9208509808581,12.2584784191395,0.259199978263454
51.9208509808581,12.2656729313139,0.259199978263454
51.9208509808581,12.2728674434883,0.259199978263454
51.9208509808581,12.2800619556627,0.259199978263454
51.9208509808581,12.2872564678372,0.259199978263454
51.9208509808581,12.2944509800116,0.259199978263454
51.9208509808581,12.301645492186,0.259199978263454
51.9208509808581,12.3088400043604,0.259199978263454
51.9254502581041,12.1577552486977,0.259199978263454
51.9254502581041,12.1649497608721,0.259199978263454
51.9254502581041,12.1721442730465,0.259199978263454
51.9254502581041,12.1793387852209,0.259199978263454
51.9254502581041,12.1865332973953,0.259199978263454
51.9254502581041,12.1937278095697,0.259199978263454
51.9254502581041,12.2009223217442,0.259199978263454
51.9254502581041,12.2081168339186,0.259199978263454
51.9254502581041,12.215311346093,0.259199978263454
51.9254502581041,12.2225058582674,0.259199978263454
51.9254502581041,12.2297003704418,0.259199978263454
51.9254502581041,12.2368948826162,0.259199978263454
51.9254502581041,12.2440893947907,0.259199978263454
51.9254502581041,12.2512839069651,0.259199978263454
51.9254502581041,12.2584784191395,0.251498320550365
51.9254502581041,12.2656729313139,0.249299022484364
51.9254502581041,12.2728674434883,0.259199978263454
51.9254502581041,12.2800619556627,0.259199978263454
51.9254502581041,12.2872564678372,0.259199978263454
51.9254502581041,12.2944509800116,0.259199978263454
51.9254502581041,12.301645492186,0.259199978263454
51.9254502581041,12.3088400043604,0.259199978263454
51.9300495353502,12.1721442730465,0.259199978263454
51.9300495353502,12.1937278095697,0.263905542613843
51.9300495353502,12.2009223217442,0.259199978263454
51.9300495353502,12.2081168339186,0.259199978263454
51.9300495353502,12.215311346093,0.251625277659421
51.9300495353502,12.2225058582674,0.222087806178603
51.9300495353502,12.2297003704418,0.230835824692166
51.9300495353502,12.2368948826162,0.259199978263454
51.9300495353502,12.2440893947907,0.259199978263454
51.9300495353502,12.2512839069651,0.259199978263454
51.9300495353502,12.2584784191395,0.277593405408803
51.9300495353502,12.2656729313139,0.269583140722788
51.9300495353502,12.2728674434883,0.259199978263454
51.9300495353502,12.2800619556627,0.259199978263454
51.9300495353502,12.2872564678372,0.259199978263454
51.9300495353502,12.2944509800116,0.259199978263454
51.9300495353502,12.301645492186,0.259199978263454
51.9346488125963,12.1937278095697,0.259199978263454
51.9346488125963,12.2009223217442,0.259199978263454
51.9346488125963,12.2081168339186,0.259199978263454
51.9346488125963,12.215311346093,0.252970075500547
51.9346488125963,12.2225058582674,0.245535900164046
51.9346488125963,12.2297003704418,0.254618316355111
51.9346488125963,12.2368948826162,0.259199978263454
51.9346488125963,12.2440893947907,0.259199978263454
51.9346488125963,12.2512839069651,0.259199978263454
51.9346488125963,12.2584784191395,0.259199978263454
51.9346488125963,12.2656729313139,0.259199978263454
51.9346488125963,12.2728674434883,0.259199978263454
51.9346488125963,12.2800619556627,0.259199978263454
51.9346488125963,12.2872564678372,0.259199978263454
51.9346488125963,12.2944509800116,0.259199978263454
51.9346488125963,12.301645492186,0.259199978263454
51.9346488125963,12.3088400043604,0.259199978263454
51.9392480898423,12.2081168339186,0.259199978263454
51.9392480898423,12.215311346093,0.259199978263454
51.9392480898423,12.2225058582674,0.259199978263454
51.9392480898423,12.2297003704418,0.259199978263454
51.9392480898423,12.2368948826162,0.259199978263454
51.9392480898423,12.2440893947907,0.259199978263454
51.9392480898423,12.2512839069651,0.259199978263454
51.9392480898423,12.2584784191395,0.259199978263454
51.9392480898423,12.2656729313139,0.259199978263454
51.9392480898423,12.2728674434883,0.259199978263454
51.9392480898423,12.2800619556627,0.261863188706451
51.9392480898423,12.2872564678372,0.263565526999744
51.9392480898423,12.2944509800116,0.259199978263454
51.9392480898423,12.301645492186,0.259199978263454
51.9392480898423,12.3088400043604,0.259199978263454
51.9392480898423,12.3160345165348,0.259199978263454
51.9438473670884,12.215311346093,0.259199978263454
51.9438473670884,12.2225058582674,0.259199978263454
51.9438473670884,12.2297003704418,0.259199978263454
51.9438473670884,12.2368948826162,0.259199978263454
51.9438473670884,12.2440893947907,0.259199978263454
51.9438473670884,12.2512839069651,0.259199978263454
51.9438473670884,12.2584784191395,0.259199978263454
51.9438473670884,12.2656729313139,0.259199978263454
51.9438473670884,12.2728674434883,0.259199978263454
51.9438473670884,12.2800619556627,0.259199978263454
51.9438473670884,12.2872564678372,0.259199978263454
51.9438473670884,12.2944509800116,0.259199978263454
51.9438473670884,12.301645492186,0.259199978263454
51.9438473670884,12.3088400043604,0.259199978263454
51.9438473670884,12.3160345165348,0.259199978263454
51.9484466443344,12.2081168339186,0.259199978263454
51.9484466443344,12.215311346093,0.259199978263454
51.9484466443344,12.2225058582674,0.259199978263454
51.9484466443344,12.2297003704418,0.259199978263454
51.9484466443344,12.2368948826162,0.259199978263454
51.9484466443344,12.2440893947907,0.259199978263454
51.9484466443344,12.2512839069651,0.259199978263454
51.9484466443344,12.2584784191395,0.259199978263454
51.9484466443344,12.2656729313139,0.259199978263454
51.9484466443344,12.2728674434883,0.259199978263454
51.9484466443344,12.301645492186,0.259199978263454
51.9484466443344,12.3088400043604,0.259199978263454
51.9530459215805,12.215311346093,0.259199978263454
51.9530459215805,12.2225058582674,0.259199978263454
51.9530459215805,12.2297003704418,0.260158446064179
51.9530459215805,12.2368948826162,0.259199978263454
51.9530459215805,12.2440893947907,0.259199978263454
51.9530459215805,12.2512839069651,0.259199978263454
51.9530459215805,12.2584784191395,0.259199978263454
51.9530459215805,12.2656729313139,0.259199978263454
51.9530459215805,12.2728674434883,0.259199978263454
