nan,nan,1.314050959073794489e-01
6.851277505733385453e+00,4.944292913615238660e+01,1.466604198727004260e-01
6.912512750107969950e+00,4.941056427456199174e+01,1.610961880072449004e-01
6.656786426204947205e+00,4.933292910956317456e+01,1.741454112664690135e-01
6.691313905684160623e+00,4.932723874483585291e+01,1.863904316733846767e-01
6.849595101061071389e+00,4.942109851843731150e+01,1.981863522968520253e-01
6.705394797871278456e+00,4.927698975310106277e+01,2.107171591205599659e-01
6.816555891891136199e+00,4.930397182295639880e+01,2.253272441778056412e-01
6.719762628671690941e+00,4.932613361321377710e+01,2.384986609359725229e-01
6.779577703304351388e+00,4.939792128113020908e+01,2.506890564290931156e-01
6.804189887881135768e+00,4.935308154468026487e+01,2.646068097450676726e-01
