nan,nan,9.477696209832596475e-02
9.232897302711611687e+00,4.973347196745189081e+01,1.075588947067775414e-01
9.265082976781414459e+00,4.979460846656092343e+01,1.207506257827355295e-01
9.155599012075635201e+00,4.980233165554870567e+01,1.375272624801088528e-01
9.204759832200693381e+00,4.992162554629042148e+01,1.492271413085189402e-01
9.222920639765007422e+00,4.964515524433873139e+01,1.628257019568539743e-01
9.235489730107071082e+00,4.984960282142662891e+01,1.742971710962675225e-01
9.228001053923371444e+00,4.970732594784173131e+01,1.863917296404980495e-01
9.152074905645461556e+00,4.987814477077584030e+01,1.987267761756834061e-01
9.218684672710677930e+00,4.966483830432214575e+01,2.105346180560251357e-01
9.207603361698353694e+00,4.975975585659013234e+01,2.224909720894273912e-01
