nan,nan,1.501043514791368660e-01
7.673387874235361394e+00,5.000950726899615262e+01,1.624189599425852615e-01
7.725487432329859239e+00,5.013588912347161397e+01,1.745436704485892887e-01
7.309278291427941276e+00,4.993367024483132610e+01,1.863426038831081377e-01
7.472294409626399236e+00,5.018885999826430577e+01,1.977218117629773730e-01
7.570988274017773634e+00,5.024228725664657702e+01,2.088266125860746281e-01
7.535656668225106714e+00,5.021285213436924977e+01,2.203829309569116934e-01
7.485569112441522677e+00,4.993363430865893804e+01,2.326738445695661905e-01
7.254000971866134684e+00,4.992896985874035209e+01,2.441325565863862734e-01
7.407600294442977962e+00,4.990556457917183053e+01,2.550390182752714785e-01
7.280114974894459579e+00,4.992116099257957984e+01,2.673319584320393294e-01
