nan,nan,1.299718403860207309e-02
1.185886947345520959e+01,4.944539533687309074e+01,3.082307694999295022e-02
1.183069310775944949e+01,4.944463849161310520e+01,4.278579623049373615e-02
1.189889889713219695e+01,4.946053730510781321e+01,5.461546853421252179e-02
1.182633641865781193e+01,4.942623762409801458e+01,6.642505168321748144e-02
1.184470990486585151e+01,4.943018649246428708e+01,7.776549051616467312e-02
1.185743910466509554e+01,4.946562638158032144e+01,8.857736411858094239e-02
1.179412337729935700e+01,4.945535958847740687e+01,9.933270775340077852e-02
1.182944060433010947e+01,4.946552693240990095e+01,1.101122739247356735e-01
1.186988148603670545e+01,4.948277580241012430e+01,1.208558295755458312e-01
1.180122040118590299e+01,4.943146960276494184e+01,1.316406234801729691e-01
