nan,nan,5.754425446758262841e-02
1.241552486470066441e+01,5.239603759917251580e+01,7.067757042753375352e-02
1.249617157780800802e+01,5.238679664195799290e+01,8.294651041415251891e-02
1.261274335676927905e+01,5.240879107984178376e+01,9.540208831674572287e-02
1.249751920261232563e+01,5.242869434802138784e+01,1.067895597284593406e-01
1.253988184691987939e+01,5.242700348104187924e+01,1.188149438433816901e-01
1.247469218661049517e+01,5.237123743634122519e+01,1.308630691074260943e-01
1.253151259045047183e+01,5.239029208119285386e+01,1.435026236800788502e-01
1.242722318654422686e+01,5.237444032809595029e+01,1.553793297077492586e-01
1.258272920437602238e+01,5.242139242811293798e+01,1.676660345551307663e-01
1.242603725698576689e+01,5.241551012655751407e+01,1.789732892239258855e-01
