nan,nan,2.956030540067479118e-01
7.608486883090537667e+00,5.306419678535216633e+01,3.064551757770688223e-01
7.316845619620910846e+00,5.312814057559866399e+01,3.180035897693049285e-01
7.480590783136897848e+00,5.328950674611325411e+01,3.297747614820217277e-01
7.578259144187439844e+00,5.333614636489335226e+01,3.420347434893805105e-01
7.530052295080175817e+00,5.322128246658637352e+01,3.533396399520434827e-01
7.643626952397204022e+00,5.321523781921393947e+01,3.644128596725189073e-01
7.413670912956757064e+00,5.322381473797422302e+01,3.757558044574423883e-01
7.319873939772012506e+00,5.317330107035631670e+01,3.867044209213471584e-01
6.726270365164059406e+00,5.359946836135667780e+01,3.975150943808277160e-01
7.427675331358265076e+00,5.311759740724058787e+01,4.083090623288296861e-01
