nan,nan,2.341549214108050170e-01
9.129832032394205044e+00,4.931603815622131037e+01,2.456266666380438890e-01
9.170564156971025227e+00,4.948082226507476378e+01,2.568969545879216110e-01
9.438729593538303320e+00,4.960619652967315574e+01,2.689830578726627452e-01
9.405089148481806660e+00,4.940628421809822157e+01,2.794643366592987621e-01
9.075069118101833254e+00,4.939823156998165388e+01,2.923152055201806987e-01
9.354843467805155299e+00,4.944431082147751511e+01,3.036956193822175076e-01
9.283618982355024585e+00,4.935925279379618758e+01,3.154449151127500239e-01
9.257798143230495214e+00,4.934875516320691702e+01,3.267471838918855620e-01
9.482847690727822965e+00,4.963182965618109677e+01,3.375580527001049713e-01
9.153914658439223473e+00,4.943470681735218619e+01,3.488482927295238345e-01
