nan,nan,8.931359683586592713e-02
9.081480315552321159e+00,5.134120435060879828e+01,1.021771825555095187e-01
9.046976952075633349e+00,5.117446061390951684e+01,1.134889180459301705e-01
8.667048427232124652e+00,5.128211285723744339e+01,1.268342207659185483e-01
9.016091582230338020e+00,5.117935287253609289e+01,1.386997255536450702e-01
8.800836119454050532e+00,5.106212515732723745e+01,1.508149424318354359e-01
9.086200223007597998e+00,5.118993638490297116e+01,1.627626828715456331e-01
8.809269300697156524e+00,5.102438112951743676e+01,1.743083269577506977e-01
8.797986699720331316e+00,5.109130276280406235e+01,1.853478092679302913e-01
8.743662122591763008e+00,5.122856200823417083e+01,1.966436663624350767e-01
9.122791514133130164e+00,5.115683552726354577e+01,2.084726951749666102e-01
