nan,nan,3.661642512455640791e-02
1.004265711504921121e+01,5.263245808368037615e+01,4.901210926279237629e-02
1.005037001143288933e+01,5.259611475098141398e+01,6.086457607429170830e-02
9.905960484065598592e+00,5.267842440198353415e+01,7.266198176746374582e-02
1.022959677205879991e+01,5.272944023189241847e+01,8.483272648242326519e-02
1.014140902186551330e+01,5.253787845269650347e+01,9.695552238334867456e-02
1.009447671274912217e+01,5.261837242041395513e+01,1.085430021032214309e-01
1.005896073222771214e+01,5.281269333761397888e+01,1.204810235149137571e-01
1.022883407623540819e+01,5.264140369866350966e+01,1.320528438309066244e-01
1.020740356762578038e+01,5.251651813006090919e+01,1.438764207396849015e-01
1.005427472598457506e+01,5.261657994940994598e+01,1.572527149537440716e-01
