nan,nan,2.112140116531751599e-01
1.190272285365098703e+01,5.092356632759539536e+01,2.225610550727328274e-01
1.167767000431121183e+01,5.092696605069780702e+01,2.352983630560670780e-01
1.169010094105485820e+01,5.078966536570109724e+01,2.463834038499841395e-01
1.164464543960481002e+01,5.098851177845559590e+01,2.576868485598383107e-01
1.183458422161502277e+01,5.095950697293666565e+01,2.687375115833033901e-01
1.177716203258309946e+01,5.083059766522327294e+01,2.798450025025940313e-01
1.185555155725517729e+01,5.096938988244608026e+01,2.911559035839066389e-01
1.162800981938026368e+01,5.076744946513594670e+01,3.030935054017739327e-01
1.192178081735306705e+01,5.092465249602150124e+01,3.144517427094790096e-01
1.167425346300555056e+01,5.097307884503959485e+01,3.261638622415726219e-01
