49.3006719,7.16056777272664,0.259199978263454
49.3006719,7.18934592699653,0.259199978263454
49.3006719,7.196540465564,0.259199978263454
49.3006719,7.20373500413148,0.273429982649046
49.3006719,7.21092954269895,0.269939569038918
49.3006719,7.21812408126643,0.259199978263454
49.3006719,7.2253186198339,0.259199978263454
49.3052015348447,7.13178961845674,0.259199978263454
49.3052015348447,7.13898415702421,0.259199978263454
49.3052015348447,7.14617869559169,0.259199978263454
49.3052015348447,7.15337323415916,0.259199978263454
49.3052015348447,7.16056777272664,0.259199978263454
49.3052015348447,7.16776231129411,0.259199978263454
49.3052015348447,7.17495684986158,0.259199978263454
49.3052015348447,7.18215138842906,0.259199978263454
49.3052015348447,7.18934592699653,0.26407552562153
49.3052015348447,7.196540465564,0.271180199211314
49.3052015348447,7.20373500413148,0.259199978263454
49.3052015348447,7.21092954269895,0.259199978263454
49.3052015348447,7.21812408126643,0.259199978263454
49.3052015348447,7.2253186198339,0.259199978263454
49.3052015348447,7.23251315840137,0.259199978263454
49.3052015348447,7.23970769696885,0.259199978263454
49.3097311696894,7.11740054132179,0.259723707933339
49.3097311696894,7.12459507988927,0.402656307520429
49.3097311696894,7.13178961845674,0.282062219210268
49.3097311696894,7.13898415702421,0.223556826217962
49.3097311696894,7.14617869559169,0.274261420754426
49.3097311696894,7.15337323415916,0.249484194900501
49.3097311696894,7.16056777272664,0.260099133918693
49.3097311696894,7.16776231129411,0.264951604215274
49.3097311696894,7.17495684986158,0.260077346736122
49.3097311696894,7.18215138842906,0.259199978263454
49.3097311696894,7.18934592699653,0.273431352459329
49.3097311696894,7.196540465564,0.282793827202022
49.3097311696894,7.20373500413148,0.259199978263454
49.3097311696894,7.21092954269895,0.259199978263454
49.3097311696894,7.21812408126643,0.259199978263454
49.3097311696894,7.2253186198339,0.259199978263454
49.3097311696894,7.23251315840137,0.259199978263454
49.3097311696894,7.23970769696885,0.259199978263454
49.3097311696894,7.24690223553632,0.259199978263454
49.3142608045341,7.11020600275432,0.259199978263454
49.3142608045341,7.11740054132179,0.251319900315504
49.3142608045341,7.12459507988927,0.468435704851804
49.3142608045341,7.13178961845674,0.512807103921592
49.3142608045341,7.13898415702421,0.297532680572104
49.3142608045341,7.14617869559169,0.357409147713012
49.3142608045341,7.15337323415916,0.543513742133587
49.3142608045341,7.16056777272664,0.262344771855884
49.3142608045341,7.16776231129411,0.259316571627259
49.3142608045341,7.17495684986158,0.259199978263454
49.3142608045341,7.18215138842906,0.259199978263454
49.3142608045341,7.18934592699653,0.259199978263454
49.3142608045341,7.196540465564,0.259199978263454
49.3142608045341,7.20373500413148,0.259199978263454
49.3142608045341,7.21092954269895,0.259199978263454
49.3142608045341,7.21812408126643,0.259199978263454
49.3142608045341,7.2253186198339,0.256434690951063
49.3142608045341,7.23251315840137,0.259199978263454
49.3187904393788,7.11020600275432,0.259199978263454
49.3187904393788,7.11740054132179,0.229919635089762
49.3187904393788,7.12459507988927,0.349059799762878
49.3187904393788,7.13178961845674,0.457532482660059
49.3187904393788,7.13898415702421,0.325159563793521
49.3187904393788,7.14617869559169,0.475349595506168
49.3187904393788,7.15337323415916,0.372480024232727
49.3187904393788,7.16056777272664,0.279494986306969
49.3187904393788,7.16776231129411,0.259199978263454
49.3187904393788,7.17495684986158,0.259199978263454
49.3187904393788,7.18215138842906,0.259199978263454
49.3187904393788,7.18934592699653,0.259199978263454
49.3187904393788,7.196540465564,0.259199978263454
49.3187904393788,7.20373500413148,0.252643993971964
49.3187904393788,7.21092954269895,0.260669168680816
49.3187904393788,7.21812408126643,0.291825886097636
49.3187904393788,7.2253186198339,0.283929882090084
49.3187904393788,7.23251315840137,0.377437867688314
49.3187904393788,7.23970769696885,0.284827543420066
49.3187904393788,7.24690223553632,0.259199978263454
49.3233200742235,7.11740054132179,0.253751411470235
49.3233200742235,7.12459507988927,0.240661586192813
49.3233200742235,7.13178961845674,0.297805196060415
49.3233200742235,7.13898415702421,0.264192447944327
49.3233200742235,7.14617869559169,0.259199978263454
49.3233200742235,7.15337323415916,0.259199978263454
49.3233200742235,7.16056777272664,0.259199978263454
49.3233200742235,7.16776231129411,0.259199978263454
49.3233200742235,7.17495684986158,0.259199978263454
49.3233200742235,7.18215138842906,0.259199978263454
49.3233200742235,7.18934592699653,0.259199978263454
49.3233200742235,7.196540465564,0.272245706338444
49.3233200742235,7.20373500413148,0.27629760848088
49.3233200742235,7.21092954269895,0.261984341341604
49.3233200742235,7.21812408126643,0.569601655741833
49.3233200742235,7.2253186198339,0.378607521662697
49.3233200742235,7.23251315840137,0.262593621194963
49.3233200742235,7.23970769696885,0.258520005169421
49.3233200742235,7.24690223553632,0.259199978263454
49.3233200742235,7.25409677410379,0.259199978263454
49.3233200742235,7.26129131267127,0.259199978263454
49.3278497090682,7.11020600275432,0.259199978263454
49.3278497090682,7.11740054132179,0.280498704042656
49.3278497090682,7.12459507988927,0.259199978263454
49.3278497090682,7.13178961845674,0.259199978263454
49.3278497090682,7.13898415702421,0.339124245363913
49.3278497090682,7.14617869559169,0.35327347259743
49.3278497090682,7.15337323415916,0.259199978263454
49.3278497090682,7.16056777272664,0.259199978263454
49.3278497090682,7.16776231129411,0.36315277616637
49.3278497090682,7.17495684986158,0.23704532141015
49.3278497090682,7.18215138842906,0.263136249860839
49.3278497090682,7.18934592699653,0.227539700656574
49.3278497090682,7.196540465564,0.324224536370531
49.3278497090682,7.20373500413148,0.275873211780143
49.3278497090682,7.21092954269895,0.259373954931115
49.3278497090682,7.21812408126643,0.420595853799916
49.3278497090682,7.2253186198339,0.230663657538163
49.3278497090682,7.23251315840137,0.238228274761337
49.3278497090682,7.23970769696885,0.237700902782053
49.3278497090682,7.24690223553632,0.25180716471641
49.3323793439129,7.06703877134948,0.259199978263454
49.3323793439129,7.11020600275432,0.273106508930875
49.3323793439129,7.11740054132179,0.402581002583754
49.3323793439129,7.12459507988927,0.291479304561036
49.3323793439129,7.13178961845674,0.272236334632864
49.3323793439129,7.13898415702421,0.307468712675331
49.3323793439129,7.14617869559169,0.28844105677655
49.3323793439129,7.15337323415916,0.272466413243179
49.3323793439129,7.16056777272664,0.244533182586478
49.3323793439129,7.16776231129411,0.348134699065856
49.3323793439129,7.17495684986158,0.28876814139071
49.3323793439129,7.18215138842906,0.343937473536573
49.3323793439129,7.18934592699653,0.337750197493571
49.3323793439129,7.196540465564,0.287625943375857
49.3323793439129,7.20373500413148,0.259199978263454
49.3323793439129,7.21092954269895,0.259199978263454
49.3323793439129,7.21812408126643,0.410915909027843
49.3323793439129,7.2253186198339,0.297817661114979
49.3323793439129,7.23251315840137,0.261768238494093
49.3323793439129,7.23970769696885,0.259199978263454
49.3369089787576,7.06703877134948,0.259199978263454
49.3369089787576,7.11740054132179,0.259199978263454
49.3369089787576,7.12459507988927,0.265988240442339
49.3369089787576,7.13178961845674,0.259199978263454
49.3369089787576,7.13898415702421,0.259199978263454
49.3369089787576,7.14617869559169,0.26695934909975
49.3369089787576,7.15337323415916,0.279524480521897
49.3369089787576,7.16056777272664,0.253002814259413
49.3369089787576,7.16776231129411,0.348410516823062
49.3369089787576,7.17495684986158,0.324651014473968
49.3369089787576,7.18215138842906,0.482048437608996
49.3369089787576,7.18934592699653,0.597337142294915
49.3369089787576,7.196540465564,0.296189789692098
49.3369089787576,7.20373500413148,0.259199978263454
49.3369089787576,7.21092954269895,0.259199978263454
49.3369089787576,7.21812408126643,0.247103483034505
49.3369089787576,7.2253186198339,0.255758891142109
49.3369089787576,7.23251315840137,0.259199978263454
49.3414386136023,7.06703877134948,0.259199978263454
49.3414386136023,7.09581692561937,0.259199978263454
49.3414386136023,7.10301146418684,0.259199978263454
49.3414386136023,7.11020600275432,0.259199978263454
49.3414386136023,7.11740054132179,0.259199978263454
49.3414386136023,7.12459507988927,0.318816581846039
49.3414386136023,7.13178961845674,0.278170571475623
49.3414386136023,7.13898415702421,0.259199978263454
49.3414386136023,7.14617869559169,0.248756164731025
49.3414386136023,7.15337323415916,0.255822019978035
49.3414386136023,7.16056777272664,0.259205334098312
49.3414386136023,7.16776231129411,0.410491576183615
49.3414386136023,7.17495684986158,0.415140816698594
49.3414386136023,7.18215138842906,0.520469270642239
49.3414386136023,7.18934592699653,0.465106893651657
49.3414386136023,7.196540465564,0.336527775793772
49.3414386136023,7.20373500413148,0.361126411557019
49.3414386136023,7.21092954269895,0.359109959322698
49.3414386136023,7.21812408126643,0.277797260364479
49.3414386136023,7.2253186198339,0.27543465330666
49.3414386136023,7.23251315840137,0.281394267737089
49.345968248447,7.04545515564705,0.308312261317553
49.345968248447,7.05264969421453,0.300738797477435
49.345968248447,7.059844232782,0.259199978263454
49.345968248447,7.06703877134948,0.259199978263454
49.345968248447,7.07423330991695,0.259199978263454
49.345968248447,7.08142784848442,0.259199978263454
49.345968248447,7.0886223870519,0.259199978263454
49.345968248447,7.09581692561937,0.295345819174848
49.345968248447,7.10301146418684,0.259199978263454
49.345968248447,7.11020600275432,0.259199978263454
49.345968248447,7.11740054132179,0.298161987442466
49.345968248447,7.12459507988927,0.362373242564793
49.345968248447,7.13178961845674,0.259199978263454
49.345968248447,7.13898415702421,0.259199978263454
49.345968248447,7.14617869559169,0.246572894342424
49.345968248447,7.15337323415916,0.246597369884234
49.345968248447,7.16056777272664,0.39254250342455
49.345968248447,7.16776231129411,0.468483250146437
49.345968248447,7.17495684986158,0.430486962127687
49.345968248447,7.18215138842906,0.658436250123068
49.345968248447,7.18934592699653,0.498414901394369
49.345968248447,7.196540465564,0.412231580151436
49.345968248447,7.20373500413148,0.434475710948919
49.345968248447,7.21092954269895,0.416563212961375
49.345968248447,7.21812408126643,0.479887150114109
49.345968248447,7.2253186198339,0.388424163252169
49.345968248447,7.23251315840137,0.312012201379809
49.3504978832917,7.01667700137716,0.259199978263454
49.3504978832917,7.02387153994463,0.259199978263454
49.3504978832917,7.03106607851211,0.259199978263454
49.3504978832917,7.03826061707958,0.259199978263454
49.3504978832917,7.04545515564705,0.273267990358038
49.3504978832917,7.05264969421453,0.351365909337555
49.3504978832917,7.059844232782,0.267727774546754
49.3504978832917,7.06703877134948,0.271251577209727
49.3504978832917,7.07423330991695,0.332339066705911
49.3504978832917,7.08142784848442,0.279840395205614
49.3504978832917,7.0886223870519,0.265534654939373
49.3504978832917,7.09581692561937,0.4744546193545
49.3504978832917,7.10301146418684,0.266522337341452
49.3504978832917,7.11020600275432,0.279104070251568
49.3504978832917,7.11740054132179,0.260709126377461
49.3504978832917,7.12459507988927,0.263898213323604
49.3504978832917,7.13178961845674,0.258750135707522
49.3504978832917,7.13898415702421,0.304604017041282
49.3504978832917,7.14617869559169,0.35141125901445
49.3504978832917,7.15337323415916,0.259199978263454
49.3504978832917,7.16056777272664,0.329532677013177
49.3504978832917,7.16776231129411,0.424303066195324
49.3504978832917,7.17495684986158,0.711404074918982
49.3504978832917,7.18215138842906,0.486147940986654
49.3504978832917,7.18934592699653,0.285556794279011
49.3504978832917,7.196540465564,0.637420751801767
49.3504978832917,7.20373500413148,0.387053360465232
49.3504978832917,7.21092954269895,0.340976933071086
49.3504978832917,7.21812408126643,0.312732688384053
49.3504978832917,7.2253186198339,0.427926411585867
49.3504978832917,7.23251315840137,0.279657934692616
49.3504978832917,7.23970769696885,0.314405607536416
49.3550275181364,7.02387153994463,0.259199978263454
49.3550275181364,7.03106607851211,0.259199978263454
49.3550275181364,7.03826061707958,0.259199978263454
49.3550275181364,7.04545515564705,0.259199978263454
49.3550275181364,7.05264969421453,0.466654092525387
49.3550275181364,7.059844232782,0.507934725806495
49.3550275181364,7.06703877134948,0.255918278738121
49.3550275181364,7.07423330991695,0.329026610578212
49.3550275181364,7.08142784848442,0.27561424407351
49.3550275181364,7.0886223870519,0.298919661545733
49.3550275181364,7.09581692561937,0.442084818785053
49.3550275181364,7.10301146418684,0.425579742586248
49.3550275181364,7.11020600275432,0.34924721444158
49.3550275181364,7.11740054132179,0.245119720844512
49.3550275181364,7.12459507988927,0.243359940936629
49.3550275181364,7.13178961845674,0.425663944568664
49.3550275181364,7.13898415702421,0.320734347644607
49.3550275181364,7.14617869559169,0.269852810119781
49.3550275181364,7.15337323415916,0.259199978263454
49.3550275181364,7.16056777272664,0.259199978263454
49.3550275181364,7.16776231129411,0.233309033515821
49.3550275181364,7.17495684986158,0.331954475946892
49.3550275181364,7.18215138842906,0.428595657163718
49.3550275181364,7.18934592699653,0.369032813058629
49.3550275181364,7.196540465564,0.310599466049866
49.3550275181364,7.20373500413148,0.357538364039359
49.3550275181364,7.21092954269895,0.32711869579443
49.3550275181364,7.21812408126643,0.284582617271271
49.3550275181364,7.2253186198339,0.289150231805819
49.3550275181364,7.23251315840137,0.259199978263454
49.3550275181364,7.23970769696885,0.273466410068495
49.3595571529811,6.96631523140484,0.259199978263454
49.3595571529811,6.97350976997232,0.279538177992297
49.3595571529811,6.98070430853979,0.319097740850774
49.3595571529811,6.98789884710726,0.259199978263454
49.3595571529811,6.99509338567474,0.259199978263454
49.3595571529811,7.00228792424221,0.259199978263454
49.3595571529811,7.00948246280969,0.260066197634236
49.3595571529811,7.01667700137716,0.298875624570759
49.3595571529811,7.02387153994463,0.259199978263454
49.3595571529811,7.03106607851211,0.259199978263454
49.3595571529811,7.03826061707958,0.259199978263454
49.3595571529811,7.04545515564705,0.319318119752236
49.3595571529811,7.05264969421453,0.467189848728527
49.3595571529811,7.059844232782,0.579550917712732
49.3595571529811,7.06703877134948,0.328537796000653
49.3595571529811,7.07423330991695,0.339495463629257
49.3595571529811,7.08142784848442,0.274482430205503
49.3595571529811,7.0886223870519,0.271041215888822
49.3595571529811,7.09581692561937,0.326135274745658
49.3595571529811,7.10301146418684,0.393399219052423
49.3595571529811,7.11020600275432,0.371379497917035
49.3595571529811,7.11740054132179,0.287759126505225
49.3595571529811,7.12459507988927,0.320848738842634
49.3595571529811,7.13178961845674,0.492818861535802
49.3595571529811,7.13898415702421,0.304317946144528
49.3595571529811,7.14617869559169,0.259199978263454
49.3595571529811,7.15337323415916,0.259199978263454
49.3595571529811,7.16056777272664,0.259199978263454
49.3595571529811,7.16776231129411,0.259199978263454
49.3595571529811,7.17495684986158,0.243557964512396
49.3595571529811,7.18215138842906,0.251707069717903
49.3595571529811,7.18934592699653,0.237580427858195
49.3595571529811,7.196540465564,0.259199978263454
49.3595571529811,7.20373500413148,0.259199978263454
49.3595571529811,7.21092954269895,0.259199978263454
49.3595571529811,7.21812408126643,0.259199978263454
49.3595571529811,7.2253186198339,0.259199978263454
49.3595571529811,7.23251315840137,0.259199978263454
49.3640867878258,6.95912069283737,0.259199978263454
49.3640867878258,6.96631523140484,0.259199978263454
49.3640867878258,6.97350976997232,0.259199978263454
49.3640867878258,6.98070430853979,0.259199978263454
49.3640867878258,6.98789884710726,0.259199978263454
49.3640867878258,6.99509338567474,0.259199978263454
49.3640867878258,7.00228792424221,0.259199978263454
49.3640867878258,7.00948246280969,0.315978293998672
49.3640867878258,7.01667700137716,0.328785742748237
49.3640867878258,7.02387153994463,0.259199978263454
49.3640867878258,7.03106607851211,0.260137216161751
49.3640867878258,7.03826061707958,0.302542590004194
49.3640867878258,7.04545515564705,0.26711946666542
49.3640867878258,7.05264969421453,0.279492290540663
49.3640867878258,7.059844232782,0.334013655198417
49.3640867878258,7.06703877134948,0.389935054016109
49.3640867878258,7.07423330991695,0.385685857726958
49.3640867878258,7.08142784848442,0.378910042661328
49.3640867878258,7.0886223870519,0.237100149587
49.3640867878258,7.09581692561937,0.228086492413066
49.3640867878258,7.10301146418684,0.259199978263454
49.3640867878258,7.11020600275432,0.259199978263454
49.3640867878258,7.11740054132179,0.253617698319464
49.3640867878258,7.12459507988927,0.310329600500356
49.3640867878258,7.13178961845674,0.345174708899132
49.3640867878258,7.13898415702421,0.232547885988225
49.3640867878258,7.14617869559169,0.25337706230224
49.3640867878258,7.15337323415916,0.259199978263454
49.3640867878258,7.16056777272664,0.259199978263454
49.3640867878258,7.16776231129411,0.259199978263454
49.3640867878258,7.17495684986158,0.237485509928386
49.3640867878258,7.18215138842906,0.290030632362455
49.3640867878258,7.18934592699653,0.301108122813757
49.3640867878258,7.196540465564,0.259199978263454
49.3640867878258,7.20373500413148,0.24682437113395
49.3640867878258,7.21092954269895,0.241604392667066
49.3640867878258,7.21812408126643,0.259199978263454
49.3686164226705,6.95912069283737,0.259199978263454
49.3686164226705,6.96631523140484,0.259199978263454
49.3686164226705,6.97350976997232,0.257450669230612
49.3686164226705,6.98070430853979,0.418508722594005
49.3686164226705,6.98789884710726,0.323295083940237
49.3686164226705,6.99509338567474,0.268480508816636
49.3686164226705,7.00228792424221,0.279585753378999
49.3686164226705,7.00948246280969,0.325305262274169
49.3686164226705,7.01667700137716,0.26652029152337
49.3686164226705,7.02387153994463,0.259199978263454
49.3686164226705,7.03106607851211,0.388372418481821
49.3686164226705,7.03826061707958,0.418727277085614
49.3686164226705,7.04545515564705,0.320803086131463
49.3686164226705,7.05264969421453,0.313112937495049
49.3686164226705,7.059844232782,0.270067901188572
49.3686164226705,7.06703877134948,0.291226308343334
49.3686164226705,7.07423330991695,0.274230549846322
49.3686164226705,7.08142784848442,0.473715768243642
49.3686164226705,7.0886223870519,0.509942258809632
49.3686164226705,7.09581692561937,0.258462908059519
49.3686164226705,7.10301146418684,0.259199978263454
49.3686164226705,7.11020600275432,0.259199978263454
49.3686164226705,7.11740054132179,0.233415815225409
49.3686164226705,7.12459507988927,0.375161981586576
49.3686164226705,7.13178961845674,0.588087681239349
49.3686164226705,7.13898415702421,0.494497266384444
49.3686164226705,7.14617869559169,0.259199978263454
49.3686164226705,7.15337323415916,0.278419669716552
49.3686164226705,7.16056777272664,0.271412619216133
49.3686164226705,7.16776231129411,0.277840097804102
49.3686164226705,7.17495684986158,0.314880538221816
49.3686164226705,7.18215138842906,0.416229997230232
49.3686164226705,7.18934592699653,0.519618152013697
49.3686164226705,7.196540465564,0.337211248878828
49.3686164226705,7.20373500413148,0.259098180784801
49.3686164226705,7.21092954269895,0.256006675923495
49.3686164226705,7.21812408126643,0.259199978263454
49.3731460575152,6.95912069283737,0.259199978263454
49.3731460575152,6.96631523140484,0.259199978263454
49.3731460575152,6.97350976997232,0.337345607923965
49.3731460575152,6.98070430853979,0.458199267206864
49.3731460575152,6.98789884710726,0.357233789332242
49.3731460575152,6.99509338567474,0.29996380987892
49.3731460575152,7.00228792424221,0.316562454226146
49.3731460575152,7.00948246280969,0.273659217006092
49.3731460575152,7.01667700137716,0.366739067216793
49.3731460575152,7.02387153994463,0.26459637434411
49.3731460575152,7.03106607851211,0.305288765208362
49.3731460575152,7.03826061707958,0.322154821068461
49.3731460575152,7.04545515564705,0.284206506199811
49.3731460575152,7.05264969421453,0.455986910232189
49.3731460575152,7.059844232782,0.399993154689287
49.3731460575152,7.06703877134948,0.267709487240859
49.3731460575152,7.07423330991695,0.342043117807172
49.3731460575152,7.08142784848442,0.491309633398117
49.3731460575152,7.0886223870519,0.492973133575792
49.3731460575152,7.09581692561937,0.333817638017226
49.3731460575152,7.10301146418684,0.259199978263454
49.3731460575152,7.11020600275432,0.259199978263454
49.3731460575152,7.11740054132179,0.24405521459759
49.3731460575152,7.12459507988927,0.429032034075785
49.3731460575152,7.13178961845674,0.406533291661207
49.3731460575152,7.13898415702421,0.287906943455288
49.3731460575152,7.14617869559169,0.259199978263454
49.3731460575152,7.15337323415916,0.268587281296175
49.3731460575152,7.16056777272664,0.263332662568439
49.3731460575152,7.16776231129411,0.341603278297405
49.3731460575152,7.17495684986158,0.452783182935953
49.3731460575152,7.18215138842906,0.524650560974709
49.3731460575152,7.18934592699653,0.427679547965909
49.3731460575152,7.196540465564,0.302407876156176
49.3731460575152,7.20373500413148,0.259199978263454
49.3731460575152,7.21092954269895,0.259199978263454
49.3731460575152,7.21812408126643,0.259199978263454
49.3731460575152,7.2253186198339,0.259199978263454
49.3776756923599,6.94473161570242,0.259199978263454
49.3776756923599,6.9519261542699,0.250958294854584
49.3776756923599,6.95912069283737,0.259199978263454
49.3776756923599,6.96631523140484,0.259199978263454
49.3776756923599,6.97350976997232,0.276017154858238
49.3776756923599,6.98070430853979,0.259199978263454
49.3776756923599,6.98789884710726,0.310567200653607
49.3776756923599,6.99509338567474,0.374904874555413
49.3776756923599,7.00228792424221,0.280398341024764
49.3776756923599,7.00948246280969,0.34835016851295
49.3776756923599,7.01667700137716,0.56372287273569
49.3776756923599,7.02387153994463,0.371915102193314
49.3776756923599,7.03106607851211,0.259199978263454
49.3776756923599,7.03826061707958,0.284998827886034
49.3776756923599,7.04545515564705,0.345181000359524
49.3776756923599,7.05264969421453,0.455072631006787
49.3776756923599,7.059844232782,0.295945382747815
49.3776756923599,7.06703877134948,0.259199978263454
49.3776756923599,7.07423330991695,0.266892559274389
49.3776756923599,7.08142784848442,0.249151889908701
49.3776756923599,7.0886223870519,0.352201248300663
49.3776756923599,7.09581692561937,0.344371919381585
49.3776756923599,7.10301146418684,0.260957969804402
49.3776756923599,7.11020600275432,0.259199978263454
49.3776756923599,7.11740054132179,0.268796192408295
49.3776756923599,7.12459507988927,0.295717099131451
49.3776756923599,7.13178961845674,0.268442328844826
49.3776756923599,7.13898415702421,0.265363688411428
49.3776756923599,7.14617869559169,0.284304262198917
49.3776756923599,7.15337323415916,0.259199978263454
49.3776756923599,7.16056777272664,0.259199978263454
49.3776756923599,7.16776231129411,0.266690347057189
49.3776756923599,7.17495684986158,0.256266468978936
49.3776756923599,7.18215138842906,0.294237136801047
49.3776756923599,7.18934592699653,0.263028724297865
49.3776756923599,7.196540465564,0.259199978263454
49.3776756923599,7.20373500413148,0.259199978263454
49.3776756923599,7.21092954269895,0.287913166179049
49.3776756923599,7.21812408126643,0.313016421653332
49.3776756923599,7.2253186198339,0.25524924953667
49.3776756923599,7.23251315840137,0.259199978263454
49.3822053272046,6.94473161570242,0.259199978263454
49.3822053272046,6.9519261542699,0.275008618403738
49.3822053272046,6.95912069283737,0.277253152575699
49.3822053272046,6.96631523140484,0.266182148877014
49.3822053272046,6.97350976997232,0.259199978263454
49.3822053272046,6.98070430853979,0.259199978263454
49.3822053272046,6.98789884710726,0.259199978263454
49.3822053272046,6.99509338567474,0.219424535341382
49.3822053272046,7.00228792424221,0.236342083834101
49.3822053272046,7.00948246280969,0.232700877284399
49.3822053272046,7.01667700137716,0.341156273120529
49.3822053272046,7.02387153994463,0.342390488862339
49.3822053272046,7.03106607851211,0.259199978263454
49.3822053272046,7.03826061707958,0.256416677105414
49.3822053272046,7.04545515564705,0.209118131212431
49.3822053272046,7.05264969421453,0.266843165750104
49.3822053272046,7.059844232782,0.259199978263454
49.3822053272046,7.06703877134948,0.259199978263454
49.3822053272046,7.07423330991695,0.288454785175435
49.3822053272046,7.08142784848442,0.256059536587749
49.3822053272046,7.0886223870519,0.278538823643795
49.3822053272046,7.09581692561937,0.284830865236225
49.3822053272046,7.10301146418684,0.259199978263454
49.3822053272046,7.11020600275432,0.259199978263454
49.3822053272046,7.11740054132179,0.337024446117249
49.3822053272046,7.12459507988927,0.27718478181496
49.3822053272046,7.13178961845674,0.259199978263454
49.3822053272046,7.13898415702421,0.259199978263454
49.3822053272046,7.14617869559169,0.247999034927285
49.3822053272046,7.15337323415916,0.256658621201785
49.3822053272046,7.16056777272664,0.259199978263454
49.3822053272046,7.16776231129411,0.259199978263454
49.3822053272046,7.17495684986158,0.259199978263454
49.3822053272046,7.18215138842906,0.268258170532937
49.3822053272046,7.18934592699653,0.259199978263454
49.3822053272046,7.196540465564,0.259199978263454
49.3822053272046,7.20373500413148,0.345295052209044
49.3822053272046,7.21092954269895,0.337404657728117
49.3822053272046,7.21812408126643,0.271268747548214
49.3822053272046,7.2253186198339,0.267960031796592
49.3822053272046,7.23251315840137,0.259199978263454
49.3867349620493,6.94473161570242,0.259199978263454
49.3867349620493,6.9519261542699,0.345150577921583
49.3867349620493,6.95912069283737,0.309685252918892
49.3867349620493,6.96631523140484,0.276792692654821
49.3867349620493,6.97350976997232,0.259199978263454
49.3867349620493,6.98070430853979,0.259199978263454
49.3867349620493,6.98789884710726,0.259199978263454
49.3867349620493,6.99509338567474,0.289895232305576
49.3867349620493,7.00228792424221,0.337527998075774
49.3867349620493,7.00948246280969,0.321941768931133
49.3867349620493,7.01667700137716,0.235066066303802
49.3867349620493,7.02387153994463,0.259199978263454
49.3867349620493,7.03106607851211,0.259199978263454
49.3867349620493,7.03826061707958,0.286655826292097
49.3867349620493,7.04545515564705,0.272912108747807
49.3867349620493,7.05264969421453,0.259199978263454
49.3867349620493,7.059844232782,0.301698309665947
49.3867349620493,7.06703877134948,0.371412518599951
49.3867349620493,7.07423330991695,0.431371815875764
49.3867349620493,7.08142784848442,0.293760590661561
49.3867349620493,7.0886223870519,0.259786778695038
49.3867349620493,7.09581692561937,0.259199978263454
49.3867349620493,7.10301146418684,0.259199978263454
49.3867349620493,7.11020600275432,0.344138976275447
49.3867349620493,7.11740054132179,0.348189942216731
49.3867349620493,7.12459507988927,0.259199978263454
49.3867349620493,7.13178961845674,0.259199978263454
49.3867349620493,7.13898415702421,0.259199978263454
49.3867349620493,7.14617869559169,0.259199978263454
49.3867349620493,7.15337323415916,0.259199978263454
49.3867349620493,7.16056777272664,0.259199978263454
49.3867349620493,7.16776231129411,0.259199978263454
49.3867349620493,7.17495684986158,0.307587898660538
49.3867349620493,7.18215138842906,0.298016388149534
49.3867349620493,7.18934592699653,0.259199978263454
49.3867349620493,7.196540465564,0.259199978263454
49.3867349620493,7.20373500413148,0.286397686171082
49.3867349620493,7.21092954269895,0.319963188409916
49.3867349620493,7.21812408126643,0.259199978263454
49.3867349620493,7.2253186198339,0.259199978263454
49.3867349620493,7.23251315840137,0.259199978263454
49.3867349620493,7.23970769696885,0.259199978263454
49.3867349620493,7.24690223553632,0.259199978263454
49.391264596894,6.94473161570242,0.259199978263454
49.391264596894,6.9519261542699,0.259199978263454
49.391264596894,6.95912069283737,0.259199978263454
49.391264596894,6.96631523140484,0.259199978263454
49.391264596894,6.97350976997232,0.259199978263454
49.391264596894,6.98070430853979,0.259199978263454
49.391264596894,6.98789884710726,0.259199978263454
49.391264596894,6.99509338567474,0.275773845016041
49.391264596894,7.00228792424221,0.294309388931263
49.391264596894,7.00948246280969,0.289234316173267
49.391264596894,7.01667700137716,0.256278692784913
49.391264596894,7.02387153994463,0.259199978263454
49.391264596894,7.03106607851211,0.259199978263454
49.391264596894,7.03826061707958,0.265282627075457
49.391264596894,7.04545515564705,0.259199978263454
49.391264596894,7.05264969421453,0.259199978263454
49.391264596894,7.059844232782,0.364787920995593
49.391264596894,7.06703877134948,0.315921917057826
49.391264596894,7.07423330991695,0.445659030251457
49.391264596894,7.08142784848442,0.264427473077087
49.391264596894,7.0886223870519,0.405951679537186
49.391264596894,7.09581692561937,0.342421127582145
49.391264596894,7.10301146418684,0.259199978263454
49.391264596894,7.11020600275432,0.225441920813188
49.391264596894,7.11740054132179,0.440340894273808
49.391264596894,7.12459507988927,0.271078834799299
49.391264596894,7.13178961845674,0.278982927123851
49.391264596894,7.13898415702421,0.264321228130702
49.391264596894,7.14617869559169,0.259199978263454
49.391264596894,7.15337323415916,0.259199978263454
49.391264596894,7.16056777272664,0.259199978263454
49.391264596894,7.16776231129411,0.264352640650175
49.391264596894,7.17495684986158,0.28393438981438
49.391264596894,7.18215138842906,0.2597315027711
49.391264596894,7.18934592699653,0.259199978263454
49.391264596894,7.196540465564,0.259199978263454
49.391264596894,7.20373500413148,0.259199978263454
49.391264596894,7.21092954269895,0.259199978263454
49.391264596894,7.21812408126643,0.259199978263454
49.391264596894,7.2253186198339,0.259199978263454
49.391264596894,7.23251315840137,0.259199978263454
49.391264596894,7.23970769696885,0.27530786311332
49.391264596894,7.24690223553632,0.250815447069385
49.3957942317387,6.93753707713495,0.259199978263454
49.3957942317387,6.94473161570242,0.259199978263454
49.3957942317387,6.9519261542699,0.259199978263454
49.3957942317387,6.95912069283737,0.259199978263454
49.3957942317387,6.96631523140484,0.259199978263454
49.3957942317387,6.97350976997232,0.259199978263454
49.3957942317387,6.98070430853979,0.259199978263454
49.3957942317387,6.98789884710726,0.412128457507481
49.3957942317387,6.99509338567474,0.280421103764023
49.3957942317387,7.00228792424221,0.260779275231223
49.3957942317387,7.00948246280969,0.376051931066862
49.3957942317387,7.01667700137716,0.259199978263454
49.3957942317387,7.02387153994463,0.259199978263454
49.3957942317387,7.03106607851211,0.266898739145973
49.3957942317387,7.03826061707958,0.289643118613408
49.3957942317387,7.04545515564705,0.291193085658777
49.3957942317387,7.05264969421453,0.260359267977048
49.3957942317387,7.059844232782,0.365195828115399
49.3957942317387,7.06703877134948,0.259199978263454
49.3957942317387,7.07423330991695,0.226554950406296
49.3957942317387,7.08142784848442,0.3107712990774
49.3957942317387,7.0886223870519,0.362104161490708
49.3957942317387,7.09581692561937,0.287232706511256
49.3957942317387,7.10301146418684,0.26908514020963
49.3957942317387,7.11020600275432,0.228842138832451
49.3957942317387,7.11740054132179,0.318737513212767
49.3957942317387,7.12459507988927,0.259199978263454
49.3957942317387,7.13178961845674,0.281554705754346
49.3957942317387,7.13898415702421,0.266049167842811
49.3957942317387,7.14617869559169,0.259199978263454
49.3957942317387,7.15337323415916,0.259199978263454
49.3957942317387,7.16056777272664,0.29858734162449
49.3957942317387,7.16776231129411,0.263539042247636
49.3957942317387,7.17495684986158,0.274604623741931
49.3957942317387,7.18215138842906,0.259199978263454
49.3957942317387,7.18934592699653,0.259199978263454
49.3957942317387,7.196540465564,0.259199978263454
49.3957942317387,7.20373500413148,0.259199978263454
49.3957942317387,7.21092954269895,0.259199978263454
49.3957942317387,7.21812408126643,0.259199978263454
49.3957942317387,7.2253186198339,0.259199978263454
49.3957942317387,7.23251315840137,0.259199978263454
49.3957942317387,7.23970769696885,0.282287999483147
49.3957942317387,7.24690223553632,0.234733602882102
49.3957942317387,7.25409677410379,0.305791122298556
49.4003238665834,6.93034253856747,0.259199978263454
49.4003238665834,6.93753707713495,0.400039217526702
49.4003238665834,6.94473161570242,0.291880008086118
49.4003238665834,6.9519261542699,0.276052817328551
49.4003238665834,6.95912069283737,0.294430941488134
49.4003238665834,6.96631523140484,0.248672961900682
49.4003238665834,6.97350976997232,0.276135336940936
49.4003238665834,6.98070430853979,0.346495695479794
49.4003238665834,6.98789884710726,0.288112530942832
49.4003238665834,6.99509338567474,0.255133162393127
49.4003238665834,7.00228792424221,0.260856089457629
49.4003238665834,7.00948246280969,0.259199978263454
49.4003238665834,7.01667700137716,0.259199978263454
49.4003238665834,7.02387153994463,0.259199978263454
49.4003238665834,7.03106607851211,0.415423786949763
49.4003238665834,7.03826061707958,0.361288999543452
49.4003238665834,7.04545515564705,0.26041792806369
49.4003238665834,7.05264969421453,0.259199978263454
49.4003238665834,7.059844232782,0.259199978263454
49.4003238665834,7.06703877134948,0.24288724532993
49.4003238665834,7.07423330991695,0.24230766983262
49.4003238665834,7.08142784848442,0.294132976649237
49.4003238665834,7.0886223870519,0.365385366643266
49.4003238665834,7.09581692561937,0.221392705881118
49.4003238665834,7.10301146418684,0.332563177731677
49.4003238665834,7.11020600275432,0.259199978263454
49.4003238665834,7.11740054132179,0.259199978263454
49.4003238665834,7.12459507988927,0.259199978263454
49.4003238665834,7.13178961845674,0.259199978263454
49.4003238665834,7.13898415702421,0.259199978263454
49.4003238665834,7.14617869559169,0.293746798765737
49.4003238665834,7.15337323415916,0.295492644093527
49.4003238665834,7.16056777272664,0.476871125551894
49.4003238665834,7.16776231129411,0.426621863200513
49.4003238665834,7.17495684986158,0.278925971581194
49.4003238665834,7.18215138842906,0.259199978263454
49.4003238665834,7.18934592699653,0.259199978263454
49.4003238665834,7.196540465564,0.316441546814398
49.4003238665834,7.20373500413148,0.286307030021174
49.4003238665834,7.21092954269895,0.292210470514185
49.4003238665834,7.21812408126643,0.277847668153317
49.4003238665834,7.2253186198339,0.259199978263454
49.4003238665834,7.23251315840137,0.259199978263454
49.4003238665834,7.23970769696885,0.259199978263454
49.4003238665834,7.24690223553632,0.259199978263454
49.4003238665834,7.25409677410379,0.293279055087721
49.4003238665834,7.26129131267127,0.259199978263454
49.4003238665834,7.26848585123874,0.259199978263454
49.4048535014281,6.93034253856747,0.259199978263454
49.4048535014281,6.93753707713495,0.261776006513935
49.4048535014281,6.94473161570242,0.279959587422806
49.4048535014281,6.9519261542699,0.217290094963253
49.4048535014281,6.95912069283737,0.473253248848805
49.4048535014281,6.96631523140484,0.602306256211656
49.4048535014281,6.97350976997232,0.479019275973794
49.4048535014281,6.98070430853979,0.306555250488502
49.4048535014281,6.98789884710726,0.259199978263454
49.4048535014281,6.99509338567474,0.259321377534333
49.4048535014281,7.00228792424221,0.263650107709839
49.4048535014281,7.00948246280969,0.259199978263454
49.4048535014281,7.01667700137716,0.259199978263454
49.4048535014281,7.02387153994463,0.259199978263454
49.4048535014281,7.03106607851211,0.327682193956167
49.4048535014281,7.03826061707958,0.259199978263454
49.4048535014281,7.04545515564705,0.259199978263454
49.4048535014281,7.05264969421453,0.255175938043857
49.4048535014281,7.059844232782,0.231495351491651
49.4048535014281,7.06703877134948,0.259199978263454
49.4048535014281,7.07423330991695,0.24180160708591
49.4048535014281,7.08142784848442,0.242393566936526
49.4048535014281,7.0886223870519,0.261953352249733
49.4048535014281,7.09581692561937,0.365478338496216
49.4048535014281,7.10301146418684,0.259199978263454
49.4048535014281,7.11020600275432,0.259199978263454
49.4048535014281,7.11740054132179,0.259199978263454
49.4048535014281,7.12459507988927,0.259199978263454
49.4048535014281,7.13178961845674,0.259199978263454
49.4048535014281,7.13898415702421,0.259199978263454
49.4048535014281,7.14617869559169,0.290484787104227
49.4048535014281,7.15337323415916,0.412179551931187
49.4048535014281,7.16056777272664,0.552943338971636
49.4048535014281,7.16776231129411,0.358901462231182
49.4048535014281,7.17495684986158,0.296527557655734
49.4048535014281,7.18215138842906,0.259199978263454
49.4048535014281,7.18934592699653,0.259199978263454
49.4048535014281,7.196540465564,0.308355460649165
49.4048535014281,7.20373500413148,0.28754899742813
49.4048535014281,7.21092954269895,0.427894198551943
49.4048535014281,7.21812408126643,0.374324344096456
49.4048535014281,7.2253186198339,0.259199978263454
49.4048535014281,7.23251315840137,0.259199978263454
49.4048535014281,7.23970769696885,0.259199978263454
49.4048535014281,7.24690223553632,0.259199978263454
49.4048535014281,7.25409677410379,0.259199978263454
49.4048535014281,7.26129131267127,0.259199978263454
49.4048535014281,7.26848585123874,0.259199978263454
49.4093831362728,6.923148,0.259199978263454
49.4093831362728,6.93034253856747,0.259199978263454
49.4093831362728,6.93753707713495,0.275182205404408
49.4093831362728,6.94473161570242,0.453885628011886
49.4093831362728,6.9519261542699,0.284001664622984
49.4093831362728,6.95912069283737,0.282519487531032
49.4093831362728,6.96631523140484,0.516987012357004
49.4093831362728,6.97350976997232,0.445344929056768
49.4093831362728,6.98070430853979,0.282078096134279
49.4093831362728,6.98789884710726,0.259199978263454
49.4093831362728,6.99509338567474,0.259199978263454
49.4093831362728,7.00228792424221,0.259199978263454
49.4093831362728,7.00948246280969,0.259199978263454
49.4093831362728,7.01667700137716,0.270559276773662
49.4093831362728,7.02387153994463,0.259199978263454
49.4093831362728,7.03106607851211,0.259199978263454
49.4093831362728,7.03826061707958,0.259199978263454
49.4093831362728,7.04545515564705,0.259199978263454
49.4093831362728,7.05264969421453,0.259199978263454
49.4093831362728,7.059844232782,0.256427664743056
49.4093831362728,7.06703877134948,0.259199978263454
49.4093831362728,7.07423330991695,0.259199978263454
49.4093831362728,7.08142784848442,0.259199978263454
49.4093831362728,7.0886223870519,0.214438591350783
49.4093831362728,7.09581692561937,0.259199978263454
49.4093831362728,7.10301146418684,0.259199978263454
49.4093831362728,7.11020600275432,0.259199978263454
49.4093831362728,7.11740054132179,0.263872901544273
49.4093831362728,7.12459507988927,0.259199978263454
49.4093831362728,7.13178961845674,0.259199978263454
49.4093831362728,7.13898415702421,0.259199978263454
49.4093831362728,7.14617869559169,0.250942671929957
49.4093831362728,7.15337323415916,0.298394025287013
49.4093831362728,7.16056777272664,0.360001822224132
49.4093831362728,7.16776231129411,0.34471041615278
49.4093831362728,7.17495684986158,0.307031058198035
49.4093831362728,7.18215138842906,0.289832168876811
49.4093831362728,7.18934592699653,0.259199978263454
49.4093831362728,7.196540465564,0.256425262673933
49.4093831362728,7.20373500413148,0.270592118498268
49.4093831362728,7.21092954269895,0.404439370795648
49.4093831362728,7.21812408126643,0.259199978263454
49.4093831362728,7.2253186198339,0.259199978263454
49.4093831362728,7.23251315840137,0.259199978263454
49.4093831362728,7.23970769696885,0.259199978263454
49.4093831362728,7.24690223553632,0.259199978263454
49.4093831362728,7.25409677410379,0.259199978263454
49.4093831362728,7.26129131267127,0.259199978263454
49.4093831362728,7.26848585123874,0.259199978263454
49.4139127711175,6.923148,0.197100144259044
49.4139127711175,6.93034253856747,0.260104666000218
49.4139127711175,6.93753707713495,0.260822980051578
49.4139127711175,6.94473161570242,0.364347047962421
49.4139127711175,6.9519261542699,0.314458393821461
49.4139127711175,6.95912069283737,0.259823927278901
49.4139127711175,6.96631523140484,0.259199978263454
49.4139127711175,6.97350976997232,0.287684732998141
49.4139127711175,6.98070430853979,0.280262755338429
49.4139127711175,6.98789884710726,0.259199978263454
49.4139127711175,6.99509338567474,0.259199978263454
49.4139127711175,7.00228792424221,0.261340769309662
49.4139127711175,7.00948246280969,0.309157263981643
49.4139127711175,7.01667700137716,0.475101596781766
49.4139127711175,7.02387153994463,0.259199978263454
49.4139127711175,7.03106607851211,0.259199978263454
49.4139127711175,7.03826061707958,0.259199978263454
49.4139127711175,7.04545515564705,0.259199978263454
49.4139127711175,7.05264969421453,0.259199978263454
49.4139127711175,7.0886223870519,0.259199978263454
49.4139127711175,7.09581692561937,0.259199978263454
49.4139127711175,7.10301146418684,0.259199978263454
49.4139127711175,7.11020600275432,0.259199978263454
49.4139127711175,7.11740054132179,0.31359260820611
49.4139127711175,7.12459507988927,0.27277633946324
49.4139127711175,7.13178961845674,0.259199978263454
49.4139127711175,7.13898415702421,0.259199978263454
49.4139127711175,7.14617869559169,0.306297598346373
49.4139127711175,7.15337323415916,0.354307253944283
49.4139127711175,7.16056777272664,0.259199978263454
49.4139127711175,7.16776231129411,0.270468673581218
49.4139127711175,7.17495684986158,0.274250408849253
49.4139127711175,7.18215138842906,0.284724239025709
49.4139127711175,7.18934592699653,0.254540795568679
49.4139127711175,7.196540465564,0.246642074147542
49.4139127711175,7.20373500413148,0.259199978263454
49.4139127711175,7.21092954269895,0.262461881028213
49.4139127711175,7.21812408126643,0.259199978263454
49.4139127711175,7.2253186198339,0.259199978263454
49.4139127711175,7.23251315840137,0.268070294392547
49.4139127711175,7.23970769696885,0.259199978263454
49.4139127711175,7.24690223553632,0.259199978263454
49.4139127711175,7.25409677410379,0.259199978263454
49.4139127711175,7.26129131267127,0.39028066446892
49.4139127711175,7.26848585123874,0.293935256176253
49.4184424059622,6.93034253856747,0.259199978263454
49.4184424059622,6.93753707713495,0.259199978263454
49.4184424059622,6.94473161570242,0.259199978263454
49.4184424059622,6.9519261542699,0.259199978263454
49.4184424059622,6.95912069283737,0.259199978263454
49.4184424059622,6.96631523140484,0.259199978263454
49.4184424059622,6.97350976997232,0.259199978263454
49.4184424059622,6.98070430853979,0.259199978263454
49.4184424059622,6.98789884710726,0.259199978263454
49.4184424059622,6.99509338567474,0.262748970016415
49.4184424059622,7.00228792424221,0.26177249887051
49.4184424059622,7.00948246280969,0.48048073513117
49.4184424059622,7.01667700137716,0.488734084217153
49.4184424059622,7.02387153994463,0.248034899334632
49.4184424059622,7.03106607851211,0.259199978263454
49.4184424059622,7.03826061707958,0.259199978263454
49.4184424059622,7.04545515564705,0.259199978263454
49.4184424059622,7.05264969421453,0.259199978263454
49.4184424059622,7.09581692561937,0.259199978263454
49.4184424059622,7.10301146418684,0.259199978263454
49.4184424059622,7.11020600275432,0.261648800225168
49.4184424059622,7.11740054132179,0.316368142471984
49.4184424059622,7.12459507988927,0.260949992430019
49.4184424059622,7.13178961845674,0.259199978263454
49.4184424059622,7.16056777272664,0.259199978263454
49.4184424059622,7.16776231129411,0.242339913129079
49.4184424059622,7.17495684986158,0.259199978263454
49.4184424059622,7.18215138842906,0.259199978263454
49.4184424059622,7.18934592699653,0.259199978263454
49.4184424059622,7.196540465564,0.259199978263454
49.4184424059622,7.20373500413148,0.259199978263454
49.4184424059622,7.21092954269895,0.259199978263454
49.4184424059622,7.21812408126643,0.321993730129229
49.4184424059622,7.2253186198339,0.259199978263454
49.4184424059622,7.23251315840137,0.344791919248847
49.4184424059622,7.23970769696885,0.306467104015484
49.4184424059622,7.24690223553632,0.260250602098328
49.4184424059622,7.25409677410379,0.260089810151341
49.4184424059622,7.26129131267127,0.487484443006145
49.4184424059622,7.26848585123874,0.339782811789003
49.4229720408069,6.93034253856747,0.259199978263454
49.4229720408069,6.93753707713495,0.259199978263454
49.4229720408069,6.94473161570242,0.259199978263454
49.4229720408069,6.9519261542699,0.235415890657253
49.4229720408069,6.95912069283737,0.269282050311265
49.4229720408069,6.96631523140484,0.260786881946334
49.4229720408069,6.97350976997232,0.259199978263454
49.4229720408069,6.98070430853979,0.259199978263454
49.4229720408069,6.98789884710726,0.259199978263454
49.4229720408069,6.99509338567474,0.283600912971189
49.4229720408069,7.00228792424221,0.271393223010048
49.4229720408069,7.00948246280969,0.313876517529411
49.4229720408069,7.01667700137716,0.271125034966919
49.4229720408069,7.02387153994463,0.259199978263454
49.4229720408069,7.03826061707958,0.259199978263454
49.4229720408069,7.04545515564705,0.259199978263454
49.4229720408069,7.11020600275432,0.259199978263454
49.4229720408069,7.11740054132179,0.279125654385648
49.4229720408069,7.12459507988927,0.259199978263454
49.4229720408069,7.13178961845674,0.259199978263454
49.4229720408069,7.17495684986158,0.259199978263454
49.4229720408069,7.18215138842906,0.259199978263454
49.4229720408069,7.18934592699653,0.259199978263454
49.4229720408069,7.196540465564,0.259199978263454
49.4229720408069,7.20373500413148,0.259199978263454
49.4229720408069,7.21092954269895,0.259199978263454
49.4229720408069,7.21812408126643,0.32479416515385
49.4229720408069,7.2253186198339,0.259199978263454
49.4229720408069,7.23251315840137,0.220790215668132
49.4229720408069,7.23970769696885,0.436281336217651
49.4229720408069,7.24690223553632,0.279599767772658
49.4229720408069,7.25409677410379,0.259199978263454
49.4229720408069,7.26129131267127,0.299617792936433
49.4229720408069,7.26848585123874,0.298310162894356
49.4275016756516,6.96631523140484,0.263039844629044
49.4275016756516,6.97350976997232,0.259199978263454
49.4275016756516,6.98070430853979,0.259199978263454
49.4275016756516,6.98789884710726,0.259199978263454
49.4275016756516,6.99509338567474,0.270499078115473
49.4275016756516,7.00228792424221,0.26538123700152
49.4275016756516,7.00948246280969,0.259199978263454
49.4275016756516,7.01667700137716,0.259199978263454
49.4275016756516,7.11020600275432,0.259199978263454
49.4275016756516,7.11740054132179,0.259199978263454
49.4275016756516,7.196540465564,0.259199978263454
49.4275016756516,7.20373500413148,0.259199978263454
49.4275016756516,7.21092954269895,0.259199978263454
49.4275016756516,7.21812408126643,0.259199978263454
49.4275016756516,7.2253186198339,0.259199978263454
49.4275016756516,7.23251315840137,0.250063755130848
49.4275016756516,7.23970769696885,0.330353953010905
49.4275016756516,7.24690223553632,0.280837995442778
49.4275016756516,7.25409677410379,0.259199978263454
49.4320313104963,6.98070430853979,0.259199978263454
49.4320313104963,6.98789884710726,0.259199978263454
49.4320313104963,6.99509338567474,0.377838807118428
49.4320313104963,7.00228792424221,0.268653403377533
49.4320313104963,7.00948246280969,0.259199978263454
49.4320313104963,7.196540465564,0.259199978263454
49.4320313104963,7.20373500413148,0.259199978263454
49.4320313104963,7.21092954269895,0.259199978263454
49.4320313104963,7.21812408126643,0.259199978263454
