49.1503768,7.58238144863343,0.259199978263454
49.1503768,7.58957598415249,0.259199978263454
49.1549125435034,7.58957598415249,0.259199978263454
49.1549125435034,7.59677051967155,0.259199978263454
49.1594482870069,7.58957598415249,0.263508803283424
49.1594482870069,7.59677051967155,0.259199978263454
49.1594482870069,7.60396505519061,0.259199978263454
49.1639840305103,7.58957598415249,0.292563956527395
49.1639840305103,7.59677051967155,0.272789017553781
49.1639840305103,7.60396505519061,0.259199978263454
49.1639840305103,7.61115959070967,0.259199978263454
49.1639840305103,7.61835412622873,0.236130048613303
49.1639840305103,7.62554866174779,0.259199978263454
49.1639840305103,7.63274319726685,0.259199978263454
49.1685197740137,7.56079784207624,0.259199978263454
49.1685197740137,7.5679923775953,0.259199978263454
49.1685197740137,7.59677051967155,0.259199978263454
49.1685197740137,7.60396505519061,0.259199978263454
49.1685197740137,7.61115959070967,0.268312091656154
49.1685197740137,7.61835412622873,0.311876778564101
49.1685197740137,7.62554866174779,0.259199978263454
49.1685197740137,7.63274319726685,0.259199978263454
49.1730555175172,7.55360330655718,0.259199978263454
49.1730555175172,7.56079784207624,0.259199978263454
49.1730555175172,7.5679923775953,0.259199978263454
49.1730555175172,7.57518691311436,0.259199978263454
49.1730555175172,7.58238144863343,0.259199978263454
49.1730555175172,7.59677051967155,0.306828254565603
49.1730555175172,7.60396505519061,0.259199978263454
49.1730555175172,7.61115959070967,0.354296148075353
49.1730555175172,7.61835412622873,0.381644040481198
49.1730555175172,7.62554866174779,0.259199978263454
49.1730555175172,7.63274319726685,0.259199978263454
49.1730555175172,7.63993773278591,0.259199978263454
49.1775912610206,7.54640877103812,0.259199978263454
49.1775912610206,7.55360330655718,0.259199978263454
49.1775912610206,7.56079784207624,0.259199978263454
49.1775912610206,7.5679923775953,0.259199978263454
49.1775912610206,7.57518691311436,0.259199978263454
49.1775912610206,7.58238144863343,0.259199978263454
49.1775912610206,7.58957598415249,0.259199978263454
49.1775912610206,7.59677051967155,0.289378256810155
49.1775912610206,7.60396505519061,0.280814269618616
49.1775912610206,7.61115959070967,0.278874057618531
49.1775912610206,7.61835412622873,0.267652598021919
49.1775912610206,7.62554866174779,0.295718215154694
49.182127004524,7.54640877103812,0.259199978263454
49.182127004524,7.55360330655718,0.259199978263454
49.182127004524,7.56079784207624,0.259199978263454
49.182127004524,7.5679923775953,0.259199978263454
49.182127004524,7.57518691311436,0.240620317190758
49.182127004524,7.58238144863343,0.243310530105762
49.182127004524,7.58957598415249,0.259199978263454
49.182127004524,7.59677051967155,0.259199978263454
49.182127004524,7.60396505519061,0.266379967163088
49.182127004524,7.61115959070967,0.265429946495349
49.182127004524,7.61835412622873,0.257642945926943
49.182127004524,7.62554866174779,0.390798661764872
49.182127004524,7.63274319726685,0.392709512661468
49.182127004524,7.63993773278591,0.29177419419583
49.1866627480275,7.53921423551906,0.27500055224874
49.1866627480275,7.54640877103812,0.259199978263454
49.1866627480275,7.55360330655718,0.259199978263454
49.1866627480275,7.56079784207624,0.263372286008543
49.1866627480275,7.5679923775953,0.268021157058928
49.1866627480275,7.57518691311436,0.260895185520018
49.1866627480275,7.58238144863343,0.216528324231615
49.1866627480275,7.58957598415249,0.259926136017132
49.1866627480275,7.59677051967155,0.27790561096833
49.1866627480275,7.60396505519061,0.332385221310935
49.1866627480275,7.61115959070967,0.32666983548604
49.1866627480275,7.61835412622873,0.260998378124563
49.1866627480275,7.62554866174779,0.296655987499675
49.1866627480275,7.63274319726685,0.24049386881252
49.1866627480275,7.63993773278591,0.259199978263454
49.1866627480275,7.64713226830497,0.259199978263454
49.1866627480275,7.65432680382403,0.259199978263454
49.1911984915309,7.5320197,0.259199978263454
49.1911984915309,7.53921423551906,0.259199978263454
49.1911984915309,7.54640877103812,0.259199978263454
49.1911984915309,7.55360330655718,0.259199978263454
49.1911984915309,7.56079784207624,0.303688270809221
49.1911984915309,7.5679923775953,0.299256892755809
49.1911984915309,7.57518691311436,0.266522296611145
49.1911984915309,7.58238144863343,0.269898903681889
49.1911984915309,7.58957598415249,0.31185407905596
49.1911984915309,7.59677051967155,0.267765235978303
49.1911984915309,7.60396505519061,0.280572310969214
49.1911984915309,7.61115959070967,0.39126954216361
49.1911984915309,7.61835412622873,0.40347610617979
49.1911984915309,7.62554866174779,0.410694203372461
49.1911984915309,7.63274319726685,0.321495295767357
49.1911984915309,7.63993773278591,0.298751464795235
49.1911984915309,7.64713226830497,0.259199978263454
49.1911984915309,7.65432680382403,0.259199978263454
49.1957342350343,7.5320197,0.259199978263454
49.1957342350343,7.53921423551906,0.259199978263454
49.1957342350343,7.54640877103812,0.262647186323147
49.1957342350343,7.55360330655718,0.259199978263454
49.1957342350343,7.56079784207624,0.285421619085192
49.1957342350343,7.5679923775953,0.266721048592668
49.1957342350343,7.57518691311436,0.259199978263454
49.1957342350343,7.58238144863343,0.26086328926945
49.1957342350343,7.58957598415249,0.49590674256923
49.1957342350343,7.59677051967155,0.319059444788361
49.1957342350343,7.60396505519061,0.39776707393111
49.1957342350343,7.61115959070967,0.619761734937021
49.1957342350343,7.61835412622873,0.287670592120415
49.1957342350343,7.62554866174779,0.332743728572809
49.1957342350343,7.63274319726685,0.283578868876536
49.1957342350343,7.63993773278591,0.268646272474618
49.1957342350343,7.64713226830497,0.259199978263454
49.2002699785377,7.5320197,0.259199978263454
49.2002699785377,7.53921423551906,0.259199978263454
49.2002699785377,7.54640877103812,0.269772622675389
49.2002699785377,7.55360330655718,0.228927041960954
49.2002699785377,7.56079784207624,0.343420513566824
49.2002699785377,7.5679923775953,0.29398947884569
49.2002699785377,7.57518691311436,0.259199978263454
49.2002699785377,7.58238144863343,0.259199978263454
49.2002699785377,7.58957598415249,0.375524708763672
49.2002699785377,7.59677051967155,0.478415532081703
49.2002699785377,7.60396505519061,0.543137730971344
49.2002699785377,7.61115959070967,0.461381777946699
49.2002699785377,7.61835412622873,0.268075467068134
49.2002699785377,7.62554866174779,0.292168329706623
49.2002699785377,7.63274319726685,0.259199978263454
49.2002699785377,7.63993773278591,0.259199978263454
49.2002699785377,7.64713226830497,0.259199978263454
49.2002699785377,7.65432680382403,0.259199978263454
49.2048057220412,7.5320197,0.259199978263454
49.2048057220412,7.53921423551906,0.309279667324574
49.2048057220412,7.54640877103812,0.300524840538048
49.2048057220412,7.55360330655718,0.242296359136638
49.2048057220412,7.56079784207624,0.300163405204009
49.2048057220412,7.5679923775953,0.263438194344026
49.2048057220412,7.57518691311436,0.259199978263454
49.2048057220412,7.58238144863343,0.259199978263454
49.2048057220412,7.58957598415249,0.316888490506519
49.2048057220412,7.59677051967155,0.507790299868753
49.2048057220412,7.60396505519061,0.703668580467277
49.2048057220412,7.61115959070967,0.409037897531332
49.2048057220412,7.61835412622873,0.415310550870666
49.2048057220412,7.62554866174779,0.295143944005322
49.2048057220412,7.63274319726685,0.271805366522343
49.2048057220412,7.63993773278591,0.259199978263454
49.2048057220412,7.64713226830497,0.259199978263454
49.2048057220412,7.65432680382403,0.259199978263454
49.2048057220412,7.66152133934309,0.259199978263454
49.2093414655446,7.5320197,0.33524174409232
49.2093414655446,7.53921423551906,0.385076581702122
49.2093414655446,7.54640877103812,0.289111101258592
49.2093414655446,7.55360330655718,0.259199978263454
49.2093414655446,7.56079784207624,0.259199978263454
49.2093414655446,7.5679923775953,0.259199978263454
49.2093414655446,7.57518691311436,0.259199978263454
49.2093414655446,7.58238144863343,0.259199978263454
49.2093414655446,7.58957598415249,0.287321784487827
49.2093414655446,7.59677051967155,0.311215829258366
49.2093414655446,7.60396505519061,0.34334753024536
49.2093414655446,7.61115959070967,0.454205559408564
49.2093414655446,7.61835412622873,0.30220429389087
49.2093414655446,7.62554866174779,0.265159904194747
49.2093414655446,7.63274319726685,0.259199978263454
49.2093414655446,7.63993773278591,0.259199978263454
49.2093414655446,7.64713226830497,0.259199978263454
49.2093414655446,7.65432680382403,0.259199978263454
49.2093414655446,7.66152133934309,0.259199978263454
49.213877209048,7.5320197,0.412841444515243
49.213877209048,7.53921423551906,0.33816837946884
49.213877209048,7.54640877103812,0.253590820132498
49.213877209048,7.55360330655718,0.259199978263454
49.213877209048,7.56079784207624,0.259199978263454
49.213877209048,7.5679923775953,0.259199978263454
49.213877209048,7.57518691311436,0.259199978263454
49.213877209048,7.58238144863343,0.259199978263454
49.213877209048,7.58957598415249,0.253905597729239
49.213877209048,7.59677051967155,0.230712017608762
49.213877209048,7.60396505519061,0.391500734036768
49.213877209048,7.61115959070967,0.441215025832605
49.213877209048,7.61835412622873,0.38696980579139
49.213877209048,7.62554866174779,0.318548623685175
49.213877209048,7.63274319726685,0.279803625754674
49.213877209048,7.63993773278591,0.259199978263454
49.213877209048,7.64713226830497,0.259199978263454
49.213877209048,7.65432680382403,0.259199978263454
49.2184129525515,7.55360330655718,0.259199978263454
49.2184129525515,7.56079784207624,0.259199978263454
49.2184129525515,7.5679923775953,0.259199978263454
49.2184129525515,7.57518691311436,0.259199978263454
49.2184129525515,7.58238144863343,0.259199978263454
49.2184129525515,7.58957598415249,0.216261018695132
49.2184129525515,7.59677051967155,0.246389349039535
49.2184129525515,7.60396505519061,0.244095776380762
49.2184129525515,7.61115959070967,0.23122780492622
49.2184129525515,7.61835412622873,0.281283875496107
49.2184129525515,7.62554866174779,0.278117235572978
49.2184129525515,7.63274319726685,0.262045103129079
49.2184129525515,7.63993773278591,0.259199978263454
49.2184129525515,7.64713226830497,0.259199978263454
49.2184129525515,7.65432680382403,0.259199978263454
49.2184129525515,7.66152133934309,0.259199978263454
49.2229486960549,7.56079784207624,0.259199978263454
49.2229486960549,7.5679923775953,0.259199978263454
49.2229486960549,7.57518691311436,0.259199978263454
49.2229486960549,7.58238144863343,0.259199978263454
49.2229486960549,7.58957598415249,0.302390172197135
49.2229486960549,7.59677051967155,0.251286197021902
49.2229486960549,7.60396505519061,0.251204034926126
49.2229486960549,7.61115959070967,0.2555289905189
49.2229486960549,7.63993773278591,0.259199978263454
49.2229486960549,7.64713226830497,0.259199978263454
49.2229486960549,7.65432680382403,0.259199978263454
49.2229486960549,7.66152133934309,0.259199978263454
49.2274844395583,7.5679923775953,0.259199978263454
49.2274844395583,7.57518691311436,0.259199978263454
49.2274844395583,7.58238144863343,0.258521989187782
49.2274844395583,7.58957598415249,0.317218073206918
49.2274844395583,7.59677051967155,0.26306966760629
49.2274844395583,7.65432680382403,0.259199978263454
49.2274844395583,7.66152133934309,0.259199978263454
