nan,nan,4.925712129980570203e-02
1.446349504851522383e+01,5.125598710867971164e+01,6.240489954072585277e-02
1.417927998687572355e+01,5.112914702132504630e+01,7.553647588972003946e-02
1.427661847109034632e+01,5.144584491303705676e+01,8.752405787363275180e-02
1.426012564090903822e+01,5.143651649805930504e+01,1.016142870870760523e-01
1.399578242873366030e+01,5.109687031981433591e+01,1.139073042670523256e-01
1.419554178518414034e+01,5.123441412603155243e+01,1.255277136433358420e-01
1.382573809917791507e+01,5.116886058887664745e+01,1.368025215112280979e-01
1.439629376750898615e+01,5.109835652038265863e+01,1.496573139212880044e-01
1.391353086446086884e+01,5.122392805243681124e+01,1.620670822220805773e-01
1.409210988360921313e+01,5.126025810224550128e+01,1.743612186115681695e-01
