nan,nan,2.633533842048892404e-01
9.583569792811427845e+00,4.870483638303077356e+01,2.767539949102367780e-01
9.690158738680846540e+00,4.856799954628330340e+01,2.887710352636261857e-01
9.615885628134138940e+00,4.870719738881800964e+01,3.018016471941026846e-01
9.765199508437110154e+00,4.860697794219507983e+01,3.142795857784915770e-01
9.695459519900047951e+00,4.866555002681874242e+01,3.270342819060033657e-01
9.680685741700122193e+00,4.870472900159717966e+01,3.393105579989121878e-01
9.614551819855698511e+00,4.866809579947375397e+01,3.516081942539063809e-01
9.596892824904395880e+00,4.875710743408439640e+01,3.639837981415292578e-01
9.713382255378549601e+00,4.870932361373778718e+01,3.763529665395745072e-01
9.707911933582961339e+00,4.869852871297285191e+01,3.892950301990797946e-01
