nan,nan,1.973976640817571016e-01
8.918637958772919205e+00,5.228751122275748031e+01,2.143939321313089452e-01
8.670756370744610919e+00,5.227403557683974356e+01,2.285271865105575895e-01
8.694267718886665719e+00,5.225702346826360412e+01,2.404408786405641540e-01
8.786069708259830691e+00,5.226057182233076048e+01,2.529903453496411547e-01
8.793003550499932430e+00,5.219267480646283985e+01,2.646522098765455855e-01
8.879390256686267691e+00,5.228768257754149573e+01,2.778112594894219800e-01
8.442536111063059678e+00,5.243130626957900375e+01,2.893734385127770259e-01
8.464076024786885810e+00,5.243854911732088198e+01,3.006552226374889503e-01
8.880769163737962657e+00,5.231323039047877899e+01,3.134309730672427685e-01
8.597768353013858444e+00,5.226915587498800164e+01,3.257402943118340999e-01
