nan,nan,2.353096833172197977e-01
7.186561026398564422e+00,5.088968338375922684e+01,2.468543195207374974e-01
7.255979184035263430e+00,5.114826579551602492e+01,2.589017090424605705e-01
7.186512334492836551e+00,5.096748667417908507e+01,2.712280517451847728e-01
7.193341943139583528e+00,5.112187861836083158e+01,2.826980698826409566e-01
7.192542744887451711e+00,5.109523983352118393e+01,2.958889964472933842e-01
7.197713179331290512e+00,5.091564436845736452e+01,3.070823314572281859e-01
7.109061453464149416e+00,5.111745592945664640e+01,3.199457960127979339e-01
7.018993642648033493e+00,5.110635256918308045e+01,3.324976295516438585e-01
7.106151215639377128e+00,5.095436933453250816e+01,3.443179937061183749e-01
7.135199613068906821e+00,5.099127767387017229e+01,3.543806202402129402e-01
