nan,nan,2.145490482721733594e-01
1.135146938139500250e+01,4.892010100894697899e+01,2.267896508286959545e-01
1.107407657912757948e+01,4.887516194550514115e+01,2.400154583067582448e-01
1.127327346080924997e+01,4.889789768686169680e+01,2.523213078809420917e-01
1.108600893167283630e+01,4.881780838489839880e+01,2.634450470584820403e-01
1.136263673374509509e+01,4.878421647024777030e+01,2.742838895866019366e-01
1.130339058442296896e+01,4.891156872955050972e+01,2.859722964529843314e-01
1.126726677974705559e+01,4.888244671113466211e+01,2.964835873271840505e-01
1.114210248705572681e+01,4.892553890603325328e+01,3.081991099818890412e-01
1.146969570206080391e+01,4.895388586762304328e+01,3.207453221475252692e-01
1.149894552128557201e+01,4.881129141681378769e+01,3.353719263820358898e-01
