nan,nan,1.235423849730176021e-01
8.823198895066955316e+00,5.067730683139730985e+01,1.370967351417917146e-01
8.684212683103488928e+00,5.059121054294390518e+01,1.511244930009653098e-01
8.718687996251233585e+00,5.059161864133950814e+01,1.631730596417414469e-01
8.666373640634789766e+00,5.058149526494661075e+01,1.800696753738644518e-01
8.645509574208274373e+00,5.055805604413493626e+01,1.929943343094518982e-01
8.838021563764362654e+00,5.059488694779887652e+01,2.058292544512340672e-01
8.703368150498892675e+00,5.060252871953220222e+01,2.208834406347267021e-01
8.636919497362054443e+00,5.058501000911901713e+01,2.323081888258746452e-01
8.894876226973380540e+00,5.047697222675055428e+01,2.450747622388831926e-01
8.618848409373509156e+00,5.054734968550980767e+01,2.568344000106720926e-01
