nan,nan,7.733926065368906810e-02
7.189985700203883390e+00,4.924307197276644388e+01,9.009482113681419047e-02
7.255466568979884734e+00,4.934837351856904064e+01,1.037728162212586958e-01
7.242441409175006228e+00,4.928182217679196242e+01,1.176097983969120464e-01
7.140944652480202492e+00,4.929071723152916462e+01,1.300071718954602940e-01
7.340034508460205664e+00,4.931804093242457299e+01,1.443536099752314172e-01
7.315111446578060672e+00,4.926997917749362443e+01,1.559746752036076656e-01
7.206994754437749506e+00,4.924861369650881215e+01,1.675052157121398599e-01
7.311067579191623089e+00,4.930662368562308728e+01,1.807718613421630538e-01
7.242538230622857398e+00,4.916007666221818795e+01,1.928177057325805577e-01
7.162688611083260604e+00,4.928379149836788997e+01,2.057743275449274434e-01
