nan,nan,1.670156628922685460e-01
1.184149185196386611e+01,4.775009392175270051e+01,1.815364234057949555e-01
1.183082468413058486e+01,4.778674318170273239e+01,1.914626519854644715e-01
1.178013772551707916e+01,4.789311406767129853e+01,2.038588226813985715e-01
1.185171462038451295e+01,4.773261701065262486e+01,2.159164545652758893e-01
1.187510703947142154e+01,4.770676861686004600e+01,2.292762430975802401e-01
1.193442330092753778e+01,4.770546388846304353e+01,2.416077452478261056e-01
1.201775021714638214e+01,4.767390167485746133e+01,2.533420332533944386e-01
1.168702577184441793e+01,4.779259819244769147e+01,2.651446667842911609e-01
1.188578253333751000e+01,4.766196335513365767e+01,2.771869367656736860e-01
1.184118595394556728e+01,4.765531122853561641e+01,2.885445585415431502e-01
