nan,nan,4.820754608177798550e-01
7.079327977970237384e+00,5.142021120573790682e+01,4.949157998117844626e-01
7.035119460191402219e+00,5.149973368663641082e+01,5.076571058546019977e-01
7.110634204354402854e+00,5.143702447391359556e+01,5.198847717930287216e-01
7.065306447114443777e+00,5.140362810632575474e+01,5.364279926921627917e-01
7.112013444567073073e+00,5.139542340985796898e+01,5.490968121947472635e-01
6.955313601384112587e+00,5.149535909419238067e+01,5.606353325518516062e-01
7.026387339205446558e+00,5.138702101369123909e+01,5.744902407997760641e-01
7.111292665714917582e+00,5.145600804185486510e+01,5.858026288602997678e-01
7.010017324454473453e+00,5.151725578333367395e+01,5.973770558801534403e-01
6.979869862887292165e+00,5.137714219976257368e+01,6.099415104779624119e-01
