49.9059228,8.23205768925322,0.231013007719778
49.9059228,8.23925222169098,0.249342382806026
49.9059228,8.24644675412875,0.263871110192148
49.9059228,8.25364128656652,0.259199978263454
49.910465237131,8.23205768925322,0.258307877147862
49.910465237131,8.23925222169098,0.248396160443051
49.910465237131,8.24644675412875,0.36489453434174
49.910465237131,8.25364128656652,0.314741731156909
49.9150076742621,8.23205768925322,0.290312887360238
49.9150076742621,8.23925222169098,0.310478802418431
49.9150076742621,8.24644675412875,0.341853114748624
49.9150076742621,8.25364128656652,0.356386994588785
49.9150076742621,8.26083581900429,0.268959182071047
49.9195501113931,8.23925222169098,0.258558477112115
49.9195501113931,8.24644675412875,0.253000065671699
49.9195501113931,8.25364128656652,0.320510733648769
49.9195501113931,8.26083581900429,0.252049222069087
49.9195501113931,8.26803035144206,0.216556478467716
49.9240925485241,8.23205768925322,0.259199978263454
49.9240925485241,8.23925222169098,0.259199978263454
49.9240925485241,8.24644675412875,0.259199978263454
49.9240925485241,8.25364128656652,0.259199978263454
49.9240925485241,8.26083581900429,0.249677134216162
49.9286349856551,8.23925222169098,0.259199978263454
49.9286349856551,8.24644675412875,0.259199978263454
49.9286349856551,8.25364128656652,0.259199978263454
49.9286349856551,8.26083581900429,0.259199978263454
49.9286349856551,8.26803035144206,0.259199978263454
49.9286349856551,8.27522488387982,0.259199978263454
49.9331774227862,8.23925222169098,0.259199978263454
49.9331774227862,8.24644675412875,0.259199978263454
49.9331774227862,8.25364128656652,0.259199978263454
49.9331774227862,8.26083581900429,0.259199978263454
49.9331774227862,8.26803035144206,0.259199978263454
49.9331774227862,8.27522488387982,0.259199978263454
49.9377198599172,8.24644675412875,0.259199978263454
49.9377198599172,8.25364128656652,0.259199978263454
49.9377198599172,8.26083581900429,0.259199978263454
49.9377198599172,8.26803035144206,0.259199978263454
49.9377198599172,8.27522488387982,0.259199978263454
49.9422622970482,8.24644675412875,0.259199978263454
49.9422622970482,8.25364128656652,0.259199978263454
49.9422622970482,8.26083581900429,0.259199978263454
49.9422622970482,8.26803035144206,0.259199978263454
49.9422622970482,8.27522488387982,0.259199978263454
49.9422622970482,8.28241941631759,0.259199978263454
49.9422622970482,8.28961394875536,0.259199978263454
49.9422622970482,8.31119754606866,0.259199978263454
49.9422622970482,8.33278114338197,0.259199978263454
49.9468047341793,8.24644675412875,0.262858661254708
49.9468047341793,8.25364128656652,0.290709047091994
49.9468047341793,8.26083581900429,0.203780206946922
49.9468047341793,8.26803035144206,0.250728834723716
49.9468047341793,8.27522488387982,0.259199978263454
49.9468047341793,8.28241941631759,0.259199978263454
49.9468047341793,8.28961394875536,0.259199978263454
49.9468047341793,8.29680848119313,0.259199978263454
49.9468047341793,8.31119754606866,0.286376943161134
49.9468047341793,8.31839207850643,0.259199978263454
49.9468047341793,8.3255866109442,0.259199978263454
49.9468047341793,8.33278114338197,0.259199978263454
49.9513471713103,8.22486315681545,0.259199978263454
49.9513471713103,8.23205768925322,0.259199978263454
49.9513471713103,8.23925222169098,0.259199978263454
49.9513471713103,8.24644675412875,0.259199978263454
49.9513471713103,8.25364128656652,0.264918847228648
49.9513471713103,8.26083581900429,0.221783594074982
49.9513471713103,8.26803035144206,0.243175710258882
49.9513471713103,8.27522488387982,0.259199978263454
49.9513471713103,8.28241941631759,0.291770710767906
49.9513471713103,8.28961394875536,0.259199978263454
49.9513471713103,8.29680848119313,0.259199978263454
49.9513471713103,8.3040030136309,0.260238728949288
49.9513471713103,8.31119754606866,0.264659381067881
49.9513471713103,8.31839207850643,0.334949697865153
49.9513471713103,8.3255866109442,0.311456503815501
49.9513471713103,8.33278114338197,0.259142421409208
49.9558896084413,8.19608502706438,0.410564320614989
49.9558896084413,8.22486315681545,0.241998518529648
49.9558896084413,8.23205768925322,0.263565718954244
49.9558896084413,8.23925222169098,0.259199978263454
49.9558896084413,8.24644675412875,0.257417169360896
49.9558896084413,8.25364128656652,0.28441626221045
49.9558896084413,8.26083581900429,0.374256961042462
49.9558896084413,8.26803035144206,0.297477577361881
49.9558896084413,8.27522488387982,0.338622730399315
49.9558896084413,8.28241941631759,0.301792833361734
49.9558896084413,8.28961394875536,0.26651460688543
49.9558896084413,8.29680848119313,0.259199978263454
49.9558896084413,8.3040030136309,0.297609819794361
49.9558896084413,8.31119754606866,0.357200330749386
49.9558896084413,8.31839207850643,0.270296017006495
49.9558896084413,8.3255866109442,0.306521082215279
49.9558896084413,8.33278114338197,0.151580415113383
49.9604320455723,8.18889049462661,0.288389100155866
49.9604320455723,8.19608502706438,0.39226215898024
49.9604320455723,8.20327955950214,0.421851250789319
49.9604320455723,8.21047409193991,0.277261860868737
49.9604320455723,8.21766862437768,0.26897400764354
49.9604320455723,8.22486315681545,0.361250854120224
49.9604320455723,8.23205768925322,0.436044238954222
49.9604320455723,8.23925222169098,0.248182571054551
49.9604320455723,8.24644675412875,0.27333609627963
49.9604320455723,8.25364128656652,0.291293681051358
49.9604320455723,8.26083581900429,0.446184229109723
49.9604320455723,8.26803035144206,0.373431001192737
49.9604320455723,8.27522488387982,0.477589381506379
49.9604320455723,8.28241941631759,0.590896424460357
49.9604320455723,8.28961394875536,0.259199978263454
49.9604320455723,8.29680848119313,0.257819782828349
49.9604320455723,8.3040030136309,0.274265630538234
49.9604320455723,8.31119754606866,0.669934167866119
49.9604320455723,8.31839207850643,0.351138581535496
49.9604320455723,8.3255866109442,0.259264054963249
49.9604320455723,8.33278114338197,0.247878671905943
49.9649744827034,8.15291783243777,0.259199978263454
49.9649744827034,8.18889049462661,0.358086991469584
49.9649744827034,8.19608502706438,0.263126054395955
49.9649744827034,8.20327955950214,0.379347687268509
49.9649744827034,8.21047409193991,0.338223495125177
49.9649744827034,8.21766862437768,0.246334256996698
49.9649744827034,8.22486315681545,0.379597198155009
49.9649744827034,8.23205768925322,0.539409999169047
49.9649744827034,8.23925222169098,0.328046985848117
49.9649744827034,8.24644675412875,0.259386824443829
49.9649744827034,8.25364128656652,0.297135719616859
49.9649744827034,8.26083581900429,0.34344070717625
49.9649744827034,8.26803035144206,0.287523806552204
49.9649744827034,8.27522488387982,0.436907257640282
49.9649744827034,8.28241941631759,0.548271518403078
49.9649744827034,8.28961394875536,0.287882839151524
49.9649744827034,8.29680848119313,0.259199978263454
49.9649744827034,8.3040030136309,0.273242821521584
49.9649744827034,8.31119754606866,0.374134553283622
49.9649744827034,8.31839207850643,0.43123057145347
49.9649744827034,8.3255866109442,0.316284111702928
49.9695169198344,8.15291783243777,0.288823407403562
49.9695169198344,8.16011236487554,0.259199978263454
49.9695169198344,8.1673068973133,0.259199978263454
49.9695169198344,8.17450142975107,0.259199978263454
49.9695169198344,8.18169596218884,0.259199978263454
49.9695169198344,8.18889049462661,0.279522671148595
49.9695169198344,8.19608502706438,0.269334193866679
49.9695169198344,8.20327955950214,0.277103210690124
49.9695169198344,8.21047409193991,0.259199978263454
49.9695169198344,8.21766862437768,0.259199978263454
49.9695169198344,8.22486315681545,0.315605278910193
49.9695169198344,8.23205768925322,0.454842725772892
49.9695169198344,8.23925222169098,0.470131983622048
49.9695169198344,8.24644675412875,0.397615577086613
49.9695169198344,8.25364128656652,0.262599904366397
49.9695169198344,8.26083581900429,0.387283956523232
49.9695169198344,8.26803035144206,0.333683664255601
49.9695169198344,8.27522488387982,0.419578502036212
49.9695169198344,8.28241941631759,0.347516326945144
49.9695169198344,8.28961394875536,0.331335376852733
49.9695169198344,8.29680848119313,0.289355420710086
49.9695169198344,8.3040030136309,0.259199978263454
49.9695169198344,8.31119754606866,0.276684617169704
49.9695169198344,8.31839207850643,0.281395132218388
49.9695169198344,8.3255866109442,0.259199978263454
49.9740593569654,8.1457233,0.295091602636878
49.9740593569654,8.15291783243777,0.352693793298431
49.9740593569654,8.16011236487554,0.259199978263454
49.9740593569654,8.1673068973133,0.259199978263454
49.9740593569654,8.17450142975107,0.259199978263454
49.9740593569654,8.18169596218884,0.27927354144226
49.9740593569654,8.18889049462661,0.351686170952255
49.9740593569654,8.19608502706438,0.411207721194025
49.9740593569654,8.20327955950214,0.259199978263454
49.9740593569654,8.21047409193991,0.259199978263454
49.9740593569654,8.21766862437768,0.259199978263454
49.9740593569654,8.22486315681545,0.259199978263454
49.9740593569654,8.23205768925322,0.327227297365109
49.9740593569654,8.23925222169098,0.427658735248885
49.9740593569654,8.24644675412875,0.431456004974552
49.9740593569654,8.25364128656652,0.438156160169741
49.9740593569654,8.26083581900429,0.369977458919804
49.9740593569654,8.26803035144206,0.324902983242266
49.9740593569654,8.27522488387982,0.326709381134034
49.9740593569654,8.28241941631759,0.434552181275042
49.9740593569654,8.28961394875536,0.387620280603087
49.9740593569654,8.29680848119313,0.351386625259812
49.9740593569654,8.3040030136309,0.27270925382659
49.9740593569654,8.31119754606866,0.300885116124943
49.9740593569654,8.31839207850643,0.241352222871079
49.9786017940965,8.1457233,0.239383371311535
49.9786017940965,8.15291783243777,0.257636434866616
49.9786017940965,8.16011236487554,0.259199978263454
49.9786017940965,8.1673068973133,0.29439979525152
49.9786017940965,8.17450142975107,0.259199978263454
49.9786017940965,8.18169596218884,0.259199978263454
49.9786017940965,8.18889049462661,0.322222765768527
49.9786017940965,8.19608502706438,0.310305827798737
49.9786017940965,8.20327955950214,0.259199978263454
49.9786017940965,8.21047409193991,0.259199978263454
49.9786017940965,8.21766862437768,0.259199978263454
49.9786017940965,8.22486315681545,0.259199978263454
49.9786017940965,8.23205768925322,0.26426671623131
49.9786017940965,8.23925222169098,0.522707686375005
49.9786017940965,8.24644675412875,0.491219066469305
49.9786017940965,8.25364128656652,0.33092135332675
49.9786017940965,8.26083581900429,0.368795885379892
49.9786017940965,8.26803035144206,0.435043110296057
49.9786017940965,8.27522488387982,0.537066139053038
49.9786017940965,8.28241941631759,0.387899543712684
49.9786017940965,8.28961394875536,0.406368450534057
49.9786017940965,8.29680848119313,0.490804848054175
49.9786017940965,8.3040030136309,0.446921240411398
49.9786017940965,8.31119754606866,0.339792741788628
49.9831442312275,8.1457233,0.259199978263454
49.9831442312275,8.15291783243777,0.259199978263454
49.9831442312275,8.16011236487554,0.269265746416802
49.9831442312275,8.1673068973133,0.339782891272891
49.9831442312275,8.17450142975107,0.382199160376613
49.9831442312275,8.18169596218884,0.351668648839296
49.9831442312275,8.18889049462661,0.267417429418872
49.9831442312275,8.19608502706438,0.259199978263454
49.9831442312275,8.20327955950214,0.259199978263454
49.9831442312275,8.21047409193991,0.259199978263454
49.9831442312275,8.21766862437768,0.299851335075177
49.9831442312275,8.22486315681545,0.401317075912299
49.9831442312275,8.23205768925322,0.340797849225798
49.9831442312275,8.23925222169098,0.568550036506513
49.9831442312275,8.24644675412875,0.618016287923218
49.9831442312275,8.25364128656652,0.401309236356643
49.9831442312275,8.26083581900429,0.40755714917541
49.9831442312275,8.26803035144206,0.368599640568251
49.9831442312275,8.27522488387982,0.394258598017653
49.9831442312275,8.28241941631759,0.345588918999901
49.9831442312275,8.28961394875536,0.410569276724003
49.9831442312275,8.29680848119313,0.394280067982641
49.9831442312275,8.3040030136309,0.489596176587234
49.9876866683585,8.16011236487554,0.259199978263454
49.9876866683585,8.1673068973133,0.321460129655659
49.9876866683585,8.17450142975107,0.52001994821334
49.9876866683585,8.18169596218884,0.380231629664614
49.9876866683585,8.18889049462661,0.314131201484904
49.9876866683585,8.19608502706438,0.259199978263454
49.9876866683585,8.20327955950214,0.259199978263454
49.9876866683585,8.21047409193991,0.259199978263454
49.9876866683585,8.21766862437768,0.259199978263454
49.9876866683585,8.22486315681545,0.503658649786305
49.9876866683585,8.23205768925322,0.433123219661101
49.9876866683585,8.23925222169098,0.321699951075257
49.9876866683585,8.24644675412875,0.394293312734542
49.9876866683585,8.25364128656652,0.439354032888152
49.9876866683585,8.26083581900429,0.419628339077363
49.9876866683585,8.26803035144206,0.377357287663895
49.9876866683585,8.27522488387982,0.362214276750962
49.9876866683585,8.28241941631759,0.367290092971029
49.9876866683585,8.28961394875536,0.372790400306413
49.9876866683585,8.29680848119313,0.302369789785156
49.9922291054895,8.15291783243777,0.259199978263454
49.9922291054895,8.16011236487554,0.259199978263454
49.9922291054895,8.1673068973133,0.363196324998051
49.9922291054895,8.17450142975107,0.412711401064476
49.9922291054895,8.18169596218884,0.380745194593436
49.9922291054895,8.18889049462661,0.273571501478802
49.9922291054895,8.19608502706438,0.259199978263454
49.9922291054895,8.20327955950214,0.259199978263454
49.9922291054895,8.21047409193991,0.263119475527602
49.9922291054895,8.21766862437768,0.261614674115526
49.9922291054895,8.22486315681545,0.345037737244409
49.9922291054895,8.23205768925322,0.546452593611315
49.9922291054895,8.23925222169098,0.503287846948618
49.9922291054895,8.24644675412875,0.487595047197927
49.9922291054895,8.25364128656652,0.459481110430595
49.9922291054895,8.26083581900429,0.588762921281193
49.9922291054895,8.26803035144206,0.691381219317626
49.9922291054895,8.27522488387982,0.728347576966076
49.9922291054895,8.28241941631759,0.580289298776326
49.9922291054895,8.28961394875536,0.468796097298196
49.9967715426206,8.16011236487554,0.26066086745915
49.9967715426206,8.1673068973133,0.256975357279576
49.9967715426206,8.17450142975107,0.394795110703571
49.9967715426206,8.18169596218884,0.42731120655376
49.9967715426206,8.18889049462661,0.272902242945887
49.9967715426206,8.19608502706438,0.259199978263454
49.9967715426206,8.20327955950214,0.378030439488214
49.9967715426206,8.21047409193991,0.43232466879217
49.9967715426206,8.21766862437768,0.265582409601065
49.9967715426206,8.22486315681545,0.378500629865668
49.9967715426206,8.23205768925322,0.507978919076863
49.9967715426206,8.23925222169098,0.564704625093927
49.9967715426206,8.24644675412875,0.757899226553625
49.9967715426206,8.25364128656652,0.439269317849474
49.9967715426206,8.26083581900429,0.655749841022711
49.9967715426206,8.26803035144206,0.882039192099531
49.9967715426206,8.27522488387982,0.908907441925661
49.9967715426206,8.28241941631759,0.722898673830107
50.0013139797516,8.16011236487554,0.263774924903776
50.0013139797516,8.1673068973133,0.25952233607559
50.0013139797516,8.17450142975107,0.27346695500186
50.0013139797516,8.18169596218884,0.291193368758874
50.0013139797516,8.18889049462661,0.259199978263454
50.0013139797516,8.19608502706438,0.25900988469568
50.0013139797516,8.20327955950214,0.568503974139551
50.0013139797516,8.21047409193991,0.625139080370711
50.0013139797516,8.21766862437768,0.414722194585682
50.0013139797516,8.22486315681545,0.37921392790212
50.0013139797516,8.23205768925322,0.383511805965541
50.0013139797516,8.23925222169098,0.441405793481554
50.0013139797516,8.24644675412875,0.778301899596533
50.0013139797516,8.25364128656652,0.572188983542535
50.0013139797516,8.26083581900429,0.875931612580147
50.0013139797516,8.26803035144206,0.78313176523566
50.0013139797516,8.27522488387982,0.740967795198591
50.0058564168826,8.18169596218884,0.259199978263454
50.0058564168826,8.18889049462661,0.259199978263454
50.0058564168826,8.19608502706438,0.375906198640257
50.0058564168826,8.20327955950214,0.529787367481994
50.0058564168826,8.21047409193991,0.54846813229166
50.0058564168826,8.21766862437768,0.527896401020376
50.0058564168826,8.22486315681545,0.398042651135301
50.0058564168826,8.23205768925322,0.354045207218429
50.0058564168826,8.23925222169098,0.606647237034804
50.0058564168826,8.24644675412875,0.661907631183137
50.0058564168826,8.25364128656652,0.778382700299449
50.0058564168826,8.26083581900429,0.845778660160522
50.0058564168826,8.26803035144206,0.622312100553292
50.0058564168826,8.27522488387982,0.471811066483795
50.0103988540137,8.19608502706438,0.260616062255205
50.0103988540137,8.20327955950214,0.289881915182436
50.0103988540137,8.21047409193991,0.390856840467971
50.0103988540137,8.21766862437768,0.377206020307549
50.0103988540137,8.22486315681545,0.390316178372969
50.0103988540137,8.23205768925322,0.481941656667344
50.0103988540137,8.23925222169098,0.44722241532652
50.0103988540137,8.24644675412875,0.527726300915038
50.0103988540137,8.25364128656652,0.74398947210074
50.0103988540137,8.26083581900429,0.790773958571625
50.0103988540137,8.26803035144206,0.686768620651155
50.0149412911447,8.19608502706438,0.259199978263454
50.0149412911447,8.20327955950214,0.259199978263454
50.0149412911447,8.21047409193991,0.260825168893439
50.0149412911447,8.21766862437768,0.403921815242718
50.0149412911447,8.22486315681545,0.447891802022078
50.0149412911447,8.23205768925322,0.599740247192582
50.0149412911447,8.23925222169098,0.702074576765901
50.0149412911447,8.24644675412875,0.479074840412798
50.0149412911447,8.25364128656652,0.423073753798252
50.0149412911447,8.26083581900429,0.502760459556054
50.0194837282757,8.19608502706438,0.259199978263454
50.0194837282757,8.20327955950214,0.294885266079838
50.0194837282757,8.21047409193991,0.27883110934546
50.0194837282757,8.21766862437768,0.484348585412731
50.0194837282757,8.22486315681545,0.594261914767959
50.0194837282757,8.23205768925322,0.681323244982603
50.0194837282757,8.23925222169098,0.386468298522311
50.0194837282757,8.24644675412875,0.574589260762658
50.0194837282757,8.25364128656652,0.334152877090245
50.0240261654068,8.20327955950214,0.323483070213856
50.0240261654068,8.21047409193991,0.26316382186089
50.0240261654068,8.21766862437768,0.454729424658443
50.0240261654068,8.22486315681545,0.622727543391293
50.0240261654068,8.23205768925322,0.41245993433988
50.0240261654068,8.23925222169098,0.381452414232117
50.0240261654068,8.24644675412875,0.320873361950048
50.0285686025378,8.20327955950214,0.259199978263454
50.0285686025378,8.21047409193991,0.266989178458785
50.0285686025378,8.21766862437768,0.408700973985806
50.0285686025378,8.22486315681545,0.378428441331675
50.0285686025378,8.23205768925322,0.33806323515536
50.0285686025378,8.23925222169098,0.268929020545693
