nan,nan,2.382539972197503242e-01
1.130794357168221076e+01,4.927607829781350546e+01,2.490891536912515358e-01
1.145386172706300698e+01,4.938586049224196017e+01,2.604160651738350873e-01
1.157567949775430627e+01,4.917646377038699512e+01,2.716013536565621833e-01
1.145068331118954319e+01,4.913278703060423425e+01,2.829189597414650814e-01
1.134139404675068619e+01,4.926201469177257763e+01,2.940954323281694260e-01
1.144520097814968373e+01,4.909655526186303831e+01,3.052961100953991980e-01
1.149875614589425510e+01,4.918068971446169968e+01,3.165460439375400448e-01
1.161971501600283574e+01,4.902215695880497037e+01,3.274036452365775007e-01
1.140033702886727873e+01,4.925358152463737582e+01,3.392604535980981995e-01
1.151348140201173109e+01,4.938786830734932920e+01,3.502827948878505238e-01
