nan,nan,1.402720686049212517e-01
7.423659606761848551e+00,5.065958130152936434e+01,1.527986176606532243e-01
7.563318149756431019e+00,5.045211489631080326e+01,1.646608859335813579e-01
7.544414939513637286e+00,5.045029223531503959e+01,1.771859774582365543e-01
7.347732090423273021e+00,5.059182588276116377e+01,1.889493227988383317e-01
7.245350254390976019e+00,5.058280982152468397e+01,2.011720050031252094e-01
7.348029850443690947e+00,5.047923224887312443e+01,2.131692869029991055e-01
7.545457261255857695e+00,5.042673697172241987e+01,2.261222262724878196e-01
7.373980840635673495e+00,5.048658691313333691e+01,2.377202390226178796e-01
7.405821148293260769e+00,5.054115345379043589e+01,2.507803365918602756e-01
7.306365448361357373e+00,5.051567385332859317e+01,2.674407769400232171e-01
