nan,nan,3.552347720376507478e-01
1.111917485982331932e+01,4.941081593628458535e+01,3.696152723639428705e-01
1.108247320092743671e+01,4.937140673477705377e+01,3.818947396548447171e-01
1.115503461268562724e+01,4.946625173967645139e+01,3.934875064674639988e-01
1.119637483935674105e+01,4.941773348184586467e+01,4.065570437261192827e-01
1.103184129736067653e+01,4.937876223611007021e+01,4.193246970660680639e-01
1.104828676371491802e+01,4.951210204769207479e+01,4.313386187893778478e-01
1.105497736901318007e+01,4.935160938858339819e+01,4.459682990324211338e-01
1.110648753292591273e+01,4.950733588583435818e+01,4.581403294900363576e-01
1.101491943754064273e+01,4.953153498247801423e+01,4.698128101092396425e-01
1.126079604877572038e+01,4.943655671419378450e+01,4.815280712742820990e-01
