nan,nan,1.466006999702449409e-01
1.295187093899863129e+01,4.782076021580317615e+01,1.589598991837707920e-01
1.287803107494886845e+01,4.772279357362994290e+01,1.747395499494577287e-01
1.285213245862661857e+01,4.760797051906906319e+01,1.885859162542457002e-01
1.279527242930242892e+01,4.775559444529761066e+01,1.998048711028043989e-01
1.309612735629165314e+01,4.763179708799759027e+01,2.116389899718414680e-01
1.282450065549947382e+01,4.772065295102543558e+01,2.238090331104231057e-01
1.294357041768433980e+01,4.766805982799147046e+01,2.354109260780277990e-01
1.290805771601411678e+01,4.779832665306359019e+01,2.482312552228303215e-01
1.303125450488274062e+01,4.767092077842436737e+01,2.595782347287629022e-01
1.292593122798178840e+01,4.760274201454768672e+01,2.708674757508501285e-01
