50.2930999,7.52517854279049,0.259199978263454
50.2930999,7.53237307848811,0.259199978263454
50.2930999,7.53956761418573,0.259199978263454
50.2930999,7.54676214988335,0.259199978263454
50.2930999,7.55395668558097,0.259199978263454
50.2930999,7.56115122127859,0.259199978263454
50.2930999,7.56834575697621,0.259199978263454
50.2930999,7.5971238997667,0.301800714161447
50.2976352715795,7.52517854279049,0.259199978263454
50.2976352715795,7.53237307848811,0.259199978263454
50.2976352715795,7.53956761418573,0.259199978263454
50.2976352715795,7.54676214988335,0.259199978263454
50.2976352715795,7.55395668558097,0.259199978263454
50.2976352715795,7.56115122127859,0.259199978263454
50.2976352715795,7.56834575697621,0.259199978263454
50.2976352715795,7.57554029267384,0.259199978263454
50.2976352715795,7.58273482837146,0.259199978263454
50.2976352715795,7.58992936406908,0.259199978263454
50.2976352715795,7.5971238997667,0.283272729486857
50.302170643159,7.51798400709286,0.259199978263454
50.302170643159,7.52517854279049,0.259199978263454
50.302170643159,7.53237307848811,0.259199978263454
50.302170643159,7.53956761418573,0.259199978263454
50.302170643159,7.54676214988335,0.259199978263454
50.302170643159,7.55395668558097,0.259199978263454
50.302170643159,7.56115122127859,0.259199978263454
50.302170643159,7.56834575697621,0.259199978263454
50.302170643159,7.57554029267384,0.259199978263454
50.302170643159,7.58273482837146,0.259199978263454
50.302170643159,7.58992936406908,0.265583449388243
50.3067060147385,7.51798400709286,0.259199978263454
50.3067060147385,7.52517854279049,0.259199978263454
50.3067060147385,7.53237307848811,0.25972781947706
50.3067060147385,7.53956761418573,0.259199978263454
50.3067060147385,7.54676214988335,0.303111992659422
50.3067060147385,7.55395668558097,0.303534461230405
50.3067060147385,7.56115122127859,0.325558865262376
50.3067060147385,7.56834575697621,0.259199978263454
50.3067060147385,7.57554029267384,0.259199978263454
50.3067060147385,7.58273482837146,0.259199978263454
50.3067060147385,7.58992936406908,0.334768363494322
50.311241386318,7.52517854279049,0.259199978263454
50.311241386318,7.53237307848811,0.262842661729656
50.311241386318,7.53956761418573,0.261331550757662
50.311241386318,7.54676214988335,0.29930135049425
50.311241386318,7.55395668558097,0.322959339049119
50.311241386318,7.56115122127859,0.274376627487965
50.311241386318,7.56834575697621,0.259199978263454
50.311241386318,7.57554029267384,0.259199978263454
50.311241386318,7.58273482837146,0.27823293782384
50.311241386318,7.58992936406908,0.330720744920265
50.3157767578975,7.53237307848811,0.259199978263454
50.3157767578975,7.53956761418573,0.259199978263454
50.3157767578975,7.54676214988335,0.259199978263454
50.3157767578975,7.55395668558097,0.259199978263454
50.3157767578975,7.56115122127859,0.269744547919202
50.3157767578975,7.56834575697621,0.281263620539578
50.3157767578975,7.57554029267384,0.259199978263454
50.3157767578975,7.58273482837146,0.281004859245371
50.3157767578975,7.58992936406908,0.334911558346259
50.320312129477,7.53237307848811,0.262825966497034
50.320312129477,7.53956761418573,0.301991656927378
50.320312129477,7.54676214988335,0.280925958614787
50.320312129477,7.55395668558097,0.259199978263454
50.320312129477,7.56115122127859,0.266117851643427
50.320312129477,7.56834575697621,0.276409564480841
50.320312129477,7.57554029267384,0.278360455145103
50.320312129477,7.58273482837146,0.308203171280919
50.3248475010566,7.53956761418573,0.277107809421368
50.3248475010566,7.54676214988335,0.262928617578208
50.3248475010566,7.55395668558097,0.259199978263454
50.3248475010566,7.56115122127859,0.259199978263454
50.3248475010566,7.56834575697621,0.259613960436156
50.3248475010566,7.57554029267384,0.357982108550881
50.3248475010566,7.58273482837146,0.30044241610712
50.3248475010566,7.58992936406908,0.275606219730217
50.3248475010566,7.62590204255719,0.259199978263454
50.3248475010566,7.63309657825481,0.259199978263454
50.3293828726361,7.53956761418573,0.259199978263454
50.3293828726361,7.54676214988335,0.259291697964521
50.3293828726361,7.55395668558097,0.295442013803041
50.3293828726361,7.56115122127859,0.259199978263454
50.3293828726361,7.56834575697621,0.25052528080992
50.3293828726361,7.57554029267384,0.294114820583823
50.3293828726361,7.58273482837146,0.204586754326925
50.3293828726361,7.58992936406908,0.204086357432603
50.3293828726361,7.5971238997667,0.514616538535933
50.3293828726361,7.60431843546432,0.28459012893218
50.3293828726361,7.61151297116194,0.330845612183626
50.3293828726361,7.61870750685957,0.266227064479025
50.3293828726361,7.62590204255719,0.259199978263454
50.3293828726361,7.63309657825481,0.257837958023833
50.3293828726361,7.64029111395243,0.259199978263454
50.3293828726361,7.64748564965005,0.259199978263454
50.3293828726361,7.65468018534767,0.259199978263454
50.3339182442156,7.50359493569762,0.259199978263454
50.3339182442156,7.51078947139524,0.259199978263454
50.3339182442156,7.51798400709286,0.259199978263454
50.3339182442156,7.53237307848811,0.26522149265822
50.3339182442156,7.53956761418573,0.259205109772013
50.3339182442156,7.54676214988335,0.2496578640957
50.3339182442156,7.55395668558097,0.411158867443687
50.3339182442156,7.56115122127859,0.316040517611699
50.3339182442156,7.56834575697621,0.290635023958768
50.3339182442156,7.57554029267384,0.239818541881867
50.3339182442156,7.58273482837146,0.198780291756468
50.3339182442156,7.58992936406908,0.242863724903395
50.3339182442156,7.5971238997667,0.281758892971771
50.3339182442156,7.60431843546432,0.300345055472257
50.3339182442156,7.61151297116194,0.330300491620598
50.3339182442156,7.61870750685957,0.329370468630971
50.3339182442156,7.62590204255719,0.259199978263454
50.3339182442156,7.63309657825481,0.231599812826345
50.3339182442156,7.64029111395243,0.253654718711893
50.3339182442156,7.64748564965005,0.259199978263454
50.3339182442156,7.65468018534767,0.259199978263454
50.3339182442156,7.66187472104529,0.259199978263454
50.3384536157951,7.50359493569762,0.259199978263454
50.3384536157951,7.51078947139524,0.259199978263454
50.3384536157951,7.51798400709286,0.259199978263454
50.3384536157951,7.52517854279049,0.259199978263454
50.3384536157951,7.53237307848811,0.259199978263454
50.3384536157951,7.53956761418573,0.282580593055567
50.3384536157951,7.54676214988335,0.391582681196902
50.3384536157951,7.55395668558097,0.38941452442058
50.3384536157951,7.56115122127859,0.293878498539268
50.3384536157951,7.56834575697621,0.319057938893305
50.3384536157951,7.57554029267384,0.269103989500217
50.3384536157951,7.58273482837146,0.270828339741643
50.3384536157951,7.58992936406908,0.249959373421076
50.3384536157951,7.5971238997667,0.249405414549483
50.3384536157951,7.60431843546432,0.274642030762928
50.3384536157951,7.61151297116194,0.386110979624983
50.3384536157951,7.61870750685957,0.309181604670125
50.3384536157951,7.62590204255719,0.259384088672822
50.3384536157951,7.63309657825481,0.259199978263454
50.3384536157951,7.64029111395243,0.259199978263454
50.3384536157951,7.64748564965005,0.259199978263454
50.3384536157951,7.65468018534767,0.259199978263454
50.3384536157951,7.66187472104529,0.259199978263454
50.3429889873746,7.4964004,0.259199978263454
50.3429889873746,7.50359493569762,0.250369659954849
50.3429889873746,7.51078947139524,0.267830202859095
50.3429889873746,7.51798400709286,0.259199978263454
50.3429889873746,7.52517854279049,0.259199978263454
50.3429889873746,7.53237307848811,0.260142904365972
50.3429889873746,7.53956761418573,0.281738752992943
50.3429889873746,7.54676214988335,0.38712871130626
50.3429889873746,7.55395668558097,0.346581042532196
50.3429889873746,7.56115122127859,0.259199978263454
50.3429889873746,7.56834575697621,0.341537095886614
50.3429889873746,7.57554029267384,0.3903439237432
50.3429889873746,7.58273482837146,0.284950912198664
50.3429889873746,7.58992936406908,0.649178523173371
50.3429889873746,7.5971238997667,0.417461219184279
50.3429889873746,7.60431843546432,0.295669690812952
50.3429889873746,7.61151297116194,0.382703161575013
50.3429889873746,7.61870750685957,0.332115674300584
50.3429889873746,7.62590204255719,0.283763998745943
50.3429889873746,7.63309657825481,0.259199978263454
50.3429889873746,7.64029111395243,0.259199978263454
50.3429889873746,7.64748564965005,0.259199978263454
50.3429889873746,7.65468018534767,0.259199978263454
50.3429889873746,7.66187472104529,0.259199978263454
50.3475243589541,7.50359493569762,0.250006133084865
50.3475243589541,7.51078947139524,0.275293241483725
50.3475243589541,7.51798400709286,0.259199978263454
50.3475243589541,7.52517854279049,0.259199978263454
50.3475243589541,7.53237307848811,0.261166350113182
50.3475243589541,7.53956761418573,0.261853714445748
50.3475243589541,7.54676214988335,0.273074676666568
50.3475243589541,7.55395668558097,0.294399738272259
50.3475243589541,7.56115122127859,0.333253863629414
50.3475243589541,7.56834575697621,0.26094050378896
50.3475243589541,7.57554029267384,0.313868655555195
50.3475243589541,7.58273482837146,0.342638391186951
50.3475243589541,7.58992936406908,0.668473760832081
50.3475243589541,7.5971238997667,0.576345624969553
50.3475243589541,7.60431843546432,0.36488137422134
50.3475243589541,7.61151297116194,0.316422544571002
50.3475243589541,7.61870750685957,0.388465013308047
50.3475243589541,7.62590204255719,0.277954807321676
50.3475243589541,7.63309657825481,0.259199978263454
50.3475243589541,7.64029111395243,0.259199978263454
50.3475243589541,7.64748564965005,0.259199978263454
50.3475243589541,7.65468018534767,0.259199978263454
50.3475243589541,7.66187472104529,0.259199978263454
50.3520597305336,7.4964004,0.25048939220338
50.3520597305336,7.50359493569762,0.259199978263454
50.3520597305336,7.51078947139524,0.259199978263454
50.3520597305336,7.51798400709286,0.259199978263454
50.3520597305336,7.52517854279049,0.259199978263454
50.3520597305336,7.53237307848811,0.259199978263454
50.3520597305336,7.53956761418573,0.259199978263454
50.3520597305336,7.54676214988335,0.259199978263454
50.3520597305336,7.55395668558097,0.327122549371537
50.3520597305336,7.56115122127859,0.45293693079663
50.3520597305336,7.56834575697621,0.341935766815764
50.3520597305336,7.57554029267384,0.392220932080198
50.3520597305336,7.58273482837146,0.383424571083224
50.3520597305336,7.58992936406908,0.607065797385774
50.3520597305336,7.5971238997667,0.56196651330707
50.3520597305336,7.60431843546432,0.385704790876214
50.3520597305336,7.61151297116194,0.313679918049976
50.3520597305336,7.61870750685957,0.313604663719715
50.3520597305336,7.62590204255719,0.286651797861371
50.3520597305336,7.63309657825481,0.260923213281609
50.3520597305336,7.64029111395243,0.267475172103307
50.3520597305336,7.64748564965005,0.259199978263454
50.3520597305336,7.65468018534767,0.259199978263454
50.3520597305336,7.66187472104529,0.259199978263454
50.3565951021131,7.4964004,0.23384395240438
50.3565951021131,7.50359493569762,0.259199978263454
50.3565951021131,7.51078947139524,0.259199978263454
50.3565951021131,7.51798400709286,0.259199978263454
50.3565951021131,7.52517854279049,0.259199978263454
50.3565951021131,7.53237307848811,0.259199978263454
50.3565951021131,7.53956761418573,0.259671817910353
50.3565951021131,7.54676214988335,0.259199978263454
50.3565951021131,7.55395668558097,0.329587032148078
50.3565951021131,7.56115122127859,0.403564877658295
50.3565951021131,7.56834575697621,0.440264378116517
50.3565951021131,7.57554029267384,0.413720669522361
50.3565951021131,7.58273482837146,0.419888698773614
50.3565951021131,7.58992936406908,0.648774326871808
50.3565951021131,7.5971238997667,0.730351629964841
50.3565951021131,7.60431843546432,0.441850674142116
50.3565951021131,7.61151297116194,0.585649857345901
50.3565951021131,7.61870750685957,0.365880063874988
50.3565951021131,7.62590204255719,0.319403943131298
50.3565951021131,7.63309657825481,0.307559485542909
50.3565951021131,7.64029111395243,0.298264214531233
50.3565951021131,7.64748564965005,0.259199978263454
50.3565951021131,7.65468018534767,0.259199978263454
50.3565951021131,7.66187472104529,0.259199978263454
50.3611304736926,7.4964004,0.259199978263454
50.3611304736926,7.50359493569762,0.259199978263454
50.3611304736926,7.51078947139524,0.259199978263454
50.3611304736926,7.51798400709286,0.259199978263454
50.3611304736926,7.52517854279049,0.259199978263454
50.3611304736926,7.53237307848811,0.277626744898914
50.3611304736926,7.53956761418573,0.292279725825905
50.3611304736926,7.54676214988335,0.347479984654468
50.3611304736926,7.55395668558097,0.482670209157462
50.3611304736926,7.56115122127859,0.471486690021479
50.3611304736926,7.56834575697621,0.308808581159903
50.3611304736926,7.57554029267384,0.469934707877384
50.3611304736926,7.58273482837146,0.620339586857706
50.3611304736926,7.58992936406908,0.539600867215342
50.3611304736926,7.5971238997667,0.787681142090544
50.3611304736926,7.60431843546432,0.573826274208149
50.3611304736926,7.61151297116194,0.601603646254215
50.3611304736926,7.61870750685957,0.443005811857578
50.3611304736926,7.62590204255719,0.261621890125919
50.3611304736926,7.63309657825481,0.259199978263454
50.3611304736926,7.64029111395243,0.259199978263454
50.3611304736926,7.64748564965005,0.259199978263454
50.3611304736926,7.65468018534767,0.259199978263454
50.3611304736926,7.66187472104529,0.259199978263454
50.3656658452721,7.4964004,0.259199978263454
50.3656658452721,7.50359493569762,0.259199978263454
50.3656658452721,7.51078947139524,0.259199978263454
50.3656658452721,7.51798400709286,0.30190350340542
50.3656658452721,7.52517854279049,0.355112980772505
50.3656658452721,7.53237307848811,0.260200456702582
50.3656658452721,7.53956761418573,0.256534769710226
50.3656658452721,7.54676214988335,0.374120716874871
50.3656658452721,7.55395668558097,0.472047410113959
50.3656658452721,7.56115122127859,0.371225378366997
50.3656658452721,7.56834575697621,0.337653945934892
50.3656658452721,7.57554029267384,0.571049595365691
50.3656658452721,7.58273482837146,0.323059103384682
50.3656658452721,7.58992936406908,0.411149278809571
50.3656658452721,7.5971238997667,0.668775357170223
50.3656658452721,7.60431843546432,0.51807091556132
50.3656658452721,7.61151297116194,0.412451000694364
50.3656658452721,7.61870750685957,0.383564675885191
50.3656658452721,7.62590204255719,0.277481320117922
50.3656658452721,7.63309657825481,0.245620270136538
50.3656658452721,7.64029111395243,0.266127805639645
50.3656658452721,7.64748564965005,0.451228653760594
50.3656658452721,7.65468018534767,0.43572948488914
50.3656658452721,7.66187472104529,0.240781855390813
50.3702012168516,7.50359493569762,0.259199978263454
50.3702012168516,7.51078947139524,0.259199978263454
50.3702012168516,7.51798400709286,0.429243864243585
50.3702012168516,7.52517854279049,0.277482089658056
50.3702012168516,7.53237307848811,0.250255526173305
50.3702012168516,7.53956761418573,0.280508327388603
50.3702012168516,7.54676214988335,0.317314051470126
50.3702012168516,7.55395668558097,0.34120481189957
50.3702012168516,7.56115122127859,0.485639282818438
50.3702012168516,7.56834575697621,0.302999011150724
50.3702012168516,7.57554029267384,0.468536444400306
50.3702012168516,7.58273482837146,0.334333479088324
50.3702012168516,7.58992936406908,0.345114394831595
50.3702012168516,7.5971238997667,0.44279638551808
50.3702012168516,7.60431843546432,0.411707403769361
50.3702012168516,7.61151297116194,0.259889961848221
50.3702012168516,7.61870750685957,0.424493386023021
50.3702012168516,7.62590204255719,0.506345350968167
50.3702012168516,7.63309657825481,0.276032409240141
50.3702012168516,7.64029111395243,0.233077350414641
50.3702012168516,7.64748564965005,0.294970621333893
50.3702012168516,7.65468018534767,0.425100987483418
50.3702012168516,7.66187472104529,0.257390153323071
50.3747365884311,7.51078947139524,0.259199978263454
50.3747365884311,7.51798400709286,0.282035079292496
50.3747365884311,7.52517854279049,0.311022473826976
50.3747365884311,7.53237307848811,0.250441784140782
50.3747365884311,7.53956761418573,0.268611605784383
50.3747365884311,7.54676214988335,0.3103229936438
50.3747365884311,7.55395668558097,0.445662439402326
50.3747365884311,7.56115122127859,0.324514428542512
50.3747365884311,7.56834575697621,0.296260184042272
50.3747365884311,7.57554029267384,0.344462170257175
50.3747365884311,7.58273482837146,0.325060215841392
50.3747365884311,7.58992936406908,0.339821684390472
50.3747365884311,7.5971238997667,0.374120009062563
50.3747365884311,7.60431843546432,0.376738635538143
50.3747365884311,7.61151297116194,0.386281894912186
50.3747365884311,7.62590204255719,0.304192004197683
50.3747365884311,7.63309657825481,0.25258198634016
50.3747365884311,7.64748564965005,0.227951159065593
50.3747365884311,7.65468018534767,0.37807258260754
50.3747365884311,7.66187472104529,0.288501517346677
50.3792719600106,7.51078947139524,0.259199978263454
50.3792719600106,7.51798400709286,0.259199978263454
50.3792719600106,7.52517854279049,0.26630025229609
50.3792719600106,7.53237307848811,0.259199978263454
50.3792719600106,7.53956761418573,0.259199978263454
50.3792719600106,7.54676214988335,0.206596303991587
50.3792719600106,7.55395668558097,0.253556115360544
50.3792719600106,7.56115122127859,0.28064815820786
50.3792719600106,7.56834575697621,0.393886953988404
50.3792719600106,7.57554029267384,0.33880999040575
50.3792719600106,7.58273482837146,0.396773954802925
50.3792719600106,7.58992936406908,0.362003700837907
50.3792719600106,7.5971238997667,0.270316382991739
50.3792719600106,7.60431843546432,0.285051502244725
50.3792719600106,7.61151297116194,0.285555894778321
50.3792719600106,7.65468018534767,0.266790574358561
50.3792719600106,7.66187472104529,0.2394699434025
50.3838073315901,7.53956761418573,0.259199978263454
50.3838073315901,7.54676214988335,0.238097902616021
50.3838073315901,7.55395668558097,0.299381369838282
50.3838073315901,7.56115122127859,0.314811423395855
50.3838073315901,7.56834575697621,0.326731319704979
50.3838073315901,7.57554029267384,0.299574345518144
50.3838073315901,7.58273482837146,0.293804970474978
50.3838073315901,7.58992936406908,0.285368072218966
50.3838073315901,7.5971238997667,0.273207684933943
50.3838073315901,7.60431843546432,0.286306581267464
50.3838073315901,7.61151297116194,0.292363660387278
50.3883427031697,7.53956761418573,0.259199978263454
50.3883427031697,7.54676214988335,0.255336575663271
50.3883427031697,7.55395668558097,0.474638664019809
50.3883427031697,7.56115122127859,0.323267954085856
50.3883427031697,7.56834575697621,0.206952820871226
50.3883427031697,7.57554029267384,0.37152171739364
50.3883427031697,7.58273482837146,0.327380148990776
50.3883427031697,7.58992936406908,0.230524390375005
50.3883427031697,7.5971238997667,0.211143000785599
50.3883427031697,7.60431843546432,0.260480327563344
50.3928780747492,7.53956761418573,0.265175603092807
50.3928780747492,7.54676214988335,0.255875589567624
50.3928780747492,7.55395668558097,0.296543361742139
50.3928780747492,7.56115122127859,0.261841194483526
50.3928780747492,7.56834575697621,0.257804717355148
50.3928780747492,7.57554029267384,0.301135052138858
50.3928780747492,7.58273482837146,0.216710852146742
50.3928780747492,7.58992936406908,0.171192412564998
50.3928780747492,7.5971238997667,0.24849098545863
50.3974134463287,7.55395668558097,0.259199978263454
50.3974134463287,7.56115122127859,0.259199978263454
50.3974134463287,7.56834575697621,0.259199978263454
50.3974134463287,7.57554029267384,0.259199978263454
50.3974134463287,7.58273482837146,0.441425954008954
50.3974134463287,7.58992936406908,0.262943617086534
50.4019488179082,7.56115122127859,0.259199978263454
50.4019488179082,7.56834575697621,0.256942368959772
50.4019488179082,7.57554029267384,0.239582859699084
50.4019488179082,7.58273482837146,0.336338451954996
50.4064841894877,7.56834575697621,0.23131668351679
50.4064841894877,7.57554029267384,0.243591361996196
