nan,nan,8.843419267698186814e-02
8.374480852953656296e+00,4.949143645293936089e+01,1.020585472357209839e-01
8.399372307511367097e+00,4.952274276025148225e+01,1.166058324118008221e-01
8.427194336901244753e+00,4.946332410492754406e+01,1.325650437174232255e-01
8.419756121889706790e+00,4.944621534509903427e+01,1.487551959188992967e-01
8.407819495262456755e+00,4.945928789998074393e+01,1.629915590783844737e-01
8.379760922505758103e+00,4.945887639308148920e+01,1.749579001268376788e-01
8.325054530978654554e+00,4.947267900703791099e+01,1.883409494077273039e-01
8.385234915342913098e+00,4.952854477943110112e+01,2.006150506403585054e-01
8.450635125993752439e+00,4.944265191503008339e+01,2.138612268159136576e-01
8.411418991125188427e+00,4.951961821720513512e+01,2.234805283850652413e-01
