nan,nan,3.018791677594975104e-02
1.198504852370998996e+01,5.220907693753907353e+01,4.153856895558643431e-02
1.215146763330183610e+01,5.239886052948003226e+01,5.309589587897176749e-02
1.178585472472922469e+01,5.218282651397273497e+01,6.425775287517790368e-02
1.175042997654128740e+01,5.217692679255807064e+01,7.553091154784126460e-02
1.185234961226097639e+01,5.227446953942169472e+01,8.991200108996670604e-02
1.173052793379042136e+01,5.216660901482196522e+01,1.015978851579557724e-01
1.181729106197741430e+01,5.206852140326304834e+01,1.126080544135721895e-01
1.170597351515871942e+01,5.222184744604263784e+01,1.238918975521673405e-01
1.182027395189398256e+01,5.223740766446356787e+01,1.345982996105414276e-01
1.199891055877487744e+01,5.241914189859124207e+01,1.461472282871063288e-01
