47.7001073,10.2700028093867,0.259199978263454
47.7001073,10.2843918531413,0.259199978263454
47.7001073,10.2915863750187,0.259199978263454
47.7001073,10.298780896896,0.259199978263454
47.7001073,10.3059754187734,0.259199978263454
47.7001073,10.3131699406507,0.319451957360696
47.7001073,10.320364462528,0.459991034264061
47.7046766044901,10.277197331264,0.264567345123654
47.7046766044901,10.2843918531413,0.294938935849583
47.7046766044901,10.2915863750187,0.259199978263454
47.7046766044901,10.298780896896,0.259199978263454
47.7046766044901,10.3059754187734,0.243365951470207
47.7046766044901,10.3131699406507,0.247160116945637
47.7046766044901,10.320364462528,0.542579103688853
47.7046766044901,10.3275589844054,0.506703349747542
47.7092459089803,10.2628082875093,0.259199978263454
47.7092459089803,10.2700028093867,0.266188399387435
47.7092459089803,10.277197331264,0.283421817717125
47.7092459089803,10.2843918531413,0.374052510531604
47.7092459089803,10.2915863750187,0.320134389777205
47.7092459089803,10.298780896896,0.270934798309805
47.7092459089803,10.3059754187734,0.311883205381968
47.7092459089803,10.3131699406507,0.282429948335795
47.7092459089803,10.320364462528,0.350149318386773
47.7092459089803,10.3275589844054,0.48592353601951
47.7092459089803,10.3347535062827,0.512116438192237
47.7138152134704,10.255613765632,0.340950208809901
47.7138152134704,10.2628082875093,0.259199978263454
47.7138152134704,10.2700028093867,0.259527748715773
47.7138152134704,10.277197331264,0.299107056071371
47.7138152134704,10.2843918531413,0.394829366091371
47.7138152134704,10.2915863750187,0.387202658791329
47.7138152134704,10.298780896896,0.318100451429251
47.7138152134704,10.3059754187734,0.454168007656341
47.7138152134704,10.3131699406507,0.484270232318248
47.7138152134704,10.320364462528,0.403384911233633
47.7138152134704,10.3275589844054,0.521467192645038
47.7138152134704,10.3347535062827,0.445474917993982
47.7138152134704,10.34194802816,0.38354116763911
47.7183845179606,10.255613765632,0.285784465391449
47.7183845179606,10.2628082875093,0.259199978263454
47.7183845179606,10.2700028093867,0.261478391714262
47.7183845179606,10.277197331264,0.274730524632615
47.7183845179606,10.2843918531413,0.292996952065237
47.7183845179606,10.2915863750187,0.422261973036978
47.7183845179606,10.298780896896,0.312280669829502
47.7183845179606,10.3059754187734,0.476423113329808
47.7183845179606,10.3131699406507,0.557494447858515
47.7183845179606,10.320364462528,0.583443265194099
47.7183845179606,10.3275589844054,0.469741662206195
47.7183845179606,10.3347535062827,0.256821411181633
47.7183845179606,10.34194802816,0.318514564986841
47.7229538224507,10.2628082875093,0.259199978263454
47.7229538224507,10.2700028093867,0.270305561870642
47.7229538224507,10.277197331264,0.287275452019501
47.7229538224507,10.2843918531413,0.259199978263454
47.7229538224507,10.2915863750187,0.30972664157918
47.7229538224507,10.298780896896,0.330169823308336
47.7229538224507,10.3059754187734,0.489682705372613
47.7229538224507,10.3131699406507,0.716442590628463
47.7229538224507,10.320364462528,0.756799637662468
47.7229538224507,10.3275589844054,0.426447300696787
47.7229538224507,10.3347535062827,0.27205834952975
47.7229538224507,10.34194802816,0.271113519009693
47.7275231269408,10.2700028093867,0.259199978263454
47.7275231269408,10.277197331264,0.259199978263454
47.7275231269408,10.2843918531413,0.259199978263454
47.7275231269408,10.2915863750187,0.259199978263454
47.7275231269408,10.298780896896,0.300745257689749
47.7275231269408,10.3059754187734,0.578470505351239
47.7275231269408,10.3131699406507,0.744377512601442
47.7275231269408,10.320364462528,0.552032466253021
47.7275231269408,10.3275589844054,0.679837129097162
47.7275231269408,10.3347535062827,0.485292232187379
47.7275231269408,10.34194802816,0.402661711506351
47.732092431431,10.2628082875093,0.259199978263454
47.732092431431,10.2700028093867,0.259199978263454
47.732092431431,10.277197331264,0.259199978263454
47.732092431431,10.2843918531413,0.259199978263454
47.732092431431,10.2915863750187,0.344203709621274
47.732092431431,10.298780896896,0.361312480532044
47.732092431431,10.3059754187734,0.515328619465177
47.732092431431,10.3131699406507,0.459614313978909
47.732092431431,10.320364462528,0.26355334237184
47.732092431431,10.3275589844054,0.400076263003138
47.732092431431,10.3347535062827,0.380191894722255
47.732092431431,10.34194802816,0.300850469941633
47.7366617359211,10.2628082875093,0.259199978263454
47.7366617359211,10.2700028093867,0.259199978263454
47.7366617359211,10.277197331264,0.259199978263454
47.7366617359211,10.2843918531413,0.279161329887989
47.7366617359211,10.2915863750187,0.409077112535978
47.7366617359211,10.298780896896,0.438961391086388
47.7366617359211,10.3059754187734,0.444880904714522
47.7366617359211,10.3131699406507,0.33127145069813
47.7366617359211,10.320364462528,0.324464252326077
47.7366617359211,10.3275589844054,0.524675961360606
47.7366617359211,10.3347535062827,0.303157344180919
47.7366617359211,10.34194802816,0.283514052792714
47.7412310404113,10.2628082875093,0.259199978263454
47.7412310404113,10.2700028093867,0.259199978263454
47.7412310404113,10.277197331264,0.259199978263454
47.7412310404113,10.2843918531413,0.297433085211443
47.7412310404113,10.2915863750187,0.332403180340709
47.7412310404113,10.298780896896,0.403603123391835
47.7412310404113,10.3059754187734,0.49942286782411
47.7412310404113,10.3131699406507,0.255752426003975
47.7412310404113,10.320364462528,0.358730986404639
47.7412310404113,10.3275589844054,0.363498282401975
47.7412310404113,10.3347535062827,0.23746707150883
47.7412310404113,10.34194802816,0.259199978263454
47.7458003449014,10.2628082875093,0.259199978263454
47.7458003449014,10.2700028093867,0.259199978263454
47.7458003449014,10.277197331264,0.259199978263454
47.7458003449014,10.2843918531413,0.275541697770473
47.7458003449014,10.2915863750187,0.259199978263454
47.7458003449014,10.298780896896,0.355577048140358
47.7458003449014,10.3059754187734,0.390953679817502
47.7458003449014,10.3131699406507,0.259199978263454
47.7458003449014,10.320364462528,0.330566355790932
47.7458003449014,10.3275589844054,0.29928924892842
47.7458003449014,10.3347535062827,0.259199978263454
47.7458003449014,10.34194802816,0.259199978263454
47.7503696493915,10.2628082875093,0.259199978263454
47.7503696493915,10.2700028093867,0.259199978263454
47.7503696493915,10.277197331264,0.306264005555955
47.7503696493915,10.2843918531413,0.433166666127435
47.7503696493915,10.2915863750187,0.288443266442926
47.7503696493915,10.298780896896,0.311387463547767
47.7503696493915,10.3059754187734,0.274219381089126
47.7503696493915,10.3131699406507,0.260912729067997
47.7503696493915,10.320364462528,0.294477065841949
47.7503696493915,10.3275589844054,0.271282763650145
47.7503696493915,10.3347535062827,0.259199978263454
47.7503696493915,10.34194802816,0.259199978263454
47.7549389538817,10.2628082875093,0.259199978263454
47.7549389538817,10.2700028093867,0.259199978263454
47.7549389538817,10.277197331264,0.259199978263454
47.7549389538817,10.2843918531413,0.22269460833618
47.7549389538817,10.2915863750187,0.265637294750337
47.7549389538817,10.298780896896,0.299178745593254
47.7549389538817,10.3059754187734,0.259199978263454
47.7549389538817,10.3131699406507,0.285712834189397
47.7549389538817,10.320364462528,0.354360020680435
47.7549389538817,10.3275589844054,0.320348063604436
47.7549389538817,10.3347535062827,0.259199978263454
47.7549389538817,10.34194802816,0.259199978263454
47.7595082583718,10.2484192437547,0.259199978263454
47.7595082583718,10.255613765632,0.259199978263454
47.7595082583718,10.2628082875093,0.259199978263454
47.7595082583718,10.2700028093867,0.259199978263454
47.7595082583718,10.277197331264,0.259199978263454
47.7595082583718,10.2843918531413,0.259199978263454
47.7595082583718,10.2915863750187,0.259199978263454
47.7595082583718,10.298780896896,0.259199978263454
47.7595082583718,10.3059754187734,0.259199978263454
47.7595082583718,10.3131699406507,0.284444516751884
47.7595082583718,10.320364462528,0.293571694374933
47.7595082583718,10.3275589844054,0.287516913436554
47.7595082583718,10.3347535062827,0.317441434178246
47.7595082583718,10.34194802816,0.259199978263454
47.764077562862,10.2340302,0.219478783543348
47.764077562862,10.2412247218773,0.259199978263454
47.764077562862,10.2484192437547,0.259199978263454
47.764077562862,10.255613765632,0.259199978263454
47.764077562862,10.2628082875093,0.259199978263454
47.764077562862,10.2700028093867,0.259199978263454
47.764077562862,10.277197331264,0.259199978263454
47.764077562862,10.2843918531413,0.259199978263454
47.764077562862,10.2915863750187,0.259199978263454
47.764077562862,10.298780896896,0.288701351601691
47.764077562862,10.3059754187734,0.259199978263454
47.764077562862,10.3131699406507,0.271579602703928
47.764077562862,10.320364462528,0.281279752452192
47.764077562862,10.3275589844054,0.2700198941076
47.764077562862,10.3347535062827,0.524263905595738
47.764077562862,10.34194802816,0.277068255470304
