nan,nan,1.243465390675960736e-01
1.311751417617561799e+01,5.111894060219943015e+01,1.383419751705877998e-01
1.323368141787691776e+01,5.079961127879044369e+01,1.499388376969307823e-01
1.304346342300886619e+01,5.090620172525413523e+01,1.628270859124793801e-01
1.273766909781201129e+01,5.092612796592968039e+01,1.745098483411117452e-01
1.307427237342518112e+01,5.085457257553710519e+01,1.878835892930596219e-01
1.275983794503417990e+01,5.096261354303419466e+01,1.993893829165670206e-01
1.287439657340091337e+01,5.106604684787943427e+01,2.120930265915863533e-01
1.339300838833913154e+01,5.090880669724481322e+01,2.242007809845392996e-01
1.335135631024751746e+01,5.091059768641090955e+01,2.364378975867836019e-01
1.292601566024701043e+01,5.116365699240433429e+01,2.504204955629181217e-01
