nan,nan,5.024156481536558305e-02
7.667270571164825910e+00,5.032569469000786455e+01,6.271050507239829541e-02
7.860968322944180464e+00,5.019948584024707117e+01,7.604801200602667732e-02
7.667343778863537906e+00,5.020528737004336506e+01,8.855685694602385971e-02
7.727084888769181426e+00,5.033178700354024926e+01,1.016692574113309266e-01
7.634375373533024423e+00,5.027817286039910272e+01,1.142079031612076301e-01
7.649112965011217291e+00,5.018559485835360334e+01,1.257143991691914153e-01
7.725182277111601437e+00,5.015103074446086140e+01,1.392979839157681698e-01
7.712400697113604764e+00,5.033472346151624777e+01,1.521873840684498103e-01
7.798873920744543220e+00,5.018823251913070038e+01,1.636777769954704809e-01
7.791289951678967540e+00,5.025282937821462070e+01,1.759724305481554507e-01
