nan,nan,2.021975376285841397e-01
8.238974321721357796e+00,5.195831959729346750e+01,2.141247515291993253e-01
8.194635987229085927e+00,5.190201145659573712e+01,2.282761549008214819e-01
8.439986934008363306e+00,5.185917775847083533e+01,2.418206090291180888e-01
8.363483422472562268e+00,5.206066527272321309e+01,2.578785779986856319e-01
8.648808356738683756e+00,5.190710674399267788e+01,2.699775424583252259e-01
8.298018652819688867e+00,5.193874159776963495e+01,2.818208187110408658e-01
8.123656645029514678e+00,5.202710175466452114e+01,2.948679936606548035e-01
8.409917704333855326e+00,5.194804513347640551e+01,3.088828340356752356e-01
8.314117713835571521e+00,5.177439150265605150e+01,3.228195489087736236e-01
8.275939075856216576e+00,5.194685049656960274e+01,3.350253541785909728e-01
