nan,nan,7.827256000628450561e-02
1.121808464503491010e+01,5.194502560443254424e+01,8.944872380843398030e-02
1.098911773991011387e+01,5.242921402670569364e+01,1.014119063865477760e-01
1.157142448892806463e+01,5.225517599521036516e+01,1.124744378510735554e-01
1.167527989710830916e+01,5.229171527796614782e+01,1.245578947785280499e-01
1.108441030864958243e+01,5.206024419671178549e+01,1.375394885736704875e-01
1.160627741697366133e+01,5.231637573065710001e+01,1.485327132219040613e-01
1.147729772156172778e+01,5.228342417369616157e+01,1.604827714325240406e-01
1.161223962347805738e+01,5.219592302996566247e+01,1.727639741058542844e-01
1.137488154798971962e+01,5.229097606031291434e+01,1.841461303891847312e-01
1.121211098386545224e+01,5.237813697657865930e+01,1.963611276896670699e-01
