nan,nan,5.903087455849551080e-02
1.073703176489508238e+01,5.063510955828522953e+01,7.070704349798814792e-02
1.065594903470518950e+01,5.059891490827033778e+01,8.290461244981826849e-02
1.078923233859773845e+01,5.059361922694735370e+01,9.473759944827224444e-02
1.063569062802772791e+01,5.060616248000738437e+01,1.061262502549342041e-01
1.066032029451858243e+01,5.061624286350689772e+01,1.175968977597656173e-01
1.059576879620785306e+01,5.060249451369392659e+01,1.285867372345575466e-01
1.062003403993588435e+01,5.062631997043281729e+01,1.398790160240222513e-01
1.064187258944115122e+01,5.057893356965981013e+01,1.510736302211014015e-01
1.072326300888854789e+01,5.060593054293578774e+01,1.616772983834331434e-01
1.071074079948447455e+01,5.063067448613280419e+01,1.706094993884138822e-01
