nan,nan,1.808418602075203552e-01
9.323489110229777665e+00,5.348392654653593326e+01,1.919262720203300798e-01
9.669167670386260127e+00,5.347075879140125920e+01,2.043190140175102643e-01
9.364051990044686136e+00,5.351090293532301700e+01,2.158659608494167270e-01
9.693993153712096245e+00,5.347094814042709032e+01,2.292188992071607923e-01
9.313035057596078303e+00,5.361565722850627225e+01,2.417021018972466684e-01
9.489710162155008177e+00,5.366266751404925373e+01,2.536714767461918374e-01
9.315935266122943759e+00,5.377909812026934588e+01,2.648899899484032927e-01
9.397278796250384758e+00,5.352061503642558193e+01,2.764714850031202431e-01
9.542910696707613383e+00,5.353415279734277732e+01,2.876498984193536779e-01
9.711655709336344700e+00,5.346347699875673243e+01,2.992186600551330344e-01
