nan,nan,1.618870667579937472e-01
1.079042492055581270e+01,4.770133182642416614e+01,1.740035997773560217e-01
1.055746168583370448e+01,4.757875208101791031e+01,1.886560636900499466e-01
1.069136677717343886e+01,4.782298954684787162e+01,1.999692302927195686e-01
1.066239183874089136e+01,4.764662515261006348e+01,2.117300017160487213e-01
1.055035943268322818e+01,4.759811038864796728e+01,2.234427557824749111e-01
1.046857547752810191e+01,4.787154252350098460e+01,2.343272738984157888e-01
1.072414661570615380e+01,4.761561281459343320e+01,2.465814834178096104e-01
1.057044524980371669e+01,4.756583217267622388e+01,2.591132910157743496e-01
1.058187954782271945e+01,4.777101282011636130e+01,2.700829810228413952e-01
1.074026748143409371e+01,4.763191218059363052e+01,2.815762531170434291e-01
