nan,nan,1.606018228264655123e-01
1.261213378341713742e+01,5.075040887338016660e+01,1.724315249941125727e-01
1.251598242753441070e+01,5.067416196346044188e+01,1.854020558914246941e-01
1.252356627979628101e+01,5.073211676979705231e+01,1.982148222286329031e-01
1.272419225729983161e+01,5.080285159064914069e+01,2.115822651008220645e-01
1.248800886105379604e+01,5.068241564161363044e+01,2.238528188301963373e-01
1.270837743836414369e+01,5.075954673522242189e+01,2.366967472570004616e-01
1.261177985828867598e+01,5.085710100839173009e+01,2.488845996382368364e-01
1.255998854917313601e+01,5.080822097592096043e+01,2.613157561535641715e-01
1.254049847859040945e+01,5.081601619400738912e+01,2.754112822479042877e-01
1.246939349969580668e+01,5.069592883819017715e+01,2.904746480053407853e-01
