nan,nan,3.339716921065007948e-01
9.384341177458807692e+00,4.913391574294037412e+01,3.468623201517902488e-01
9.107343483980017140e+00,4.923884047752817850e+01,3.614530766228357672e-01
8.992071634278083536e+00,4.920484775274271527e+01,3.754394736686966771e-01
9.179849531072502344e+00,4.906748699906893307e+01,3.876512579183940543e-01
8.889076842679115131e+00,4.916628699984784134e+01,3.997109470323911840e-01
9.030913683485168875e+00,4.910267632181040653e+01,4.121364889508665197e-01
9.358265539255020471e+00,4.913586692011934076e+01,4.245376568889528968e-01
9.052270824952643125e+00,4.903715253895857273e+01,4.399510636087098914e-01
9.104437454789428230e+00,4.914262821040920670e+01,4.526847015043337641e-01
8.934953341639880975e+00,4.919198251357006768e+01,4.660216386103541164e-01
