nan,nan,3.135052860160578159e-01
1.131353543982905308e+01,4.949582393372951117e+01,3.253739562585725720e-01
1.122952702306993977e+01,4.955414031217043203e+01,3.368328864777647147e-01
1.130587717734234765e+01,4.932599086554812118e+01,3.486860708001519038e-01
1.140653242424287228e+01,4.961391418570429579e+01,3.607503355638627673e-01
1.154743961076400183e+01,4.962700956690800780e+01,3.732733968623972443e-01
1.135899311647111709e+01,4.932488909974191671e+01,3.843622835220193990e-01
1.130891507155261877e+01,4.945047892310536497e+01,3.965504126010385710e-01
1.135898582599902795e+01,4.963767706299543647e+01,4.080302561633005753e-01
1.130166982219756022e+01,4.938177006186500506e+01,4.202654405592277653e-01
1.133917634021249299e+01,4.960089383230715043e+01,4.322521880669135119e-01
