nan,nan,6.492651405823324229e-01
7.741633648692436864e+00,5.227049388039977629e+01,6.605771849509437521e-01
7.451706324318243091e+00,5.223554090395211347e+01,6.725682420720534571e-01
7.324981214786287609e+00,5.227619608482044100e+01,6.842064640041659596e-01
7.213489164072817594e+00,5.214552709807058761e+01,6.970773029007566457e-01
7.300675986729253886e+00,5.208167680239206021e+01,7.083799822193254103e-01
7.480404210856634428e+00,5.208494326536119701e+01,7.203507551875630854e-01
7.588171216588291301e+00,5.209690318936461040e+01,7.329051553940513219e-01
7.442015640835527357e+00,5.229528627722886114e+01,7.441771847771461168e-01
7.724791622454313611e+00,5.230783391331425491e+01,7.558307718688969112e-01
7.467644708032454837e+00,5.228637615801545024e+01,7.694312998128193248e-01
