nan,nan,1.463122683350413789e-01
1.054548572886680269e+01,5.226730101210926449e+01,1.602713649669159357e-01
1.055692291565013363e+01,5.229168218189476391e+01,1.746007306682122728e-01
1.047236556414484276e+01,5.225130203819200858e+01,1.872354402587950717e-01
1.049589084574333064e+01,5.226277236664998327e+01,1.980501632456685979e-01
1.056469288233122228e+01,5.223501887025921775e+01,2.115611458904149977e-01
1.047952026137640402e+01,5.227370596319754981e+01,2.255990082270842023e-01
1.048008716346735625e+01,5.223457982767918395e+01,2.382055271726787882e-01
1.051043504141923179e+01,5.231929017045091257e+01,2.505818379506464244e-01
1.044183627984705431e+01,5.227232829775863365e+01,2.631617629270610603e-01
1.052205592016246349e+01,5.221459014078035921e+01,2.755653438283725554e-01
