nan,nan,1.386220761048078398e-01
1.315015278685444322e+01,5.208844899501725223e+01,1.502521502036277823e-01
1.306695428014376503e+01,5.199284162558269173e+01,1.621042850470811869e-01
1.337392575168855302e+01,5.213439653227553805e+01,1.741751886394303506e-01
1.344559140901272620e+01,5.232197515414003419e+01,1.863726963391793279e-01
1.314769424530887498e+01,5.221190771422332233e+01,1.976397853191479703e-01
1.310623869708664202e+01,5.202029567365995177e+01,2.092957024637553398e-01
1.325821349169621044e+01,5.230341415722001130e+01,2.229584082186314431e-01
1.339715586567514016e+01,5.232133495139864010e+01,2.356938118423871076e-01
1.298044208408585654e+01,5.197136255554671180e+01,2.465829029806986816e-01
1.342158275805437739e+01,5.232558925462616628e+01,2.587845594445701836e-01
