nan,nan,1.501043514791368660e-01
7.278117720206827457e+00,4.991950195149561864e+01,1.613689287138854733e-01
7.566498385063922250e+00,5.001697598541309731e+01,1.725899659302270184e-01
7.410523726544116840e+00,4.990248952094415102e+01,1.845694333108271468e-01
7.685515741751225427e+00,5.000987673215828266e+01,1.954736224299341574e-01
7.463580436928881845e+00,4.988552742299538778e+01,2.066751495471434996e-01
7.306027922633282046e+00,4.992844528801923332e+01,2.195445583813985246e-01
7.487924471751469468e+00,5.001481499764136629e+01,2.305766155874925394e-01
7.425921766838178506e+00,5.005462058698366690e+01,2.417405639663509076e-01
7.681829671067448295e+00,5.010311044671348668e+01,2.538406816412668854e-01
7.486951725867251994e+00,4.993466967467302453e+01,2.657846198138947291e-01
