nan,nan,8.209260256330065675e-02
7.761235627278717075e+00,5.169577640940317309e+01,9.899147405607873484e-02
7.822038831948439963e+00,5.171285221398309773e+01,1.135251490807766828e-01
7.796622793902769466e+00,5.166279334277376734e+01,1.267158149471668549e-01
7.740863000645843428e+00,5.169431294512346398e+01,1.401576376539078739e-01
7.750579694033815414e+00,5.166831834908211363e+01,1.523644124821399437e-01
7.796065392893489765e+00,5.169405940696043444e+01,1.652300069328148935e-01
7.849120096453478190e+00,5.163850447155888901e+01,1.773573623864072024e-01
7.863949084637027021e+00,5.165033207827612927e+01,1.892953029964989098e-01
7.755179390202974865e+00,5.163799611413045909e+01,2.014064520075588560e-01
7.779605306671267151e+00,5.168920902579724697e+01,2.152875628062531632e-01
