nan,nan,8.843419267698186814e-02
8.422502243164707636e+00,4.946088574780846869e+01,1.025946719236779381e-01
8.404365575503483399e+00,4.947396743599014712e+01,1.172811081518614629e-01
8.404087691017082307e+00,4.952156157397359948e+01,1.334435132718181649e-01
8.418081058432546726e+00,4.944587061776534398e+01,1.480689715637151793e-01
8.386610687639111106e+00,4.952905098288195518e+01,1.633353481233043025e-01
8.449267956715059924e+00,4.944322680221858946e+01,1.755522157626439594e-01
8.377638657911287368e+00,4.949297606950918293e+01,1.889773806645959064e-01
8.327699589747609821e+00,4.947121972275151336e+01,2.019569955236531489e-01
8.373282229256165721e+00,4.945380636237193528e+01,2.136743404180728723e-01
8.398950243326726905e+00,4.945423091593666243e+01,2.254766089666905005e-01
