nan,nan,9.722801137616590705e-02
9.663468859749682949e+00,5.083117286415137670e+01,1.094347061900560053e-01
9.912411399360475883e+00,5.084649027745768279e+01,1.219018858033851516e-01
9.594930576011710954e+00,5.080082235295156323e+01,1.344110322023217841e-01
9.791761443804809062e+00,5.097410690020753066e+01,1.460374272375110083e-01
9.516503074045868260e+00,5.077408061306484655e+01,1.581320666800363761e-01
9.740641633004374356e+00,5.086435584050309444e+01,1.699262301368982542e-01
9.844526980889733991e+00,5.094873741571527859e+01,1.813953785542328501e-01
1.000327737901623415e+01,5.084071318783161786e+01,1.937687145455283533e-01
9.753996885909506531e+00,5.098329784854151114e+01,2.050882716870899292e-01
9.683705362909124759e+00,5.084394275260760310e+01,2.184212378146166977e-01
