nan,nan,1.851447584633409138e-01
1.338004733350594044e+01,5.322107081315279231e+01,1.964892645627217271e-01
1.354027956524859633e+01,5.326151649242199682e+01,2.074499011803139503e-01
1.377637941848644942e+01,5.317457507468533606e+01,2.185328092443383774e-01
1.360965940138735597e+01,5.326543100251925011e+01,2.313905989847941380e-01
1.352518134093072710e+01,5.310605529810201375e+01,2.423337126006880615e-01
1.381043650276065016e+01,5.316247157930622791e+01,2.535571339572513239e-01
1.366961248709307419e+01,5.321785733963591269e+01,2.645836230029133262e-01
1.332678575801061882e+01,5.314429102601258847e+01,2.754325431386953627e-01
1.387639443066352030e+01,5.318863156353539523e+01,2.864675966196644219e-01
1.353281843613872937e+01,5.305175414691476732e+01,2.978364336149499358e-01
