nan,nan,4.110001538603217375e-01
9.884284310896049419e+00,4.779049883225901851e+01,4.238337175945725566e-01
9.431803168657584280e+00,4.785390437273099451e+01,4.352629141673973190e-01
9.512808565531473803e+00,4.790356402606708031e+01,4.468973732277746747e-01
9.599589579814226781e+00,4.782293866762057633e+01,4.586868316500432585e-01
9.787776253408891236e+00,4.768318978838995292e+01,4.700011427792183394e-01
9.433183242493459630e+00,4.790747951263325888e+01,4.822217355775582082e-01
9.650873542309833297e+00,4.774352827072692662e+01,4.933477834621695646e-01
9.765287382019355533e+00,4.766903239266772374e+01,5.050422908002923927e-01
9.700213448756040080e+00,4.773050643433516882e+01,5.165691022352050243e-01
9.620610797744603815e+00,4.782896857463691020e+01,5.279787109744619178e-01
