nan,nan,3.258930575798729690e-01
7.414395384944191925e+00,5.300228088926517955e+01,3.375294952004860849e-01
7.327168190631278222e+00,5.296580802571278923e+01,3.498674243419150343e-01
7.341785790051181593e+00,5.251738647635575319e+01,3.619409400669492127e-01
7.335542135897226146e+00,5.304968114339491336e+01,3.734584232981948970e-01
7.468315590305124374e+00,5.276771456349914757e+01,3.849216839370987464e-01
7.364023808309033470e+00,5.254678952146854698e+01,3.968224126435183075e-01
7.409300222536808533e+00,5.251025235612952713e+01,4.082817996079992628e-01
7.446694502682825956e+00,5.307050464968761361e+01,4.208571268424148304e-01
7.105731899267103913e+00,5.277921486138660612e+01,4.328072125065276499e-01
7.207183851056636392e+00,5.275487264728852210e+01,4.450206135810686470e-01
