nan,nan,5.688676862192423855e-02
1.399698554918702698e+01,5.152086806623289306e+01,6.952760231031444860e-02
1.397927826388076866e+01,5.174426881825797153e+01,8.134424616345561909e-02
1.397264623028123864e+01,5.150695062083951825e+01,9.267325803369509674e-02
1.404651626422617028e+01,5.149684394002919419e+01,1.048737448627100194e-01
1.389369862301062852e+01,5.155866197487615921e+01,1.158432387464780750e-01
1.405303099198965811e+01,5.151639676750045993e+01,1.275083908696816315e-01
1.389326530795190173e+01,5.140923640207248724e+01,1.394406236441539104e-01
1.397195385461193240e+01,5.179677580362908174e+01,1.503026041145075486e-01
1.406001213842423070e+01,5.155539982297476342e+01,1.615834957921820914e-01
1.386291173796653986e+01,5.145881559902523605e+01,1.747526758871457697e-01
