51.3525568,6.9286801547348,0.338928077749608
51.3525568,6.9358746934185,0.296220306597842
51.3525568,6.9430692321022,0.252883798041405
51.3525568,6.9502637707859,0.263044413859435
51.3525568,6.9574583094696,0.259199978263454
51.3525568,6.9646528481533,0.259199978263454
51.3525568,6.971847386837,0.259199978263454
51.3570862120817,6.9286801547348,0.417073999462772
51.3570862120817,6.9358746934185,0.341499590019635
51.3570862120817,6.9430692321022,0.412477227875428
51.3570862120817,6.9502637707859,0.302988405546847
51.3570862120817,6.9574583094696,0.259956207976832
51.3570862120817,6.9646528481533,0.259199978263454
51.3570862120817,6.971847386837,0.259199978263454
51.3570862120817,6.9790419255207,0.259199978263454
51.3616156241634,6.9142910773674,0.308389778488972
51.3616156241634,6.9214856160511,0.282035349766537
51.3616156241634,6.9286801547348,0.432040513812643
51.3616156241634,6.9358746934185,0.695553991861594
51.3616156241634,6.9430692321022,0.510587343394067
51.3616156241634,6.9502637707859,0.421715845327883
51.3616156241634,6.9574583094696,0.268300685035587
51.3616156241634,6.9646528481533,0.259199978263454
51.3616156241634,6.971847386837,0.259199978263454
51.3616156241634,6.9790419255207,0.259199978263454
51.3616156241634,6.9862364642044,0.250369951935749
51.3616156241634,6.9934310028881,0.251307559337206
51.3616156241634,7.0006255415718,0.259199978263454
51.3616156241634,7.0078200802555,0.259199978263454
51.3661450362451,6.9070965386837,0.259199978263454
51.3661450362451,6.9142910773674,0.261027895721977
51.3661450362451,6.9214856160511,0.259199978263454
51.3661450362451,6.9286801547348,0.278005658778432
51.3661450362451,6.9358746934185,0.607408161481431
51.3661450362451,6.9430692321022,0.354984641232213
51.3661450362451,6.9502637707859,0.307402463178249
51.3661450362451,6.9574583094696,0.274734788010906
51.3661450362451,6.9646528481533,0.308568797116537
51.3661450362451,6.971847386837,0.259199978263454
51.3661450362451,6.9790419255207,0.259199978263454
51.3661450362451,6.9862364642044,0.256412619380875
51.3661450362451,6.9934310028881,0.257031523867919
51.3661450362451,7.0006255415718,0.259199978263454
51.3661450362451,7.0078200802555,0.259199978263454
51.3661450362451,7.0150146189392,0.287733677644105
51.3661450362451,7.0222091576229,0.259132747411591
51.3661450362451,7.0294036963066,0.23254127242995
51.3661450362451,7.0365982349903,0.25289647585567
51.3661450362451,7.0509873123577,0.259199978263454
51.3661450362451,7.0581818510414,0.280636805376344
51.3706744483268,6.9142910773674,0.259199978263454
51.3706744483268,6.9214856160511,0.259199978263454
51.3706744483268,6.9286801547348,0.276534469500253
51.3706744483268,6.9358746934185,0.474631405363388
51.3706744483268,6.9430692321022,0.271588927326274
51.3706744483268,6.9502637707859,0.320143995256685
51.3706744483268,6.9574583094696,0.346079302710224
51.3706744483268,6.9646528481533,0.304034438039476
51.3706744483268,6.971847386837,0.259199978263454
51.3706744483268,6.9790419255207,0.259199978263454
51.3706744483268,6.9862364642044,0.259199978263454
51.3706744483268,6.9934310028881,0.259199978263454
51.3706744483268,7.0006255415718,0.259199978263454
51.3706744483268,7.0078200802555,0.259199978263454
51.3706744483268,7.0150146189392,0.315491021524945
51.3706744483268,7.0222091576229,0.28778050422291
51.3706744483268,7.0294036963066,0.251366867628824
51.3706744483268,7.0365982349903,0.259199978263454
51.3706744483268,7.043792773674,0.259199978263454
51.3706744483268,7.0509873123577,0.259199978263454
51.3706744483268,7.0581818510414,0.25784053006192
51.3706744483268,7.0653763897251,0.23628187298199
51.3706744483268,7.0941545444599,0.259199978263454
51.3752038604085,6.9214856160511,0.275610302307459
51.3752038604085,6.9286801547348,0.290389193136373
51.3752038604085,6.9358746934185,0.422934420713811
51.3752038604085,6.9430692321022,0.444983418108041
51.3752038604085,6.9502637707859,0.406207849470887
51.3752038604085,6.9574583094696,0.29227355340137
51.3752038604085,6.9646528481533,0.287478829449449
51.3752038604085,6.971847386837,0.261879308968408
51.3752038604085,6.9790419255207,0.384695218141608
51.3752038604085,6.9862364642044,0.260002469453629
51.3752038604085,6.9934310028881,0.259199978263454
51.3752038604085,7.0006255415718,0.259199978263454
51.3752038604085,7.0078200802555,0.288351176901414
51.3752038604085,7.0150146189392,0.346082251761121
51.3752038604085,7.0222091576229,0.271968844565838
51.3752038604085,7.0294036963066,0.259199978263454
51.3752038604085,7.0365982349903,0.259199978263454
51.3752038604085,7.043792773674,0.244006441419251
51.3752038604085,7.0509873123577,0.255672586857646
51.3752038604085,7.0581818510414,0.259199978263454
51.3752038604085,7.0653763897251,0.251671647751715
51.3752038604085,7.0725709284088,0.268932569828033
51.3752038604085,7.0797654670925,0.259199978263454
51.3752038604085,7.0869600057762,0.259199978263454
51.3752038604085,7.0941545444599,0.255861562340128
51.3752038604085,7.1013490831436,0.259199978263454
51.3797332724903,6.9142910773674,0.291013082732255
51.3797332724903,6.9214856160511,0.30415752524834
51.3797332724903,6.9286801547348,0.283784635246673
51.3797332724903,6.9358746934185,0.318019227457795
51.3797332724903,6.9430692321022,0.315633294072199
51.3797332724903,6.9502637707859,0.26447781728644
51.3797332724903,6.9574583094696,0.260197094048779
51.3797332724903,6.9646528481533,0.268157616342507
51.3797332724903,6.971847386837,0.259199978263454
51.3797332724903,6.9790419255207,0.371009040672687
51.3797332724903,6.9862364642044,0.316957214243669
51.3797332724903,6.9934310028881,0.323960340483985
51.3797332724903,7.0006255415718,0.299120839157501
51.3797332724903,7.0078200802555,0.268791632171196
51.3797332724903,7.0150146189392,0.356477636930541
51.3797332724903,7.0222091576229,0.238669773236226
51.3797332724903,7.0294036963066,0.26040402828583
51.3797332724903,7.0365982349903,0.259199978263454
51.3797332724903,7.043792773674,0.256947666064209
51.3797332724903,7.0509873123577,0.249992566686563
51.3797332724903,7.0581818510414,0.259199978263454
51.3797332724903,7.0653763897251,0.279422436333769
51.3797332724903,7.0725709284088,0.352688147959436
51.3797332724903,7.0797654670925,0.326306878862111
51.3797332724903,7.0869600057762,0.215327637691845
51.3797332724903,7.0941545444599,0.275278373768151
51.3797332724903,7.1013490831436,0.303130858119389
51.3797332724903,7.1085436218273,0.262761483109777
51.3797332724903,7.115738160511,0.2882955742101
51.384262684572,6.9358746934185,0.263778200858806
51.384262684572,6.9430692321022,0.284673337252305
51.384262684572,6.9502637707859,0.25933513320962
51.384262684572,6.9574583094696,0.265798482410534
51.384262684572,6.9646528481533,0.279628646776727
51.384262684572,6.971847386837,0.259199978263454
51.384262684572,6.9790419255207,0.290014816881975
51.384262684572,6.9862364642044,0.3129072797913
51.384262684572,6.9934310028881,0.442584256779787
51.384262684572,7.0006255415718,0.4200285318151
51.384262684572,7.0078200802555,0.335518795960338
51.384262684572,7.0150146189392,0.285101901830139
51.384262684572,7.0222091576229,0.379444729579608
51.384262684572,7.0294036963066,0.552627295595139
51.384262684572,7.0365982349903,0.259844413849402
51.384262684572,7.043792773674,0.289959414854211
51.384262684572,7.0509873123577,0.250316115877528
51.384262684572,7.0581818510414,0.255648195421189
51.384262684572,7.0653763897251,0.259199978263454
51.384262684572,7.0725709284088,0.299825714145194
51.384262684572,7.0797654670925,0.443408274684586
51.384262684572,7.0869600057762,0.379544758650811
51.384262684572,7.0941545444599,0.290748975978183
51.384262684572,7.1013490831436,0.302014024273771
51.384262684572,7.1085436218273,0.267679667767087
51.384262684572,7.115738160511,0.278815885023275
51.3887920966537,6.9430692321022,0.307761380100887
51.3887920966537,6.9502637707859,0.262417602862581
51.3887920966537,6.9574583094696,0.254773873714583
51.3887920966537,6.9646528481533,0.234213916343544
51.3887920966537,6.971847386837,0.251608582686814
51.3887920966537,6.9790419255207,0.259199978263454
51.3887920966537,6.9862364642044,0.249268055950205
51.3887920966537,6.9934310028881,0.298585169042339
51.3887920966537,7.0006255415718,0.794919366143115
51.3887920966537,7.0078200802555,0.602691673098387
51.3887920966537,7.0150146189392,0.453466273532402
51.3887920966537,7.0222091576229,0.381356806107746
51.3887920966537,7.0294036963066,0.34812224878598
51.3887920966537,7.0365982349903,0.259866384774015
51.3887920966537,7.043792773674,0.259199978263454
51.3887920966537,7.0509873123577,0.249310598982525
51.3887920966537,7.0581818510414,0.253289118108849
51.3887920966537,7.0653763897251,0.270489223085542
51.3887920966537,7.0725709284088,0.29856588909147
51.3887920966537,7.0797654670925,0.626804890061998
51.3887920966537,7.0869600057762,0.543625249736645
51.3887920966537,7.0941545444599,0.260643140251597
51.3887920966537,7.1013490831436,0.259199978263454
51.3887920966537,7.1085436218273,0.259199978263454
51.3887920966537,7.115738160511,0.259199978263454
51.3933215087354,6.9502637707859,0.274169987284629
51.3933215087354,6.9574583094696,0.240225375493566
51.3933215087354,6.9646528481533,0.252298553888944
51.3933215087354,6.971847386837,0.241613478360121
51.3933215087354,6.9790419255207,0.25904942345545
51.3933215087354,6.9862364642044,0.212216067673348
51.3933215087354,6.9934310028881,0.264189012164732
51.3933215087354,7.0006255415718,0.514715307751089
51.3933215087354,7.0078200802555,0.425034957090447
51.3933215087354,7.0150146189392,0.35896916497161
51.3933215087354,7.0222091576229,0.308789731667506
51.3933215087354,7.0294036963066,0.320243465217454
51.3933215087354,7.0365982349903,0.282647457310157
51.3933215087354,7.043792773674,0.259199978263454
51.3933215087354,7.0509873123577,0.257201509986581
51.3933215087354,7.0581818510414,0.451309907036517
51.3933215087354,7.0653763897251,0.418197771245767
51.3933215087354,7.0725709284088,0.392971382339877
51.3933215087354,7.0797654670925,0.714517680111737
51.3933215087354,7.0869600057762,0.453853660248543
51.3933215087354,7.0941545444599,0.274648035596691
51.3933215087354,7.1013490831436,0.272614530841389
51.3933215087354,7.1085436218273,0.28137475862321
51.3933215087354,7.115738160511,0.394260324020184
51.3978509208171,6.9430692321022,0.282927808252222
51.3978509208171,6.9502637707859,0.257024092607547
51.3978509208171,6.9574583094696,0.237429902386068
51.3978509208171,6.9646528481533,0.257847232414665
51.3978509208171,6.971847386837,0.259199978263454
51.3978509208171,6.9790419255207,0.259199978263454
51.3978509208171,6.9862364642044,0.273665020405605
51.3978509208171,6.9934310028881,0.28444341441077
51.3978509208171,7.0006255415718,0.358625393726943
51.3978509208171,7.0078200802555,0.425008962183378
51.3978509208171,7.0150146189392,0.362423780947448
51.3978509208171,7.0222091576229,0.259199978263454
51.3978509208171,7.0294036963066,0.259199978263454
51.3978509208171,7.0365982349903,0.259199978263454
51.3978509208171,7.043792773674,0.372067340532944
51.3978509208171,7.0509873123577,0.412016859192513
51.3978509208171,7.0581818510414,0.454528463562112
51.3978509208171,7.0653763897251,0.394475036223233
51.3978509208171,7.0725709284088,0.402958479835487
51.3978509208171,7.0797654670925,0.339204527287044
51.3978509208171,7.0869600057762,0.247125107309997
51.3978509208171,7.0941545444599,0.353775686815232
51.3978509208171,7.1013490831436,0.259199978263454
51.3978509208171,7.1085436218273,0.29469989048796
51.4023803328988,6.9502637707859,0.288898590202031
51.4023803328988,6.9574583094696,0.28969593099034
51.4023803328988,6.9646528481533,0.259199978263454
51.4023803328988,6.971847386837,0.259199978263454
51.4023803328988,6.9790419255207,0.259199978263454
51.4023803328988,6.9862364642044,0.259199978263454
51.4023803328988,6.9934310028881,0.26724360854184
51.4023803328988,7.0006255415718,0.340841304591613
51.4023803328988,7.0078200802555,0.424718543999302
51.4023803328988,7.0150146189392,0.334400713299175
51.4023803328988,7.0222091576229,0.271963554574901
51.4023803328988,7.0294036963066,0.368278300395549
51.4023803328988,7.0365982349903,0.37668200152472
51.4023803328988,7.043792773674,0.452643258782931
51.4023803328988,7.0509873123577,0.432685307422673
51.4023803328988,7.0581818510414,0.356804935150006
51.4023803328988,7.0653763897251,0.675442000673875
51.4023803328988,7.0725709284088,0.417970787413389
51.4023803328988,7.0797654670925,0.298576883708427
51.4023803328988,7.0869600057762,0.264187715374057
51.4023803328988,7.0941545444599,0.25496149730538
51.4023803328988,7.1013490831436,0.25216106893736
51.4023803328988,7.1085436218273,0.231598329607754
51.4069097449805,6.9502637707859,0.294423503762572
51.4069097449805,6.9574583094696,0.302776333392418
51.4069097449805,6.9646528481533,0.260874265075113
51.4069097449805,6.971847386837,0.259199978263454
51.4069097449805,6.9790419255207,0.283109547871542
51.4069097449805,6.9862364642044,0.355198046075606
51.4069097449805,6.9934310028881,0.31560903455324
51.4069097449805,7.0006255415718,0.259199978263454
51.4069097449805,7.0078200802555,0.444697707569629
51.4069097449805,7.0150146189392,0.355780685319434
51.4069097449805,7.0222091576229,0.629032948106163
51.4069097449805,7.0294036963066,0.34763442880139
51.4069097449805,7.0365982349903,0.300708881442902
51.4069097449805,7.043792773674,0.309177009939835
51.4069097449805,7.0509873123577,0.3577660748183
51.4069097449805,7.0581818510414,0.44119557938919
51.4069097449805,7.0653763897251,0.46812655858795
51.4069097449805,7.0725709284088,0.277533738004476
51.4069097449805,7.0797654670925,0.303557510514038
51.4069097449805,7.0869600057762,0.277459823615995
51.4069097449805,7.0941545444599,0.29522370567662
51.4069097449805,7.1013490831436,0.315452121613035
51.4069097449805,7.1085436218273,0.250345893032309
51.4114391570622,6.9502637707859,0.323462275400385
51.4114391570622,6.9574583094696,0.350402919733909
51.4114391570622,6.9646528481533,0.366181643666029
51.4114391570622,6.971847386837,0.281758067809782
51.4114391570622,6.9790419255207,0.269324619818863
51.4114391570622,6.9862364642044,0.360030886087589
51.4114391570622,6.9934310028881,0.595307808641168
51.4114391570622,7.0006255415718,0.309222785431797
51.4114391570622,7.0078200802555,0.281790018617363
51.4114391570622,7.0150146189392,0.311369480055385
51.4114391570622,7.0222091576229,0.382533970408541
51.4114391570622,7.0294036963066,0.3141784515986
51.4114391570622,7.0365982349903,0.29027968888462
51.4114391570622,7.043792773674,0.259199978263454
51.4114391570622,7.0509873123577,0.350218383439759
51.4114391570622,7.0581818510414,0.313542734556962
51.4114391570622,7.0653763897251,0.260700961689956
51.4114391570622,7.0725709284088,0.259199978263454
51.4114391570622,7.0797654670925,0.291845949319493
51.4114391570622,7.0869600057762,0.264573629531105
51.4114391570622,7.0941545444599,0.25975901269941
51.4114391570622,7.1013490831436,0.25751053072019
51.4114391570622,7.1085436218273,0.289653630361688
51.4114391570622,7.115738160511,0.267115442264656
51.4114391570622,7.1229326991947,0.259199978263454
51.4159685691439,6.9502637707859,0.275483469827033
51.4159685691439,6.9574583094696,0.460466683491513
51.4159685691439,6.9646528481533,0.365310643400034
51.4159685691439,6.971847386837,0.252821355717313
51.4159685691439,6.9790419255207,0.205703054384164
51.4159685691439,6.9862364642044,0.349877418789375
51.4159685691439,6.9934310028881,0.471104817713344
51.4159685691439,7.0006255415718,0.405646053089969
51.4159685691439,7.0078200802555,0.344503199852631
51.4159685691439,7.0150146189392,0.284214454771135
51.4159685691439,7.0222091576229,0.425271919565602
51.4159685691439,7.0294036963066,0.24046594004952
51.4159685691439,7.0365982349903,0.259134777193457
51.4159685691439,7.043792773674,0.259199978263454
51.4159685691439,7.0509873123577,0.259531744634271
51.4159685691439,7.0581818510414,0.259199978263454
51.4159685691439,7.0653763897251,0.259199978263454
51.4159685691439,7.0725709284088,0.282206259644868
51.4159685691439,7.0797654670925,0.368611626007711
51.4159685691439,7.0869600057762,0.269579442367864
51.4159685691439,7.0941545444599,0.286143890086347
51.4159685691439,7.1013490831436,0.381738722335976
51.4159685691439,7.1085436218273,0.586268159311204
51.4159685691439,7.115738160511,0.41498311813512
51.4159685691439,7.1229326991947,0.385738033116201
51.4159685691439,7.1301272378784,0.275117025864768
51.4204979812256,6.9502637707859,0.229899975508634
51.4204979812256,6.9574583094696,0.548993769491565
51.4204979812256,6.9646528481533,0.409231089921363
51.4204979812256,6.971847386837,0.262421450466373
51.4204979812256,6.9790419255207,0.283689009468462
51.4204979812256,6.9862364642044,0.302034136061585
51.4204979812256,6.9934310028881,0.289183823256452
51.4204979812256,7.0006255415718,0.414706594755657
51.4204979812256,7.0078200802555,0.310759141717998
51.4204979812256,7.0150146189392,0.378411816427874
51.4204979812256,7.0222091576229,0.795873606632417
51.4204979812256,7.0294036963066,0.540679759573879
51.4204979812256,7.0365982349903,0.338723113405992
51.4204979812256,7.043792773674,0.290141176991407
51.4204979812256,7.0509873123577,0.34689206239051
51.4204979812256,7.0581818510414,0.234225743537226
51.4204979812256,7.0653763897251,0.256697791409638
51.4204979812256,7.0725709284088,0.369043437084911
51.4204979812256,7.0797654670925,0.478934940257587
51.4204979812256,7.0869600057762,0.307320786175391
51.4204979812256,7.0941545444599,0.251997181342837
51.4204979812256,7.1013490831436,0.321911675423712
51.4204979812256,7.1085436218273,0.373140576897798
51.4204979812256,7.115738160511,0.299635147697143
51.4204979812256,7.1229326991947,0.318195283212021
51.4204979812256,7.1301272378784,0.324734258841785
51.4250273933073,6.9574583094696,0.283440248782595
51.4250273933073,6.9646528481533,0.295007357263619
51.4250273933073,6.971847386837,0.333310636772983
51.4250273933073,6.9790419255207,0.390650981740243
51.4250273933073,6.9862364642044,0.36395104363671
51.4250273933073,6.9934310028881,0.309447343603015
51.4250273933073,7.0006255415718,0.777542707140252
51.4250273933073,7.0078200802555,0.470996143555723
51.4250273933073,7.0150146189392,0.397663433533434
51.4250273933073,7.0222091576229,0.307633463496725
51.4250273933073,7.0294036963066,0.375844233740495
51.4250273933073,7.0365982349903,0.594613622793817
51.4250273933073,7.043792773674,0.56138973942177
51.4250273933073,7.0509873123577,0.320211759349526
51.4250273933073,7.0581818510414,0.267029226712376
51.4250273933073,7.0653763897251,0.27848750654328
51.4250273933073,7.0725709284088,0.444250096731276
51.4250273933073,7.0797654670925,0.436477067895089
51.4250273933073,7.0869600057762,0.332185394231103
51.4250273933073,7.0941545444599,0.247459311335937
51.4250273933073,7.1013490831436,0.257006168615625
51.4250273933073,7.1085436218273,0.265828627596099
51.4250273933073,7.115738160511,0.323649697442364
51.4250273933073,7.1229326991947,0.330267123002934
51.4250273933073,7.1301272378784,0.259199978263454
51.4295568053891,6.9574583094696,0.302841495529433
51.4295568053891,6.9646528481533,0.302558715894732
51.4295568053891,6.971847386837,0.561580659616174
51.4295568053891,6.9790419255207,0.610408691568353
51.4295568053891,6.9862364642044,0.454153203796591
51.4295568053891,6.9934310028881,0.410712053352664
51.4295568053891,7.0006255415718,0.593201676934627
51.4295568053891,7.0078200802555,0.637025217155637
51.4295568053891,7.0150146189392,0.447116773565488
51.4295568053891,7.0222091576229,0.296739598370025
51.4295568053891,7.0294036963066,0.326901825304953
51.4295568053891,7.0365982349903,0.389149005028279
51.4295568053891,7.043792773674,0.348973525507764
51.4295568053891,7.0509873123577,0.407055375637978
51.4295568053891,7.0581818510414,0.382579865964739
51.4295568053891,7.0653763897251,0.259199978263454
51.4295568053891,7.0725709284088,0.527243602275247
51.4295568053891,7.0797654670925,0.521563357100998
51.4295568053891,7.0869600057762,0.243366517439856
51.4295568053891,7.0941545444599,0.328647324316143
51.4295568053891,7.1013490831436,0.315992978648806
51.4295568053891,7.1085436218273,0.342989334152924
51.4295568053891,7.115738160511,0.347558636485669
51.4295568053891,7.1229326991947,0.245681820863705
51.4340862174708,6.9646528481533,0.323097096547624
51.4340862174708,6.971847386837,0.559005612189374
51.4340862174708,6.9790419255207,0.620638797557692
51.4340862174708,6.9862364642044,0.567504350868632
51.4340862174708,6.9934310028881,0.399314011547476
51.4340862174708,7.0006255415718,0.568217526774874
51.4340862174708,7.0078200802555,0.735457484306918
51.4340862174708,7.0150146189392,0.382647658917476
51.4340862174708,7.0222091576229,0.356666634932773
51.4340862174708,7.0294036963066,0.455194303708376
51.4340862174708,7.0365982349903,0.508012715235699
51.4340862174708,7.043792773674,0.375398113777819
51.4340862174708,7.0509873123577,0.369981571769292
51.4340862174708,7.0581818510414,0.330966270389897
51.4340862174708,7.0653763897251,0.259199978263454
51.4340862174708,7.0725709284088,0.285589905467752
51.4340862174708,7.0797654670925,0.379094662932263
51.4340862174708,7.0869600057762,0.339429914889928
51.4340862174708,7.0941545444599,0.306681239459537
51.4340862174708,7.1013490831436,0.350291998946286
51.4340862174708,7.1085436218273,0.386662659491619
51.4340862174708,7.115738160511,0.455373577748975
51.4340862174708,7.1229326991947,0.288080860196106
51.4386156295525,6.9646528481533,0.376666285225192
51.4386156295525,6.971847386837,0.434576533254386
51.4386156295525,6.9790419255207,0.555711380600171
51.4386156295525,6.9862364642044,0.659661603958218
51.4386156295525,6.9934310028881,0.587003239952537
51.4386156295525,7.0006255415718,0.750114656332879
51.4386156295525,7.0078200802555,0.928462162297525
51.4386156295525,7.0150146189392,0.7500732318911
51.4386156295525,7.0222091576229,0.615862293984566
51.4386156295525,7.0294036963066,0.629386725540362
51.4386156295525,7.0365982349903,0.450644472952663
51.4386156295525,7.043792773674,0.441453604944867
51.4386156295525,7.0509873123577,0.488408711211616
51.4386156295525,7.0581818510414,0.247072081808301
51.4386156295525,7.0653763897251,0.273810812145059
51.4386156295525,7.0725709284088,0.289678889608296
51.4386156295525,7.0797654670925,0.402275344084495
51.4386156295525,7.0869600057762,0.303710007590735
51.4386156295525,7.0941545444599,0.392890309929461
51.4386156295525,7.1013490831436,0.477812355472684
51.4386156295525,7.1085436218273,0.469018472346925
51.4386156295525,7.115738160511,0.321572513661027
51.4386156295525,7.1229326991947,0.246038478178313
51.4386156295525,7.1301272378784,0.259199978263454
51.4431450416342,6.9574583094696,0.387325137512959
51.4431450416342,6.9646528481533,0.402214145455533
51.4431450416342,6.971847386837,0.579577288608882
51.4431450416342,6.9790419255207,0.673228668407104
51.4431450416342,6.9862364642044,0.650066961992012
51.4431450416342,6.9934310028881,0.608269307768878
51.4431450416342,7.0006255415718,0.778462131559607
51.4431450416342,7.0078200802555,0.711311897041675
51.4431450416342,7.0150146189392,0.785285620632824
51.4431450416342,7.0222091576229,0.688428943810742
51.4431450416342,7.0294036963066,0.501224825865281
51.4431450416342,7.0365982349903,0.483934290536008
51.4431450416342,7.043792773674,0.454440815861798
51.4431450416342,7.0509873123577,0.410225327684283
51.4431450416342,7.0581818510414,0.400740928702462
51.4431450416342,7.0653763897251,0.392129603578962
51.4431450416342,7.0725709284088,0.423288679354835
51.4431450416342,7.0797654670925,0.455531469454992
51.4431450416342,7.0869600057762,0.305844672495894
51.4431450416342,7.0941545444599,0.316908569827062
51.4431450416342,7.1013490831436,0.457213522172331
51.4431450416342,7.1085436218273,0.35874308915128
51.4431450416342,7.115738160511,0.217135281934233
51.4431450416342,7.1229326991947,0.238341318429515
51.4431450416342,7.1301272378784,0.265175706841283
51.4476744537159,6.9574583094696,0.736289021081114
51.4476744537159,6.9646528481533,0.717440219846829
51.4476744537159,6.971847386837,0.768952457782772
51.4476744537159,6.9790419255207,0.883805965425968
51.4476744537159,6.9862364642044,0.540453479899909
51.4476744537159,6.9934310028881,0.408091087871523
51.4476744537159,7.0006255415718,0.529335346840648
51.4476744537159,7.0078200802555,0.692254456015473
51.4476744537159,7.0150146189392,0.722301986885599
51.4476744537159,7.0222091576229,0.505843936701352
51.4476744537159,7.0294036963066,0.535343187810211
51.4476744537159,7.0365982349903,0.645513528297519
51.4476744537159,7.043792773674,0.638089146573761
51.4476744537159,7.0509873123577,0.388617178261815
51.4476744537159,7.0581818510414,0.401827092563296
51.4476744537159,7.0653763897251,0.360161928347175
51.4476744537159,7.0725709284088,0.721275188200997
51.4476744537159,7.0797654670925,0.683393041393968
51.4476744537159,7.0869600057762,0.363749791878935
51.4476744537159,7.0941545444599,0.355512963056492
51.4476744537159,7.1013490831436,0.333759044624559
51.4476744537159,7.1085436218273,0.425325405187225
51.4476744537159,7.115738160511,0.282714319147713
51.4476744537159,7.1229326991947,0.253251766777907
51.4522038657976,6.9214856160511,0.357336459933702
51.4522038657976,6.9286801547348,0.270490578748205
51.4522038657976,6.9358746934185,0.328365421105775
51.4522038657976,6.9430692321022,0.335527520253095
51.4522038657976,6.9502637707859,0.270717482529901
51.4522038657976,6.9574583094696,0.389927814500884
51.4522038657976,6.9646528481533,0.377926417689736
51.4522038657976,6.971847386837,0.569191128696363
51.4522038657976,6.9790419255207,0.644387318378385
51.4522038657976,6.9862364642044,0.699945833559765
51.4522038657976,6.9934310028881,0.365073245258973
51.4522038657976,7.0006255415718,0.432137614170524
51.4522038657976,7.0078200802555,0.57090296304478
51.4522038657976,7.0150146189392,0.753656107197571
51.4522038657976,7.0222091576229,0.418170146237817
51.4522038657976,7.0294036963066,0.669976610391109
51.4522038657976,7.0365982349903,0.46347573908669
51.4522038657976,7.043792773674,0.341972409850539
51.4522038657976,7.0509873123577,0.261542954092819
51.4522038657976,7.0581818510414,0.364121374205463
51.4522038657976,7.0653763897251,0.357403172760575
51.4522038657976,7.0725709284088,0.457957484594525
51.4522038657976,7.0797654670925,0.600163226028119
51.4522038657976,7.0869600057762,0.427657398971959
51.4522038657976,7.0941545444599,0.30115398180381
51.4522038657976,7.1013490831436,0.346071913115596
51.4522038657976,7.1085436218273,0.505371515106374
51.4522038657976,7.115738160511,0.310508693605496
51.4522038657976,7.1229326991947,0.259199978263454
51.4567332778793,6.9214856160511,0.277312428333996
51.4567332778793,6.9286801547348,0.263587588842118
51.4567332778793,6.9358746934185,0.415040154438628
51.4567332778793,6.9430692321022,0.361318466512031
51.4567332778793,6.9502637707859,0.376278416274656
51.4567332778793,6.9574583094696,0.45339943866163
51.4567332778793,6.9646528481533,0.369171928575119
51.4567332778793,6.971847386837,0.530011225677292
51.4567332778793,6.9790419255207,0.685468341202191
51.4567332778793,6.9862364642044,0.518629185895097
51.4567332778793,6.9934310028881,0.369696533013733
51.4567332778793,7.0006255415718,0.544330565190371
51.4567332778793,7.0078200802555,0.817894816528398
51.4567332778793,7.0150146189392,0.818874432064776
51.4567332778793,7.0222091576229,0.651906722970743
51.4567332778793,7.0294036963066,0.461260971228781
51.4567332778793,7.0365982349903,0.400742214074007
51.4567332778793,7.043792773674,0.415073577847923
51.4567332778793,7.0509873123577,0.373782371320232
51.4567332778793,7.0581818510414,0.325686602072472
51.4567332778793,7.0653763897251,0.489430557039735
51.4567332778793,7.0725709284088,0.412375994565649
51.4567332778793,7.0797654670925,0.559430647036492
51.4567332778793,7.0869600057762,0.355210669403833
51.4567332778793,7.0941545444599,0.321968259713963
51.4567332778793,7.1013490831436,0.30491127709959
51.4567332778793,7.1085436218273,0.457544841189794
51.4567332778793,7.115738160511,0.278530925296633
51.461262689961,6.9214856160511,0.313601257903166
51.461262689961,6.9286801547348,0.329676200557878
51.461262689961,6.9358746934185,0.396907948422967
51.461262689961,6.9430692321022,0.455397983829102
51.461262689961,6.9502637707859,0.477852726835148
51.461262689961,6.9574583094696,0.501825871009858
51.461262689961,6.9646528481533,0.401697287126861
51.461262689961,6.971847386837,0.490094749290187
51.461262689961,6.9790419255207,0.599081711906575
51.461262689961,6.9862364642044,0.395898787930084
51.461262689961,6.9934310028881,0.384745625855907
51.461262689961,7.0006255415718,0.528572232903859
51.461262689961,7.0078200802555,0.696606430397709
51.461262689961,7.0150146189392,0.797667352570544
51.461262689961,7.0222091576229,0.564055700277972
51.461262689961,7.0294036963066,0.260551977466136
51.461262689961,7.0365982349903,0.327324454834409
51.461262689961,7.043792773674,0.445414208201715
51.461262689961,7.0509873123577,0.337197746861579
51.461262689961,7.0581818510414,0.268952916431115
51.461262689961,7.0653763897251,0.37258115452626
51.461262689961,7.0725709284088,0.370887096238201
51.461262689961,7.0797654670925,0.538799848842136
51.461262689961,7.0869600057762,0.293758274488249
51.461262689961,7.0941545444599,0.269818284761917
51.461262689961,7.1013490831436,0.253907756667115
51.4657921020427,6.9142910773674,0.267762002748556
51.4657921020427,6.9214856160511,0.320247583325733
51.4657921020427,6.9286801547348,0.301378245982745
51.4657921020427,6.9358746934185,0.387359743618098
51.4657921020427,6.9430692321022,0.455794838873475
51.4657921020427,6.9502637707859,0.456937532637859
51.4657921020427,6.9574583094696,0.629388031160171
51.4657921020427,6.9646528481533,0.3148506599005
51.4657921020427,6.971847386837,0.402459211468722
51.4657921020427,6.9790419255207,0.516600730919628
51.4657921020427,6.9862364642044,0.316854313488235
51.4657921020427,6.9934310028881,0.285869932861208
51.4657921020427,7.0006255415718,0.557098486692652
51.4657921020427,7.0078200802555,0.618319206098038
51.4657921020427,7.0150146189392,0.568812516845434
51.4657921020427,7.0222091576229,0.337679568493246
51.4657921020427,7.0294036963066,0.255133570928007
51.4657921020427,7.0365982349903,0.287095702681312
51.4657921020427,7.043792773674,0.480683515748801
51.4657921020427,7.0509873123577,0.346203225616178
51.4657921020427,7.0581818510414,0.321048824352029
51.4657921020427,7.0653763897251,0.259859269207145
51.4657921020427,7.0725709284088,0.361812577721432
51.4657921020427,7.0797654670925,0.691479934259602
51.4657921020427,7.0869600057762,0.437505749304373
51.4657921020427,7.0941545444599,0.497661114753946
51.4657921020427,7.1013490831436,0.333613011306961
51.4657921020427,7.1085436218273,0.259199978263454
51.4703215141244,6.9070965386837,0.271349500459124
51.4703215141244,6.9142910773674,0.264581407685446
51.4703215141244,6.9214856160511,0.332276628463958
51.4703215141244,6.9286801547348,0.309344311082563
51.4703215141244,6.9358746934185,0.585039412444428
51.4703215141244,6.9430692321022,0.445277614973596
51.4703215141244,6.9502637707859,0.706394706844208
51.4703215141244,6.9574583094696,0.465581319574785
51.4703215141244,6.9646528481533,0.348167827099222
51.4703215141244,6.971847386837,0.328238842118229
51.4703215141244,6.9790419255207,0.339997472794793
51.4703215141244,6.9862364642044,0.26849826195546
51.4703215141244,6.9934310028881,0.31524312008597
51.4703215141244,7.0006255415718,0.358610206009869
51.4703215141244,7.0078200802555,0.376709230264159
51.4703215141244,7.0150146189392,0.526507609211075
51.4703215141244,7.0222091576229,0.340857231587098
51.4703215141244,7.0294036963066,0.262283858722029
51.4703215141244,7.0365982349903,0.28176010269606
51.4703215141244,7.043792773674,0.370932678725159
51.4703215141244,7.0509873123577,0.279629835081383
51.4703215141244,7.0581818510414,0.281056666664441
51.4703215141244,7.0653763897251,0.323493328294259
51.4703215141244,7.0725709284088,0.25012996435673
51.4703215141244,7.0797654670925,0.490218386122774
51.4703215141244,7.0869600057762,0.49948658689557
51.4703215141244,7.0941545444599,0.398907747844778
51.4703215141244,7.1013490831436,0.294966738263708
51.4703215141244,7.1085436218273,0.259199978263454
51.4748509262061,6.899902,0.316001273955512
51.4748509262061,6.9070965386837,0.245614191257975
51.4748509262061,6.9142910773674,0.44238752990648
51.4748509262061,6.9214856160511,0.433973315081091
51.4748509262061,6.9286801547348,0.333583364081897
51.4748509262061,6.9358746934185,0.491637874837016
51.4748509262061,6.9430692321022,0.568586422093457
51.4748509262061,6.9502637707859,0.816624423984355
51.4748509262061,6.9574583094696,0.645037404290584
51.4748509262061,6.9646528481533,0.55300981714207
51.4748509262061,6.971847386837,0.519438411020488
51.4748509262061,6.9790419255207,0.496458436688857
51.4748509262061,6.9862364642044,0.404446635038803
51.4748509262061,6.9934310028881,0.446782338147615
51.4748509262061,7.0006255415718,0.500458594829573
51.4748509262061,7.0078200802555,0.498977902328576
51.4748509262061,7.0150146189392,0.598640889546083
51.4748509262061,7.0222091576229,0.406742843549279
51.4748509262061,7.0294036963066,0.324988053034013
51.4748509262061,7.0365982349903,0.537603331902719
51.4748509262061,7.043792773674,0.431066866936239
51.4748509262061,7.0509873123577,0.320222361933434
51.4748509262061,7.0581818510414,0.335719821401811
51.4748509262061,7.0653763897251,0.428309249217023
51.4748509262061,7.0725709284088,0.373936437455653
51.4748509262061,7.0797654670925,0.397070430980355
51.4748509262061,7.0869600057762,0.392895118937075
51.4748509262061,7.0941545444599,0.406644103585524
51.4748509262061,7.1013490831436,0.259752065851892
51.4748509262061,7.1085436218273,0.276240004644758
51.4793803382879,6.899902,0.360899907574038
51.4793803382879,6.9070965386837,0.313581781345007
51.4793803382879,6.9142910773674,0.287265939932426
51.4793803382879,6.9214856160511,0.338886429166346
51.4793803382879,6.9286801547348,0.498656336030138
51.4793803382879,6.9358746934185,0.364942990133726
51.4793803382879,6.9430692321022,0.391488913787771
51.4793803382879,6.9502637707859,0.485950505825614
51.4793803382879,6.9574583094696,0.457138157693225
51.4793803382879,6.9646528481533,0.494141613599683
51.4793803382879,6.971847386837,0.385203807815227
51.4793803382879,6.9790419255207,0.533918484639144
51.4793803382879,6.9862364642044,0.317591576141043
51.4793803382879,6.9934310028881,0.382594707331321
51.4793803382879,7.0006255415718,0.420014989124858
51.4793803382879,7.0078200802555,0.343841672847182
51.4793803382879,7.0150146189392,0.327165957608221
51.4793803382879,7.0222091576229,0.456634064942556
51.4793803382879,7.0294036963066,0.414046475630266
51.4793803382879,7.0365982349903,0.312950325602456
51.4793803382879,7.043792773674,0.189812315299348
51.4793803382879,7.0509873123577,0.298716447747807
51.4793803382879,7.0581818510414,0.358894830386252
51.4793803382879,7.0653763897251,0.351276740222149
51.4793803382879,7.0725709284088,0.264918368241
51.4793803382879,7.0797654670925,0.254456564457802
51.4793803382879,7.0869600057762,0.303314880696369
51.4793803382879,7.0941545444599,0.335284045190751
51.4793803382879,7.1013490831436,0.335634116057776
51.4839097503696,6.899902,0.22601618386179
51.4839097503696,6.9070965386837,0.357454851951685
51.4839097503696,6.9142910773674,0.366055891195264
51.4839097503696,6.9214856160511,0.298461812992609
51.4839097503696,6.9286801547348,0.3403103551218
51.4839097503696,6.9358746934185,0.36587982569513
51.4839097503696,6.9430692321022,0.391388123315783
51.4839097503696,6.9502637707859,0.530534060884018
51.4839097503696,6.9574583094696,0.290469933233766
51.4839097503696,6.9646528481533,0.310402148544847
51.4839097503696,6.971847386837,0.265124816194766
51.4839097503696,6.9790419255207,0.506177001321454
51.4839097503696,6.9862364642044,0.312843499778052
51.4839097503696,6.9934310028881,0.289643356337108
51.4839097503696,7.0006255415718,0.301778466127375
51.4839097503696,7.0078200802555,0.38717126783667
51.4839097503696,7.0150146189392,0.316413194211794
51.4839097503696,7.0222091576229,0.394672905774788
51.4839097503696,7.0294036963066,0.318597077632251
51.4839097503696,7.0365982349903,0.394058442197271
51.4839097503696,7.043792773674,0.501808622038704
51.4839097503696,7.0509873123577,0.28927210034179
51.4839097503696,7.0581818510414,0.498925026206971
51.4839097503696,7.0653763897251,0.432869772420834
51.4839097503696,7.0725709284088,0.259199978263454
51.4884391624513,6.9142910773674,0.26236783786612
51.4884391624513,6.9214856160511,0.242183478535621
51.4884391624513,6.9286801547348,0.29959121403066
51.4884391624513,6.9358746934185,0.438048787095764
51.4884391624513,6.9430692321022,0.347710127795239
51.4884391624513,6.9502637707859,0.419977080619763
51.4884391624513,6.9574583094696,0.286107604820416
51.4884391624513,6.9646528481533,0.239581906201979
51.4884391624513,6.971847386837,0.318140303433314
51.4884391624513,6.9790419255207,0.339519089526301
51.4884391624513,6.9862364642044,0.334561186519222
51.4884391624513,6.9934310028881,0.291039928176723
51.4884391624513,7.0006255415718,0.365841947070711
51.4884391624513,7.0078200802555,0.505849523395378
51.4884391624513,7.0150146189392,0.412849219803323
51.4884391624513,7.0222091576229,0.43196120739666
51.4884391624513,7.0294036963066,0.316309122389183
51.4884391624513,7.0365982349903,0.293330821271665
51.4884391624513,7.043792773674,0.490283809020269
51.4884391624513,7.0509873123577,0.398099370494097
51.4884391624513,7.0581818510414,0.394094684813311
51.4884391624513,7.0653763897251,0.452564517659972
51.492968574533,6.9286801547348,0.37667878828781
51.492968574533,6.9358746934185,0.396946975424618
51.492968574533,6.9430692321022,0.526638264618366
51.492968574533,6.9502637707859,0.323513742282247
51.492968574533,6.9574583094696,0.26981813879807
51.492968574533,6.9646528481533,0.259199978263454
51.492968574533,6.971847386837,0.294633518577903
51.492968574533,6.9790419255207,0.360388309565956
51.492968574533,6.9862364642044,0.404655219117214
51.492968574533,6.9934310028881,0.340955868988239
51.492968574533,7.0006255415718,0.345254126283146
51.492968574533,7.0078200802555,0.509747412893688
51.492968574533,7.0150146189392,0.571457418552034
51.492968574533,7.0222091576229,0.450854835596808
51.492968574533,7.0294036963066,0.290793956256005
51.492968574533,7.0365982349903,0.278239763149007
51.492968574533,7.043792773674,0.380968869048049
51.492968574533,7.0509873123577,0.359879232150391
51.492968574533,7.0581818510414,0.394106391051134
51.492968574533,7.0653763897251,0.349681827784588
51.492968574533,7.0725709284088,0.30274643435865
51.4974979866147,6.9358746934185,0.424954641091319
51.4974979866147,6.9430692321022,0.287657200084907
51.4974979866147,6.9502637707859,0.274799882829153
51.4974979866147,6.9574583094696,0.293711452001338
51.4974979866147,6.9646528481533,0.259199978263454
51.4974979866147,6.971847386837,0.259199978263454
51.4974979866147,6.9790419255207,0.30469862190969
51.4974979866147,6.9862364642044,0.325581172308114
51.4974979866147,6.9934310028881,0.298665908237876
51.4974979866147,7.0006255415718,0.285963090803611
51.4974979866147,7.0078200802555,0.641676822562401
51.4974979866147,7.0150146189392,0.418144220349204
51.4974979866147,7.0222091576229,0.329935650413438
51.4974979866147,7.0294036963066,0.24944196303281
51.4974979866147,7.0365982349903,0.346895612344695
51.4974979866147,7.043792773674,0.544321368185472
51.4974979866147,7.0509873123577,0.471731914104367
51.4974979866147,7.0581818510414,0.444928158769677
51.4974979866147,7.0653763897251,0.317684143084462
51.5020273986964,6.9574583094696,0.259199978263454
51.5020273986964,6.9646528481533,0.259199978263454
51.5020273986964,6.971847386837,0.241160372355798
51.5020273986964,6.9790419255207,0.226137319158038
51.5020273986964,6.9862364642044,0.259199978263454
51.5020273986964,6.9934310028881,0.265556759929118
51.5020273986964,7.0006255415718,0.277300330296366
51.5020273986964,7.0078200802555,0.428405091916852
51.5020273986964,7.0150146189392,0.32545378169012
51.5020273986964,7.0222091576229,0.31489983046183
51.5020273986964,7.0294036963066,0.324405225245843
51.5020273986964,7.0365982349903,0.344421169004402
51.5020273986964,7.043792773674,0.423978434992224
51.5020273986964,7.0509873123577,0.299085729436478
51.5065568107781,6.9862364642044,0.259199978263454
51.5065568107781,6.9934310028881,0.287583064675448
51.5065568107781,7.0006255415718,0.334189689872771
51.5065568107781,7.0078200802555,0.301825566376791
51.5065568107781,7.0150146189392,0.285351108838403
51.5065568107781,7.0222091576229,0.418910309316497
51.5065568107781,7.0294036963066,0.371401219904797
51.5065568107781,7.0365982349903,0.312032377593464
51.5065568107781,7.043792773674,0.344563327319473
51.5065568107781,7.0509873123577,0.293481146778436
51.5110862228598,6.9862364642044,0.259199978263454
51.5110862228598,6.9934310028881,0.294634318456326
51.5110862228598,7.0006255415718,0.317926146026944
51.5110862228598,7.0078200802555,0.29425255056841
51.5110862228598,7.0150146189392,0.267204558023468
51.5110862228598,7.0222091576229,0.376476932185961
51.5110862228598,7.0294036963066,0.401757945229017
51.5110862228598,7.0365982349903,0.332950225561251
51.5110862228598,7.043792773674,0.312671728637154
51.5156156349415,6.9934310028881,0.270639142367313
51.5156156349415,7.0006255415718,0.333811886572451
51.5156156349415,7.0078200802555,0.307630630280412
51.5156156349415,7.0150146189392,0.299994130528914
51.5156156349415,7.0222091576229,0.259199978263454
51.5156156349415,7.0294036963066,0.270402592897745
51.5201450470232,6.9934310028881,0.281189611651919
51.5201450470232,7.0006255415718,0.312684137676396
51.5201450470232,7.0078200802555,0.387611657297173
51.5201450470232,7.0150146189392,0.354271387689906
51.5246744591049,7.0006255415718,0.301680191120923
51.5246744591049,7.0078200802555,0.459132189973901
51.5246744591049,7.0150146189392,0.265741485447839
