nan,nan,4.660569656666762456e-02
1.104536638451023300e+01,4.934019954705119204e+01,5.883197529948375887e-02
1.102942650236522759e+01,4.936466785188724060e+01,7.047783715316570385e-02
1.099752196995440023e+01,4.932573278567334540e+01,8.127474801166491292e-02
1.107496742630124764e+01,4.932428558383998762e+01,9.216066169665144969e-02
1.100945877444625687e+01,4.936434951402483762e+01,1.028982414014739388e-01
1.102903231056915700e+01,4.929762751141753796e+01,1.136446922825472272e-01
1.099450336293834773e+01,4.934682185749220906e+01,1.243824410438733180e-01
1.101118590426408694e+01,4.930678335231064580e+01,1.350850441714799843e-01
1.102809148426533703e+01,4.934893149044159344e+01,1.438014792110081375e-01
1.103923405377842393e+01,4.930616942617978538e+01,1.512858551540227081e-01
