nan,nan,1.396742752944191146e-01
1.143163169615707986e+01,4.789229147123015196e+01,1.515070329965566287e-01
1.156395372717931380e+01,4.775784770760716924e+01,1.640860593883158858e-01
1.136704046467080786e+01,4.764787971967821534e+01,1.752355115584551815e-01
1.141130332583128215e+01,4.783000909445165405e+01,1.871945723819729568e-01
1.131827548776143466e+01,4.765941558650463605e+01,1.990043026839567464e-01
1.155156559269642358e+01,4.775908753500457493e+01,2.102371902076517474e-01
1.140930699773944035e+01,4.785758254388383648e+01,2.225787615250235107e-01
1.128697273564038284e+01,4.766230611645580240e+01,2.338506843383225953e-01
1.151712949899759764e+01,4.765923814547822701e+01,2.450824691206301698e-01
1.142982883644251224e+01,4.772329711896680493e+01,2.568947924835865426e-01
