nan,nan,5.999870244461837088e-02
1.106522767183279576e+01,5.006862892101291607e+01,7.229411109927000312e-02
1.120784981198027275e+01,5.009858292258515178e+01,8.395009324580177124e-02
1.124895947485134684e+01,5.014174793239612171e+01,9.769153595422523650e-02
1.123385486157771318e+01,5.008215722268333536e+01,1.103293101102154894e-01
1.114857864660628195e+01,5.016421645834682153e+01,1.219555955252398100e-01
1.121387511765956013e+01,5.017408922356034395e+01,1.352044354448787566e-01
1.100058419564579992e+01,5.013260912161580762e+01,1.470803762669939674e-01
1.089720123369132310e+01,5.010254080445960057e+01,1.588628257291600232e-01
1.102523264626849375e+01,5.006672577748302899e+01,1.703613588384484123e-01
1.126863905420443501e+01,5.003064306776449399e+01,1.817447389459373452e-01
