nan,nan,1.687102331985162462e-01
1.074277920335700998e+01,5.094304906607082017e+01,1.819048593624875698e-01
1.082759842300949416e+01,5.105544326898162666e+01,1.958357181559261251e-01
1.069983636519620518e+01,5.094697995447682359e+01,2.103742460044127072e-01
1.052821820451217150e+01,5.094145033438751824e+01,2.217677381816581250e-01
1.069024838670325650e+01,5.097642986279781496e+01,2.337118938017766212e-01
1.073191112700920868e+01,5.108931659572165529e+01,2.459748510030180524e-01
1.059365694669149072e+01,5.083845499847908656e+01,2.577387400703846088e-01
1.051711512286151873e+01,5.098956141693517452e+01,2.699596186316210455e-01
1.088843827343445803e+01,5.090257283029792035e+01,2.821354841104398714e-01
1.084581006719110441e+01,5.101788061034811506e+01,2.934908477737491195e-01
