nan,nan,6.565085007271528883e-02
8.253430441163725817e+00,5.000815460167128634e+01,8.266208852556666820e-02
8.263386956090428725e+00,4.999899680981802419e+01,9.712900709412797262e-02
8.223270681281899641e+00,5.002227720933802857e+01,1.108863939308492030e-01
8.243916532540517039e+00,4.999584719294730206e+01,1.242702630121176599e-01
8.177630822068300276e+00,4.998813670282485333e+01,1.374979184316948710e-01
8.247732126616817538e+00,4.998155777351126972e+01,1.494975904392964183e-01
8.229215042646867317e+00,5.002172233878007290e+01,1.573429365389125145e-01
8.310863302851085876e+00,4.996082984377768810e+01,1.727866319927476857e-01
8.240551359026515144e+00,5.001475462670473604e+01,1.817546939152880348e-01
8.296945205993839778e+00,4.998064416977271662e+01,1.953402149578409575e-01
