nan,nan,1.202037520523622643e-01
8.144880747641524366e+00,4.921931194957996780e+01,1.312100587240063732e-01
7.921946729556762712e+00,4.929727784660015288e+01,1.427090196417661605e-01
7.934287401318629307e+00,4.927408573055313212e+01,1.534536404075824145e-01
8.164389264160796245e+00,4.916946693755474485e+01,1.642047612825631442e-01
8.056462051635794097e+00,4.919296010578599265e+01,1.749537879629169124e-01
7.956436552299244624e+00,4.928871352553817786e+01,1.857248376074401297e-01
7.989930268470446961e+00,4.917851124942448848e+01,1.962771055181143642e-01
8.024790162298684137e+00,4.919451718041118227e+01,2.063276923975829458e-01
7.960172622921945162e+00,4.926440215013554536e+01,2.170935347899070889e-01
8.061731822404048842e+00,4.921499047273466942e+01,2.278276176219849181e-01
