50.8993787,10.9375260486717,0.259199978263454
50.8993787,10.9447205672557,0.259199978263454
50.8993787,10.9519150858397,0.259199978263454
50.8993787,10.9591096044236,0.300439472499396
50.8993787,10.9663041230076,0.285562817146627
50.8993787,10.9734986415916,0.259199978263454
50.9039576151332,10.9375260486717,0.259199978263454
50.9039576151332,10.9447205672557,0.259199978263454
50.9039576151332,10.9519150858397,0.259199978263454
50.9039576151332,10.9591096044236,0.26800247246352
50.9039576151332,10.9663041230076,0.249652216006675
50.9039576151332,10.9734986415916,0.259199978263454
50.9039576151332,11.0094712345114,0.259199978263454
50.9085365302665,10.9375260486717,0.259199978263454
50.9085365302665,10.9447205672557,0.259199978263454
50.9085365302665,10.9519150858397,0.261337040863461
50.9085365302665,10.9591096044236,0.285274563643685
50.9085365302665,10.9663041230076,0.259199978263454
50.9085365302665,10.9734986415916,0.259199978263454
50.9085365302665,10.9806931601755,0.259199978263454
50.9085365302665,10.9878876787595,0.259199978263454
50.9085365302665,10.9950821973435,0.259199978263454
50.9085365302665,11.0022767159274,0.259199978263454
50.9085365302665,11.0094712345114,0.259199978263454
50.9085365302665,11.0166657530954,0.296196297810619
50.9085365302665,11.0238602716793,0.262977031620081
50.9085365302665,11.0310547902633,0.259199978263454
50.9085365302665,11.0382493088473,0.259199978263454
50.9085365302665,11.0454438274312,0.259199978263454
50.9085365302665,11.0526383460152,0.259199978263454
50.9085365302665,11.0598328645992,0.259199978263454
50.9131154453997,10.9519150858397,0.259199978263454
50.9131154453997,10.9591096044236,0.259199978263454
50.9131154453997,10.9663041230076,0.259199978263454
50.9131154453997,10.9734986415916,0.259199978263454
50.9131154453997,10.9806931601755,0.259199978263454
50.9131154453997,10.9878876787595,0.259199978263454
50.9131154453997,10.9950821973435,0.259199978263454
50.9131154453997,11.0022767159274,0.259199978263454
50.9131154453997,11.0094712345114,0.259199978263454
50.9131154453997,11.0166657530954,0.261729486200603
50.9131154453997,11.0238602716793,0.240987065227315
50.9131154453997,11.0310547902633,0.229532697265398
50.9131154453997,11.0382493088473,0.259199978263454
50.9131154453997,11.0454438274312,0.260589665246208
50.9131154453997,11.0526383460152,0.274215250753483
50.9131154453997,11.0598328645992,0.259199978263454
50.9131154453997,11.0670273831831,0.259199978263454
50.9131154453997,11.0742219017671,0.259199978263454
50.9131154453997,11.0814164203511,0.259199978263454
50.9131154453997,11.088610938935,0.259199978263454
50.9131154453997,11.095805457519,0.259199978263454
50.9131154453997,11.102999976103,0.259199978263454
50.9131154453997,11.1101944946869,0.259199978263454
50.917694360533,10.9591096044236,0.259199978263454
50.917694360533,10.9663041230076,0.259199978263454
50.917694360533,10.9734986415916,0.259199978263454
50.917694360533,10.9806931601755,0.329042713631476
50.917694360533,10.9878876787595,0.302247082867274
50.917694360533,10.9950821973435,0.254829041591608
50.917694360533,11.0022767159274,0.259199978263454
50.917694360533,11.0094712345114,0.259199978263454
50.917694360533,11.0166657530954,0.259265485808934
50.917694360533,11.0238602716793,0.320397921763663
50.917694360533,11.0310547902633,0.309766390540038
50.917694360533,11.0382493088473,0.259199978263454
50.917694360533,11.0454438274312,0.299772987373603
50.917694360533,11.0526383460152,0.333966400066528
50.917694360533,11.0598328645992,0.261192088953343
50.917694360533,11.0670273831831,0.259199978263454
50.917694360533,11.0742219017671,0.259199978263454
50.917694360533,11.0814164203511,0.259199978263454
50.917694360533,11.088610938935,0.307086605172344
50.917694360533,11.095805457519,0.260663894278951
50.917694360533,11.102999976103,0.259199978263454
50.9222732756662,10.9663041230076,0.259199978263454
50.9222732756662,10.9734986415916,0.259199978263454
50.9222732756662,10.9806931601755,0.277231997653508
50.9222732756662,10.9878876787595,0.32139537310218
50.9222732756662,10.9950821973435,0.235907442152458
50.9222732756662,11.0022767159274,0.259199978263454
50.9222732756662,11.0094712345114,0.259199978263454
50.9222732756662,11.0166657530954,0.259199978263454
50.9222732756662,11.0238602716793,0.259199978263454
50.9222732756662,11.0310547902633,0.259199978263454
50.9222732756662,11.0382493088473,0.259199978263454
50.9222732756662,11.0454438274312,0.259199978263454
50.9222732756662,11.0526383460152,0.25987123403162
50.9222732756662,11.0598328645992,0.259199978263454
50.9222732756662,11.0670273831831,0.259199978263454
50.9222732756662,11.0742219017671,0.259199978263454
50.9222732756662,11.0814164203511,0.259199978263454
50.9222732756662,11.088610938935,0.259199978263454
50.9222732756662,11.095805457519,0.259199978263454
50.9222732756662,11.102999976103,0.259199978263454
50.9268521907995,10.9663041230076,0.259199978263454
50.9268521907995,10.9734986415916,0.260041554616255
50.9268521907995,10.9806931601755,0.286158419097512
50.9268521907995,10.9878876787595,0.292916991480419
50.9268521907995,10.9950821973435,0.261201593760973
50.9268521907995,11.0022767159274,0.259199978263454
50.9268521907995,11.0094712345114,0.259818540687786
50.9268521907995,11.0166657530954,0.259199978263454
50.9268521907995,11.0238602716793,0.259199978263454
50.9268521907995,11.0310547902633,0.259199978263454
50.9268521907995,11.0382493088473,0.259199978263454
50.9268521907995,11.0454438274312,0.259199978263454
50.9268521907995,11.0526383460152,0.259199978263454
50.9268521907995,11.0598328645992,0.259199978263454
50.9268521907995,11.0670273831831,0.259199978263454
50.9268521907995,11.0742219017671,0.259199978263454
50.9268521907995,11.0814164203511,0.259199978263454
50.9268521907995,11.088610938935,0.259199978263454
50.9268521907995,11.095805457519,0.259199978263454
50.9268521907995,11.102999976103,0.259199978263454
50.9268521907995,11.1173890132709,0.259199978263454
50.9268521907995,11.1461670876068,0.259199978263454
50.9314311059327,10.9663041230076,0.259199978263454
50.9314311059327,10.9734986415916,0.290132139272313
50.9314311059327,10.9806931601755,0.395606333163547
50.9314311059327,10.9878876787595,0.277544557116955
50.9314311059327,10.9950821973435,0.263979280336335
50.9314311059327,11.0022767159274,0.259199978263454
50.9314311059327,11.0094712345114,0.293674849105449
50.9314311059327,11.0166657530954,0.288597679037299
50.9314311059327,11.0238602716793,0.259199978263454
50.9314311059327,11.0310547902633,0.259199978263454
50.9314311059327,11.0382493088473,0.259199978263454
50.9314311059327,11.0454438274312,0.259199978263454
50.9314311059327,11.0526383460152,0.259199978263454
50.9314311059327,11.0598328645992,0.259199978263454
50.9314311059327,11.0670273831831,0.259199978263454
50.9314311059327,11.0742219017671,0.259199978263454
50.9314311059327,11.0814164203511,0.259199978263454
50.9314311059327,11.088610938935,0.259199978263454
50.9314311059327,11.095805457519,0.259199978263454
50.9314311059327,11.102999976103,0.259199978263454
50.9314311059327,11.1101944946869,0.259199978263454
50.9314311059327,11.1173890132709,0.259199978263454
50.9314311059327,11.1245835318549,0.259199978263454
50.9314311059327,11.1317780504388,0.259199978263454
50.9314311059327,11.1389725690228,0.259199978263454
50.9314311059327,11.1461670876068,0.259199978263454
50.936010021066,10.9591096044236,0.259199978263454
50.936010021066,10.9663041230076,0.259199978263454
50.936010021066,10.9734986415916,0.259199978263454
50.936010021066,10.9806931601755,0.336144873010554
50.936010021066,10.9878876787595,0.326950668264475
50.936010021066,10.9950821973435,0.26713480606208
50.936010021066,11.0022767159274,0.259199978263454
50.936010021066,11.0094712345114,0.290989859777667
50.936010021066,11.0166657530954,0.277548563400708
50.936010021066,11.0238602716793,0.259199978263454
50.936010021066,11.0310547902633,0.259199978263454
50.936010021066,11.0382493088473,0.279415938522216
50.936010021066,11.0454438274312,0.281042653556946
50.936010021066,11.0526383460152,0.259199978263454
50.936010021066,11.0598328645992,0.259199978263454
50.936010021066,11.0670273831831,0.259199978263454
50.936010021066,11.0742219017671,0.259199978263454
50.936010021066,11.0814164203511,0.259199978263454
50.936010021066,11.088610938935,0.259199978263454
50.936010021066,11.095805457519,0.259199978263454
50.936010021066,11.102999976103,0.259199978263454
50.936010021066,11.1101944946869,0.259199978263454
50.936010021066,11.1173890132709,0.259199978263454
50.936010021066,11.1245835318549,0.259199978263454
50.936010021066,11.1317780504388,0.259199978263454
50.936010021066,11.1389725690228,0.259199978263454
50.936010021066,11.1461670876068,0.259199978263454
50.9405889361992,10.9519150858397,0.259199978263454
50.9405889361992,10.9591096044236,0.259199978263454
50.9405889361992,10.9663041230076,0.259199978263454
50.9405889361992,10.9734986415916,0.259199978263454
50.9405889361992,10.9806931601755,0.352526656961103
50.9405889361992,10.9878876787595,0.287632211663641
50.9405889361992,10.9950821973435,0.272343793969411
50.9405889361992,11.0022767159274,0.314388505917815
50.9405889361992,11.0094712345114,0.333299530062221
50.9405889361992,11.0166657530954,0.259199978263454
50.9405889361992,11.0238602716793,0.259199978263454
50.9405889361992,11.0310547902633,0.265810112026721
50.9405889361992,11.0382493088473,0.289411829593669
50.9405889361992,11.0454438274312,0.259199978263454
50.9405889361992,11.0526383460152,0.259199978263454
50.9405889361992,11.0598328645992,0.259199978263454
50.9405889361992,11.0670273831831,0.306640290482984
50.9405889361992,11.0742219017671,0.256314662917086
50.9405889361992,11.0814164203511,0.259431334342329
50.9405889361992,11.088610938935,0.285830518142101
50.9405889361992,11.095805457519,0.257853217409986
50.9405889361992,11.102999976103,0.259199978263454
50.9405889361992,11.1101944946869,0.259199978263454
50.9405889361992,11.1173890132709,0.259199978263454
50.9405889361992,11.1245835318549,0.259199978263454
50.9405889361992,11.1317780504388,0.259199978263454
50.9405889361992,11.1389725690228,0.259199978263454
50.9451678513324,10.9015534557519,0.259199978263454
50.9451678513324,10.9087479743359,0.259199978263454
50.9451678513324,10.9159424929198,0.259199978263454
50.9451678513324,10.9231370115038,0.259199978263454
50.9451678513324,10.9447205672557,0.259199978263454
50.9451678513324,10.9519150858397,0.259199978263454
50.9451678513324,10.9591096044236,0.259199978263454
50.9451678513324,10.9663041230076,0.259199978263454
50.9451678513324,10.9734986415916,0.261862926573865
50.9451678513324,10.9806931601755,0.378620216755572
50.9451678513324,10.9878876787595,0.259199978263454
50.9451678513324,10.9950821973435,0.252834431165878
50.9451678513324,11.0022767159274,0.239881604666205
50.9451678513324,11.0094712345114,0.322500737616538
50.9451678513324,11.0166657530954,0.259199978263454
50.9451678513324,11.0238602716793,0.259199978263454
50.9451678513324,11.0310547902633,0.259199978263454
50.9451678513324,11.0382493088473,0.275159000686204
50.9451678513324,11.0454438274312,0.259199978263454
50.9451678513324,11.0526383460152,0.359736996909581
50.9451678513324,11.0598328645992,0.298769953784
50.9451678513324,11.0670273831831,0.361228309813827
50.9451678513324,11.0742219017671,0.376883469569286
50.9451678513324,11.0814164203511,0.371858098924239
50.9451678513324,11.088610938935,0.398428075630905
50.9451678513324,11.095805457519,0.27568505758086
50.9451678513324,11.102999976103,0.253771527190578
50.9451678513324,11.1101944946869,0.259199978263454
50.9451678513324,11.1173890132709,0.259199978263454
50.9451678513324,11.1245835318549,0.269706332062203
50.9451678513324,11.1317780504388,0.243540154643981
50.9451678513324,11.1389725690228,0.259199978263454
50.9497467664657,10.9015534557519,0.282742250819466
50.9497467664657,10.9087479743359,0.299429985998137
50.9497467664657,10.9159424929198,0.259199978263454
50.9497467664657,10.9231370115038,0.259199978263454
50.9497467664657,10.9303315300878,0.259199978263454
50.9497467664657,10.9375260486717,0.259199978263454
50.9497467664657,10.9447205672557,0.259199978263454
50.9497467664657,10.9519150858397,0.259199978263454
50.9497467664657,10.9591096044236,0.259199978263454
50.9497467664657,10.9663041230076,0.259199978263454
50.9497467664657,10.9734986415916,0.261658068366246
50.9497467664657,10.9806931601755,0.259199978263454
50.9497467664657,10.9878876787595,0.259199978263454
50.9497467664657,10.9950821973435,0.265306685923894
50.9497467664657,11.0022767159274,0.372908902629511
50.9497467664657,11.0094712345114,0.259967736178416
50.9497467664657,11.0166657530954,0.259199978263454
50.9497467664657,11.0238602716793,0.259199978263454
50.9497467664657,11.0310547902633,0.259199978263454
50.9497467664657,11.0382493088473,0.297259445532655
50.9497467664657,11.0454438274312,0.270810925491101
50.9497467664657,11.0526383460152,0.350385638542639
50.9497467664657,11.0598328645992,0.341296252342997
50.9497467664657,11.0670273831831,0.516834370986963
50.9497467664657,11.0742219017671,0.495463707412948
50.9497467664657,11.0814164203511,0.445193363786183
50.9497467664657,11.088610938935,0.514633055050335
50.9497467664657,11.095805457519,0.243660104559573
50.9497467664657,11.102999976103,0.319005210759493
50.9497467664657,11.1101944946869,0.261397320868731
50.9497467664657,11.1173890132709,0.259199978263454
50.9497467664657,11.1245835318549,0.261855085571468
50.9497467664657,11.1317780504388,0.259199978263454
50.9543256815989,10.9015534557519,0.251399996323374
50.9543256815989,10.9087479743359,0.243098956253621
50.9543256815989,10.9159424929198,0.26148796590878
50.9543256815989,10.9231370115038,0.259199978263454
50.9543256815989,10.9303315300878,0.259199978263454
50.9543256815989,10.9375260486717,0.259199978263454
50.9543256815989,10.9447205672557,0.259199978263454
50.9543256815989,10.9519150858397,0.259199978263454
50.9543256815989,10.9591096044236,0.259199978263454
50.9543256815989,10.9663041230076,0.289753753858343
50.9543256815989,10.9734986415916,0.293064051015397
50.9543256815989,10.9806931601755,0.259980608495518
50.9543256815989,10.9878876787595,0.262775295907682
50.9543256815989,10.9950821973435,0.378211121731545
50.9543256815989,11.0022767159274,0.518092613146849
50.9543256815989,11.0094712345114,0.289100600721107
50.9543256815989,11.0166657530954,0.295988956265157
50.9543256815989,11.0238602716793,0.27009902829631
50.9543256815989,11.0310547902633,0.259199978263454
50.9543256815989,11.0382493088473,0.374656654767605
50.9543256815989,11.0454438274312,0.337606468331075
50.9543256815989,11.0526383460152,0.289295356520639
50.9543256815989,11.0598328645992,0.395032241591772
50.9543256815989,11.0670273831831,0.325869293321972
50.9543256815989,11.0742219017671,0.385642933631691
50.9543256815989,11.0814164203511,0.282003204531285
50.9543256815989,11.088610938935,0.290030072794231
50.9543256815989,11.095805457519,0.281761706565262
50.9543256815989,11.102999976103,0.25941560712583
50.9543256815989,11.1101944946869,0.259199978263454
50.9543256815989,11.1173890132709,0.259199978263454
50.9543256815989,11.1245835318549,0.259199978263454
50.9543256815989,11.1317780504388,0.259199978263454
50.9589045967322,10.9015534557519,0.259199978263454
50.9589045967322,10.9087479743359,0.275303432661266
50.9589045967322,10.9159424929198,0.260777895270585
50.9589045967322,10.9231370115038,0.259199978263454
50.9589045967322,10.9303315300878,0.259199978263454
50.9589045967322,10.9375260486717,0.259199978263454
50.9589045967322,10.9447205672557,0.297337762421753
50.9589045967322,10.9519150858397,0.310326891192694
50.9589045967322,10.9591096044236,0.259199978263454
50.9589045967322,10.9663041230076,0.259199978263454
50.9589045967322,10.9734986415916,0.261611528695913
50.9589045967322,10.9806931601755,0.264278941004097
50.9589045967322,10.9878876787595,0.466082104632748
50.9589045967322,10.9950821973435,0.345388798720758
50.9589045967322,11.0022767159274,0.400205308197873
50.9589045967322,11.0094712345114,0.320786347769655
50.9589045967322,11.0166657530954,0.405525301815742
50.9589045967322,11.0238602716793,0.30783704055784
50.9589045967322,11.0310547902633,0.342032140054705
50.9589045967322,11.0382493088473,0.40238246342258
50.9589045967322,11.0454438274312,0.392155778606567
50.9589045967322,11.0526383460152,0.185391090896158
50.9589045967322,11.0598328645992,0.398358791568274
50.9589045967322,11.0670273831831,0.312498370614506
50.9589045967322,11.0742219017671,0.251920868152222
50.9589045967322,11.0814164203511,0.259199978263454
50.9589045967322,11.088610938935,0.269875160832021
50.9589045967322,11.095805457519,0.318297500313776
50.9589045967322,11.102999976103,0.25940266253513
50.9589045967322,11.1101944946869,0.262299476873849
50.9589045967322,11.1173890132709,0.260642604089407
50.9589045967322,11.1245835318549,0.259199978263454
50.9589045967322,11.1317780504388,0.259199978263454
50.9634835118654,10.8799699,0.272669517472629
50.9634835118654,10.887164418584,0.255195097585319
50.9634835118654,10.8943589371679,0.259955181678842
50.9634835118654,10.9015534557519,0.259199978263454
50.9634835118654,10.9087479743359,0.259199978263454
50.9634835118654,10.9159424929198,0.259199978263454
50.9634835118654,10.9231370115038,0.259199978263454
50.9634835118654,10.9303315300878,0.259199978263454
50.9634835118654,10.9375260486717,0.259199978263454
50.9634835118654,10.9447205672557,0.259199978263454
50.9634835118654,10.9519150858397,0.262299152957897
50.9634835118654,10.9591096044236,0.259199978263454
50.9634835118654,10.9663041230076,0.259199978263454
50.9634835118654,10.9734986415916,0.26914211991764
50.9634835118654,10.9806931601755,0.312994907568522
50.9634835118654,10.9878876787595,0.483074399935599
50.9634835118654,10.9950821973435,0.391068479104284
50.9634835118654,11.0022767159274,0.364672288121498
50.9634835118654,11.0094712345114,0.39728879401852
50.9634835118654,11.0166657530954,0.622345176212474
50.9634835118654,11.0238602716793,0.450021751476882
50.9634835118654,11.0310547902633,0.452317965161074
50.9634835118654,11.0382493088473,0.673824480810469
50.9634835118654,11.0454438274312,0.613022182686647
50.9634835118654,11.0526383460152,0.336748814396954
50.9634835118654,11.0598328645992,0.329231045999125
50.9634835118654,11.0670273831831,0.265160499041612
50.9634835118654,11.0742219017671,0.338362136842076
50.9634835118654,11.0814164203511,0.272300702869007
50.9634835118654,11.088610938935,0.315854377426429
50.9634835118654,11.095805457519,0.255857416941311
50.9634835118654,11.102999976103,0.260951448764159
50.9634835118654,11.1101944946869,0.282895823901657
50.9634835118654,11.1173890132709,0.261667124001702
50.9634835118654,11.1245835318549,0.259199978263454
50.9634835118654,11.1317780504388,0.259199978263454
50.9680624269987,10.8799699,0.306655861184411
50.9680624269987,10.887164418584,0.272813803056009
50.9680624269987,10.8943589371679,0.297334673791653
50.9680624269987,10.9015534557519,0.259199978263454
50.9680624269987,10.9087479743359,0.26254096213456
50.9680624269987,10.9159424929198,0.260743704453721
50.9680624269987,10.9231370115038,0.259199978263454
50.9680624269987,10.9303315300878,0.259199978263454
50.9680624269987,10.9375260486717,0.259199978263454
50.9680624269987,10.9447205672557,0.259199978263454
50.9680624269987,10.9519150858397,0.252349851168468
50.9680624269987,10.9591096044236,0.259199978263454
50.9680624269987,10.9663041230076,0.252458407434485
50.9680624269987,10.9734986415916,0.253841940547856
50.9680624269987,10.9806931601755,0.312579333717225
50.9680624269987,10.9878876787595,0.341632623705877
50.9680624269987,10.9950821973435,0.331729285448605
50.9680624269987,11.0022767159274,0.420944796920082
50.9680624269987,11.0094712345114,0.49259451923926
50.9680624269987,11.0166657530954,0.686795985130723
50.9680624269987,11.0238602716793,0.712017842847539
50.9680624269987,11.0310547902633,0.633571534110775
50.9680624269987,11.0382493088473,0.660096147509029
50.9680624269987,11.0454438274312,0.49779670429156
50.9680624269987,11.0526383460152,0.360398620492061
50.9680624269987,11.0598328645992,0.236680812334519
50.9680624269987,11.0670273831831,0.236334994181036
50.9680624269987,11.0742219017671,0.318336535456592
50.9680624269987,11.0814164203511,0.247760494471911
50.9680624269987,11.088610938935,0.259199978263454
50.9680624269987,11.095805457519,0.259199978263454
50.9680624269987,11.102999976103,0.259199978263454
50.9680624269987,11.1101944946869,0.246497402731414
50.9680624269987,11.1173890132709,0.259199978263454
50.9680624269987,11.1245835318549,0.259199978263454
50.9680624269987,11.1317780504388,0.259199978263454
50.9726413421319,10.8799699,0.259199978263454
50.9726413421319,10.887164418584,0.260034563256572
50.9726413421319,10.8943589371679,0.259199978263454
50.9726413421319,10.9015534557519,0.259199978263454
50.9726413421319,10.9087479743359,0.260717112220901
50.9726413421319,10.9159424929198,0.259437982340338
50.9726413421319,10.9231370115038,0.259199978263454
50.9726413421319,10.9303315300878,0.259199978263454
50.9726413421319,10.9375260486717,0.259199978263454
50.9726413421319,10.9447205672557,0.291653697013747
50.9726413421319,10.9519150858397,0.32302528126995
50.9726413421319,10.9591096044236,0.422196826350948
50.9726413421319,10.9663041230076,0.349542799297362
50.9726413421319,10.9734986415916,0.303225479789969
50.9726413421319,10.9806931601755,0.361630605368081
50.9726413421319,10.9878876787595,0.434702809505274
50.9726413421319,10.9950821973435,0.416065733724813
50.9726413421319,11.0022767159274,0.340586019377678
50.9726413421319,11.0094712345114,0.720245382964652
50.9726413421319,11.0166657530954,0.792023917508709
50.9726413421319,11.0238602716793,0.853231754400741
50.9726413421319,11.0310547902633,0.818009970078226
50.9726413421319,11.0382493088473,0.720895889692689
50.9726413421319,11.0454438274312,0.702838743254008
50.9726413421319,11.0526383460152,0.522341847740806
50.9726413421319,11.0598328645992,0.311607292490429
50.9726413421319,11.0670273831831,0.343207577951294
50.9726413421319,11.0742219017671,0.283228145632802
50.9726413421319,11.0814164203511,0.263082536284499
50.9726413421319,11.088610938935,0.250520246049268
50.9726413421319,11.095805457519,0.261123943070605
50.9726413421319,11.102999976103,0.288137488665785
50.9726413421319,11.1101944946869,0.286574389584365
50.9726413421319,11.1173890132709,0.266833651894307
50.9726413421319,11.1245835318549,0.260984729804542
50.9726413421319,11.1317780504388,0.263374908989931
50.9772202572652,10.8799699,0.259199978263454
50.9772202572652,10.887164418584,0.259199978263454
50.9772202572652,10.8943589371679,0.259199978263454
50.9772202572652,10.9015534557519,0.259199978263454
50.9772202572652,10.9087479743359,0.259199978263454
50.9772202572652,10.9159424929198,0.259199978263454
50.9772202572652,10.9231370115038,0.259199978263454
50.9772202572652,10.9303315300878,0.259199978263454
50.9772202572652,10.9375260486717,0.259199978263454
50.9772202572652,10.9447205672557,0.287751927295724
50.9772202572652,10.9519150858397,0.279631306552294
50.9772202572652,10.9591096044236,0.233127564117075
50.9772202572652,10.9663041230076,0.262537668950542
50.9772202572652,10.9734986415916,0.273379115214798
50.9772202572652,10.9806931601755,0.34309877627099
50.9772202572652,10.9878876787595,0.380005962125627
50.9772202572652,10.9950821973435,0.393097343188981
50.9772202572652,11.0022767159274,0.353406800155277
50.9772202572652,11.0094712345114,0.364587289734287
50.9772202572652,11.0166657530954,0.590381542388583
50.9772202572652,11.0238602716793,0.859843035152736
50.9772202572652,11.0310547902633,0.812207907432798
50.9772202572652,11.0382493088473,0.772523514076847
50.9772202572652,11.0454438274312,0.4482473129516
50.9772202572652,11.0526383460152,0.287747520888048
50.9772202572652,11.0598328645992,0.289004364165515
50.9772202572652,11.0670273831831,0.3569532976148
50.9772202572652,11.0742219017671,0.430203062613183
50.9772202572652,11.0814164203511,0.267542926424376
50.9772202572652,11.088610938935,0.336091505403198
50.9772202572652,11.095805457519,0.311025162021657
50.9772202572652,11.102999976103,0.34196017888473
50.9772202572652,11.1101944946869,0.261106332491451
50.9772202572652,11.1173890132709,0.286833950048436
50.9772202572652,11.1245835318549,0.186263515988403
50.9772202572652,11.1317780504388,0.291018349295751
50.9772202572652,11.1389725690228,0.259199978263454
50.9772202572652,11.1461670876068,0.259199978263454
50.9817991723984,10.8799699,0.259199978263454
50.9817991723984,10.887164418584,0.259199978263454
50.9817991723984,10.8943589371679,0.259199978263454
50.9817991723984,10.9015534557519,0.259199978263454
50.9817991723984,10.9087479743359,0.259199978263454
50.9817991723984,10.9159424929198,0.259199978263454
50.9817991723984,10.9231370115038,0.259199978263454
50.9817991723984,10.9303315300878,0.257266939866253
50.9817991723984,10.9375260486717,0.257988175009471
50.9817991723984,10.9447205672557,0.259199978263454
50.9817991723984,10.9519150858397,0.259199978263454
50.9817991723984,10.9591096044236,0.259199978263454
50.9817991723984,10.9663041230076,0.259199978263454
50.9817991723984,10.9734986415916,0.259199978263454
50.9817991723984,10.9806931601755,0.259199978263454
50.9817991723984,10.9878876787595,0.339758421513978
50.9817991723984,10.9950821973435,0.347137332657508
50.9817991723984,11.0022767159274,0.353122420179701
50.9817991723984,11.0094712345114,0.465865402317016
50.9817991723984,11.0166657530954,0.690864188099778
50.9817991723984,11.0238602716793,0.685457232628993
50.9817991723984,11.0310547902633,0.876376331187747
50.9817991723984,11.0382493088473,0.638057464247604
50.9817991723984,11.0454438274312,0.761222111141672
50.9817991723984,11.0526383460152,0.374196500210791
50.9817991723984,11.0598328645992,0.342844285173558
50.9817991723984,11.0670273831831,0.311084651403839
50.9817991723984,11.0742219017671,0.299958081798054
50.9817991723984,11.0814164203511,0.264551235816181
50.9817991723984,11.088610938935,0.263216627548484
50.9817991723984,11.095805457519,0.263175962910167
50.9817991723984,11.102999976103,0.267736151056943
50.9817991723984,11.1101944946869,0.259199978263454
50.9817991723984,11.1173890132709,0.259199978263454
50.9817991723984,11.1245835318549,0.215752560657888
50.9817991723984,11.1317780504388,0.209265624314003
50.9817991723984,11.1389725690228,0.25086321562072
50.9817991723984,11.1461670876068,0.258374640706948
50.9863780875316,10.887164418584,0.259199978263454
50.9863780875316,10.8943589371679,0.259199978263454
50.9863780875316,10.9015534557519,0.259199978263454
50.9863780875316,10.9087479743359,0.259199978263454
50.9863780875316,10.9159424929198,0.259199978263454
50.9863780875316,10.9231370115038,0.269902850474077
50.9863780875316,10.9303315300878,0.383627255015487
50.9863780875316,10.9375260486717,0.319791869132664
50.9863780875316,10.9447205672557,0.259199978263454
50.9863780875316,10.9519150858397,0.259199978263454
50.9863780875316,10.9591096044236,0.259199978263454
50.9863780875316,10.9663041230076,0.259199978263454
50.9863780875316,10.9734986415916,0.259199978263454
50.9863780875316,10.9806931601755,0.259199978263454
50.9863780875316,10.9878876787595,0.320857682996645
50.9863780875316,10.9950821973435,0.325341935275329
50.9863780875316,11.0022767159274,0.329605484232451
50.9863780875316,11.0094712345114,0.432019611248514
50.9863780875316,11.0166657530954,0.83333425067245
50.9863780875316,11.0238602716793,0.70015324790761
50.9863780875316,11.0310547902633,0.589657008940962
50.9863780875316,11.0382493088473,0.621432700126016
50.9863780875316,11.0454438274312,0.494440106732863
50.9863780875316,11.0526383460152,0.388343771422149
50.9863780875316,11.0598328645992,0.405190320746141
50.9863780875316,11.0670273831831,0.265193063279875
50.9863780875316,11.0742219017671,0.289882973942163
50.9863780875316,11.0814164203511,0.259716782708674
50.9863780875316,11.088610938935,0.259199978263454
50.9863780875316,11.095805457519,0.259199978263454
50.9863780875316,11.102999976103,0.230068684948321
50.9863780875316,11.1101944946869,0.233051135287545
50.9863780875316,11.1173890132709,0.259199978263454
50.9863780875316,11.1245835318549,0.249874405958441
50.9863780875316,11.1317780504388,0.248400575884079
50.9863780875316,11.1389725690228,0.326834932475536
50.9863780875316,11.1461670876068,0.301663526194375
50.9909570026649,10.8943589371679,0.259199978263454
50.9909570026649,10.9015534557519,0.259199978263454
50.9909570026649,10.9087479743359,0.259199978263454
50.9909570026649,10.9159424929198,0.259199978263454
50.9909570026649,10.9231370115038,0.278970337704465
50.9909570026649,10.9303315300878,0.2673989924101
50.9909570026649,10.9375260486717,0.287276945060701
50.9909570026649,10.9447205672557,0.259199978263454
50.9909570026649,10.9519150858397,0.259199978263454
50.9909570026649,10.9591096044236,0.259199978263454
50.9909570026649,10.9663041230076,0.259199978263454
50.9909570026649,10.9734986415916,0.259660885301459
50.9909570026649,10.9806931601755,0.23646372770096
50.9909570026649,10.9878876787595,0.305739700011579
50.9909570026649,10.9950821973435,0.332554619631969
50.9909570026649,11.0022767159274,0.302216347449098
50.9909570026649,11.0094712345114,0.567941649508909
50.9909570026649,11.0166657530954,0.453138026281956
50.9909570026649,11.0238602716793,0.567500913912604
50.9909570026649,11.0310547902633,0.567086896154891
50.9909570026649,11.0382493088473,0.490159239276079
50.9909570026649,11.0454438274312,0.371917067928187
50.9909570026649,11.0526383460152,0.416208165858826
50.9909570026649,11.0598328645992,0.379001283273338
50.9909570026649,11.0670273831831,0.309796484173996
50.9909570026649,11.0742219017671,0.302661092382302
50.9909570026649,11.0814164203511,0.267147565664962
50.9909570026649,11.088610938935,0.259199978263454
50.9909570026649,11.095805457519,0.259199978263454
50.9909570026649,11.102999976103,0.248574713089048
50.9909570026649,11.1101944946869,0.249113241837074
50.9909570026649,11.1173890132709,0.259199978263454
50.9909570026649,11.1245835318549,0.259199978263454
50.9909570026649,11.1317780504388,0.227001641094512
50.9909570026649,11.1389725690228,0.262322915945097
50.9909570026649,11.1461670876068,0.375937397992116
50.9955359177981,10.887164418584,0.259199978263454
50.9955359177981,10.8943589371679,0.259199978263454
50.9955359177981,10.9015534557519,0.259199978263454
50.9955359177981,10.9087479743359,0.259199978263454
50.9955359177981,10.9159424929198,0.259199978263454
50.9955359177981,10.9231370115038,0.259199978263454
50.9955359177981,10.9303315300878,0.259199978263454
50.9955359177981,10.9375260486717,0.259199978263454
50.9955359177981,10.9447205672557,0.332534475655103
50.9955359177981,10.9519150858397,0.365037334736307
50.9955359177981,10.9591096044236,0.259199978263454
50.9955359177981,10.9663041230076,0.259199978263454
50.9955359177981,10.9734986415916,0.259277728219884
50.9955359177981,10.9806931601755,0.276586406778247
50.9955359177981,10.9878876787595,0.319657835998784
50.9955359177981,10.9950821973435,0.288660522386238
50.9955359177981,11.0022767159274,0.224009302302825
50.9955359177981,11.0094712345114,0.416452049586512
50.9955359177981,11.0166657530954,0.370859518225366
50.9955359177981,11.0238602716793,0.584568601829882
50.9955359177981,11.0310547902633,0.5656208415715
50.9955359177981,11.0382493088473,0.366111742487806
50.9955359177981,11.0454438274312,0.321463007723703
50.9955359177981,11.0526383460152,0.311220027350771
50.9955359177981,11.0598328645992,0.341310476181692
50.9955359177981,11.0670273831831,0.394845015566717
50.9955359177981,11.0742219017671,0.271181199176319
50.9955359177981,11.0814164203511,0.259199978263454
50.9955359177981,11.088610938935,0.259199978263454
50.9955359177981,11.095805457519,0.259199978263454
50.9955359177981,11.102999976103,0.259199978263454
50.9955359177981,11.1101944946869,0.259199978263454
50.9955359177981,11.1173890132709,0.259199978263454
50.9955359177981,11.1245835318549,0.259199978263454
50.9955359177981,11.1317780504388,0.170185889680344
50.9955359177981,11.1389725690228,0.250871008845372
50.9955359177981,11.1461670876068,0.278361670542406
51.0001148329314,10.887164418584,0.259199978263454
51.0001148329314,10.8943589371679,0.259199978263454
51.0001148329314,10.9015534557519,0.259199978263454
51.0001148329314,10.9087479743359,0.259199978263454
51.0001148329314,10.9159424929198,0.259199978263454
51.0001148329314,10.9231370115038,0.259199978263454
51.0001148329314,10.9303315300878,0.259199978263454
51.0001148329314,10.9375260486717,0.259199978263454
51.0001148329314,10.9447205672557,0.285781739388033
51.0001148329314,10.9519150858397,0.276501357804203
51.0001148329314,10.9591096044236,0.259044894011706
51.0001148329314,10.9663041230076,0.259199978263454
51.0001148329314,10.9734986415916,0.259199978263454
51.0001148329314,10.9806931601755,0.259199978263454
51.0001148329314,10.9878876787595,0.259199978263454
51.0001148329314,10.9950821973435,0.281264037985832
51.0001148329314,11.0022767159274,0.399657853936033
51.0001148329314,11.0094712345114,0.442962009994051
51.0001148329314,11.0166657530954,0.369831704615341
51.0001148329314,11.0238602716793,0.592077055170475
51.0001148329314,11.0310547902633,0.573984563637873
51.0001148329314,11.0382493088473,0.28799841015069
51.0001148329314,11.0454438274312,0.383946521563547
51.0001148329314,11.0526383460152,0.309535529387065
51.0001148329314,11.0598328645992,0.259199978263454
51.0001148329314,11.0670273831831,0.277157754124168
51.0001148329314,11.0742219017671,0.257622343037501
51.0001148329314,11.0814164203511,0.259199978263454
51.0001148329314,11.088610938935,0.270726667139346
51.0001148329314,11.095805457519,0.272668615226034
51.0001148329314,11.102999976103,0.259199978263454
51.0001148329314,11.1101944946869,0.259199978263454
51.0001148329314,11.1173890132709,0.259199978263454
51.0001148329314,11.1245835318549,0.259199978263454
51.0001148329314,11.1317780504388,0.259199978263454
51.0001148329314,11.1389725690228,0.263482613996954
51.0001148329314,11.1461670876068,0.370194036443253
51.0046937480646,10.8799699,0.260843649333926
51.0046937480646,10.887164418584,0.260007128722666
51.0046937480646,10.8943589371679,0.259199978263454
51.0046937480646,10.9015534557519,0.259199978263454
51.0046937480646,10.9087479743359,0.259199978263454
51.0046937480646,10.9159424929198,0.253421725015784
51.0046937480646,10.9231370115038,0.259199978263454
51.0046937480646,10.9303315300878,0.259199978263454
51.0046937480646,10.9375260486717,0.259199978263454
51.0046937480646,10.9447205672557,0.259199978263454
51.0046937480646,10.9519150858397,0.259199978263454
51.0046937480646,10.9591096044236,0.259199978263454
51.0046937480646,10.9663041230076,0.259199978263454
51.0046937480646,10.9734986415916,0.259199978263454
51.0046937480646,10.9806931601755,0.338003385649245
51.0046937480646,10.9878876787595,0.283455428259739
51.0046937480646,10.9950821973435,0.211745116875921
51.0046937480646,11.0022767159274,0.542902525521155
51.0046937480646,11.0094712345114,0.552206407581854
51.0046937480646,11.0166657530954,0.540276228397283
51.0046937480646,11.0238602716793,0.429353373176932
51.0046937480646,11.0310547902633,0.332015289699747
51.0046937480646,11.0382493088473,0.245581601781892
51.0046937480646,11.0454438274312,0.368781501803163
51.0046937480646,11.0526383460152,0.379661609112177
51.0046937480646,11.0598328645992,0.259199978263454
51.0046937480646,11.0670273831831,0.259199978263454
51.0046937480646,11.0742219017671,0.259199978263454
51.0046937480646,11.0814164203511,0.259199978263454
51.0046937480646,11.088610938935,0.264600706501187
51.0046937480646,11.095805457519,0.268475356478833
51.0046937480646,11.102999976103,0.465663882028017
51.0046937480646,11.1101944946869,0.268320697887363
51.0046937480646,11.1173890132709,0.259199978263454
51.0046937480646,11.1245835318549,0.259199978263454
51.0046937480646,11.1317780504388,0.259199978263454
51.0046937480646,11.1389725690228,0.259199978263454
51.0046937480646,11.1461670876068,0.349146989395168
51.0092726631979,10.8799699,0.258453594629206
51.0092726631979,10.887164418584,0.244665439067371
51.0092726631979,10.8943589371679,0.259199978263454
51.0092726631979,10.9015534557519,0.259199978263454
51.0092726631979,10.9087479743359,0.40035717363278
51.0092726631979,10.9159424929198,0.269540029603051
51.0092726631979,10.9231370115038,0.259199978263454
51.0092726631979,10.9303315300878,0.274162832599172
51.0092726631979,10.9375260486717,0.259199978263454
51.0092726631979,10.9447205672557,0.259199978263454
51.0092726631979,10.9519150858397,0.259199978263454
51.0092726631979,10.9591096044236,0.259199978263454
51.0092726631979,10.9663041230076,0.259199978263454
51.0092726631979,10.9734986415916,0.259199978263454
51.0092726631979,10.9806931601755,0.443535134439775
51.0092726631979,10.9878876787595,0.395133390632464
51.0092726631979,10.9950821973435,0.440900723654969
51.0092726631979,11.0022767159274,0.450503838746335
51.0092726631979,11.0094712345114,0.389509536847875
51.0092726631979,11.0166657530954,0.259953538823093
51.0092726631979,11.0238602716793,0.25219932390019
51.0092726631979,11.0310547902633,0.386482628138415
51.0092726631979,11.0382493088473,0.440796684839535
51.0092726631979,11.0454438274312,0.301826753323414
51.0092726631979,11.0526383460152,0.259199978263454
51.0092726631979,11.0598328645992,0.259199978263454
51.0092726631979,11.0670273831831,0.259199978263454
51.0092726631979,11.0742219017671,0.259199978263454
51.0092726631979,11.0814164203511,0.259199978263454
51.0092726631979,11.088610938935,0.259199978263454
51.0092726631979,11.095805457519,0.266411769117365
51.0092726631979,11.102999976103,0.408289223931185
51.0092726631979,11.1101944946869,0.283863447537661
51.0092726631979,11.1173890132709,0.259199978263454
51.0092726631979,11.1317780504388,0.259199978263454
51.0092726631979,11.1389725690228,0.259199978263454
51.0092726631979,11.1461670876068,0.260141568095821
51.0138515783311,10.8799699,0.259199978263454
51.0138515783311,10.887164418584,0.259199978263454
51.0138515783311,10.8943589371679,0.259199978263454
51.0138515783311,10.9015534557519,0.259199978263454
51.0138515783311,10.9087479743359,0.316523286114027
51.0138515783311,10.9159424929198,0.259199978263454
51.0138515783311,10.9231370115038,0.2694109486471
51.0138515783311,10.9303315300878,0.367150128944405
51.0138515783311,10.9375260486717,0.259199978263454
51.0138515783311,10.9447205672557,0.259199978263454
51.0138515783311,10.9519150858397,0.259199978263454
51.0138515783311,10.9591096044236,0.259199978263454
51.0138515783311,10.9663041230076,0.259199978263454
51.0138515783311,10.9734986415916,0.259199978263454
51.0138515783311,10.9806931601755,0.250040419687884
51.0138515783311,10.9878876787595,0.357578798651566
51.0138515783311,10.9950821973435,0.404782215695393
51.0138515783311,11.0022767159274,0.440080297179007
51.0138515783311,11.0094712345114,0.282333331653771
51.0138515783311,11.0166657530954,0.287769226674862
51.0138515783311,11.0238602716793,0.353569271461709
51.0138515783311,11.0310547902633,0.379135801994325
51.0138515783311,11.0382493088473,0.386147741163186
51.0138515783311,11.0454438274312,0.315396412667705
51.0138515783311,11.0526383460152,0.275910169941804
51.0138515783311,11.0598328645992,0.259199978263454
51.0138515783311,11.0670273831831,0.259199978263454
51.0138515783311,11.0742219017671,0.259199978263454
51.0138515783311,11.0814164203511,0.259199978263454
51.0138515783311,11.088610938935,0.259199978263454
51.0138515783311,11.095805457519,0.259199978263454
51.0138515783311,11.102999976103,0.25756161563576
51.0138515783311,11.1101944946869,0.259199978263454
51.0138515783311,11.1173890132709,0.256303673356696
51.0138515783311,11.1461670876068,0.259199978263454
51.0184304934644,10.8799699,0.259199978263454
51.0184304934644,10.887164418584,0.259199978263454
51.0184304934644,10.8943589371679,0.259199978263454
51.0184304934644,10.9015534557519,0.259199978263454
51.0184304934644,10.9087479743359,0.259199978263454
51.0184304934644,10.9303315300878,0.259199978263454
51.0184304934644,10.9375260486717,0.259199978263454
51.0184304934644,10.9447205672557,0.28651282597517
51.0184304934644,10.9519150858397,0.281261880131888
51.0184304934644,10.9591096044236,0.259199978263454
51.0184304934644,10.9663041230076,0.259199978263454
51.0184304934644,10.9734986415916,0.259199978263454
51.0184304934644,10.9806931601755,0.267305873888107
51.0184304934644,10.9878876787595,0.495495137142565
51.0184304934644,10.9950821973435,0.42127945542674
51.0184304934644,11.0022767159274,0.326451402362265
51.0184304934644,11.0094712345114,0.29100036468022
51.0184304934644,11.0166657530954,0.399352128669394
51.0184304934644,11.0238602716793,0.448022633058391
51.0184304934644,11.0310547902633,0.364278914616327
51.0184304934644,11.0382493088473,0.228263662615848
51.0184304934644,11.0454438274312,0.29453638565369
51.0184304934644,11.0526383460152,0.259199978263454
51.0184304934644,11.0598328645992,0.259199978263454
51.0184304934644,11.0670273831831,0.259199978263454
51.0184304934644,11.0742219017671,0.259199978263454
51.0184304934644,11.0814164203511,0.259199978263454
51.0184304934644,11.088610938935,0.259199978263454
51.0184304934644,11.095805457519,0.259199978263454
51.0184304934644,11.102999976103,0.259199978263454
51.0184304934644,11.1101944946869,0.260767742512524
51.0184304934644,11.1173890132709,0.257152024065977
51.0184304934644,11.1245835318549,0.259199978263454
51.0230094085976,10.8799699,0.259199978263454
51.0230094085976,10.887164418584,0.259199978263454
51.0230094085976,10.8943589371679,0.259199978263454
51.0230094085976,10.9303315300878,0.259199978263454
51.0230094085976,10.9375260486717,0.259199978263454
51.0230094085976,10.9447205672557,0.357558759516279
51.0230094085976,10.9519150858397,0.368982184514928
51.0230094085976,10.9591096044236,0.259199978263454
51.0230094085976,10.9663041230076,0.259199978263454
51.0230094085976,10.9734986415916,0.259199978263454
51.0230094085976,10.9806931601755,0.311768871335363
51.0230094085976,10.9878876787595,0.360589381734349
51.0230094085976,10.9950821973435,0.412589112731832
51.0230094085976,11.0022767159274,0.301332281089308
51.0230094085976,11.0094712345114,0.312263186743323
51.0230094085976,11.0166657530954,0.263730564482743
51.0230094085976,11.0238602716793,0.316893754526902
51.0230094085976,11.0310547902633,0.358677383184663
51.0230094085976,11.0382493088473,0.258891712338659
51.0230094085976,11.0454438274312,0.259199978263454
51.0230094085976,11.0526383460152,0.259199978263454
51.0230094085976,11.0598328645992,0.259199978263454
51.0230094085976,11.0670273831831,0.259199978263454
51.0230094085976,11.0742219017671,0.259199978263454
51.0230094085976,11.0814164203511,0.259199978263454
51.0230094085976,11.088610938935,0.259199978263454
51.0230094085976,11.095805457519,0.259199978263454
51.0230094085976,11.102999976103,0.259199978263454
51.0230094085976,11.1101944946869,0.259199978263454
51.0230094085976,11.1173890132709,0.259199978263454
51.0275883237308,10.8799699,0.259199978263454
51.0275883237308,10.9303315300878,0.259199978263454
51.0275883237308,10.9375260486717,0.259199978263454
51.0275883237308,10.9447205672557,0.259199978263454
51.0275883237308,10.9519150858397,0.265195424858583
51.0275883237308,10.9591096044236,0.259199978263454
51.0275883237308,10.9663041230076,0.259199978263454
51.0275883237308,10.9734986415916,0.259199978263454
51.0275883237308,10.9806931601755,0.329085549746508
51.0275883237308,10.9878876787595,0.327486048842712
51.0275883237308,10.9950821973435,0.259199978263454
51.0275883237308,11.0022767159274,0.263436184234727
51.0275883237308,11.0094712345114,0.271144052368993
51.0275883237308,11.0166657530954,0.266273845684932
51.0275883237308,11.0238602716793,0.265091756758381
51.0275883237308,11.0310547902633,0.370853511558454
51.0275883237308,11.0382493088473,0.279312498615028
51.0275883237308,11.0454438274312,0.259199978263454
51.0275883237308,11.0526383460152,0.259199978263454
51.0275883237308,11.0598328645992,0.259199978263454
51.0275883237308,11.0670273831831,0.259199978263454
51.0275883237308,11.0742219017671,0.259199978263454
51.0275883237308,11.0814164203511,0.259199978263454
51.0275883237308,11.088610938935,0.259199978263454
51.0275883237308,11.095805457519,0.259199978263454
51.0275883237308,11.102999976103,0.259199978263454
51.0275883237308,11.1101944946869,0.259199978263454
51.0321672388641,10.9447205672557,0.259199978263454
51.0321672388641,10.9519150858397,0.259199978263454
51.0321672388641,10.9591096044236,0.259199978263454
51.0321672388641,10.9663041230076,0.243109722228714
51.0321672388641,10.9734986415916,0.28417678073221
51.0321672388641,10.9806931601755,0.278444728393786
51.0321672388641,10.9878876787595,0.261249706683568
51.0321672388641,10.9950821973435,0.259199978263454
51.0321672388641,11.0022767159274,0.265382829486594
51.0321672388641,11.0094712345114,0.338656937442732
51.0321672388641,11.0166657530954,0.259199978263454
51.0321672388641,11.0238602716793,0.285837255938143
51.0321672388641,11.0310547902633,0.316287684516343
51.0321672388641,11.0382493088473,0.226274208908844
51.0321672388641,11.0454438274312,0.222071940621679
51.0321672388641,11.0526383460152,0.259199978263454
51.0321672388641,11.0598328645992,0.259199978263454
51.0321672388641,11.0670273831831,0.259199978263454
51.0321672388641,11.0742219017671,0.259199978263454
51.0321672388641,11.0814164203511,0.259199978263454
51.0321672388641,11.088610938935,0.259199978263454
51.0321672388641,11.095805457519,0.259199978263454
51.0321672388641,11.102999976103,0.259199978263454
51.0367461539973,10.9591096044236,0.259199978263454
51.0367461539973,10.9663041230076,0.237555030288964
51.0367461539973,10.9734986415916,0.243655461104317
51.0367461539973,10.9806931601755,0.316926013496053
51.0367461539973,10.9878876787595,0.362250433207374
51.0367461539973,10.9950821973435,0.271889247037916
51.0367461539973,11.0022767159274,0.401207199778225
51.0367461539973,11.0094712345114,0.453651467834678
51.0367461539973,11.0166657530954,0.259199978263454
51.0367461539973,11.0238602716793,0.259199978263454
51.0367461539973,11.0310547902633,0.259199978263454
51.0367461539973,11.0382493088473,0.263267587061305
51.0367461539973,11.0454438274312,0.258036039915447
51.0367461539973,11.0526383460152,0.259199978263454
51.0367461539973,11.0598328645992,0.259199978263454
51.0367461539973,11.0670273831831,0.259199978263454
51.0367461539973,11.0742219017671,0.332561818986906
51.0367461539973,11.0814164203511,0.281013816825057
51.0367461539973,11.088610938935,0.259199978263454
51.0367461539973,11.095805457519,0.259199978263454
51.0413250691306,10.9806931601755,0.260984196139436
51.0413250691306,10.9878876787595,0.260565689176791
51.0413250691306,10.9950821973435,0.28001227310329
51.0413250691306,11.0022767159274,0.321470873160872
51.0413250691306,11.0094712345114,0.401165097291707
51.0413250691306,11.0166657530954,0.259199978263454
51.0413250691306,11.0238602716793,0.259199978263454
51.0413250691306,11.0310547902633,0.259199978263454
51.0413250691306,11.0382493088473,0.259199978263454
51.0413250691306,11.0454438274312,0.259199978263454
51.0413250691306,11.0526383460152,0.259199978263454
51.0413250691306,11.0598328645992,0.259199978263454
51.0413250691306,11.0670273831831,0.259199978263454
51.0413250691306,11.0742219017671,0.256928985054791
51.0413250691306,11.0814164203511,0.267174099316973
51.0413250691306,11.088610938935,0.259199978263454
51.0413250691306,11.095805457519,0.259199978263454
51.0459039842638,10.9878876787595,0.259199978263454
51.0459039842638,10.9950821973435,0.259199978263454
51.0459039842638,11.0022767159274,0.270969864875032
51.0459039842638,11.0094712345114,0.270655868229005
51.0459039842638,11.0166657530954,0.259199978263454
51.0459039842638,11.0238602716793,0.259199978263454
51.0459039842638,11.0310547902633,0.259199978263454
51.0459039842638,11.0382493088473,0.225271569483409
51.0459039842638,11.0454438274312,0.231747655237502
51.0459039842638,11.0526383460152,0.258183405226678
51.0459039842638,11.0598328645992,0.251823673122055
51.0459039842638,11.0670273831831,0.259199978263454
51.0459039842638,11.0742219017671,0.259199978263454
51.0459039842638,11.0814164203511,0.259199978263454
51.0459039842638,11.088610938935,0.259199978263454
51.0459039842638,11.095805457519,0.259199978263454
51.0504828993971,10.9878876787595,0.259199978263454
51.0504828993971,10.9950821973435,0.259199978263454
51.0504828993971,11.0022767159274,0.259199978263454
51.0504828993971,11.0094712345114,0.259199978263454
51.0504828993971,11.0166657530954,0.259199978263454
51.0504828993971,11.0238602716793,0.259199978263454
51.0504828993971,11.0310547902633,0.259199978263454
51.0504828993971,11.0382493088473,0.318658265595842
51.0504828993971,11.0454438274312,0.34541346857714
51.0504828993971,11.0526383460152,0.360595531394533
51.0504828993971,11.0598328645992,0.253405871194416
51.0504828993971,11.0670273831831,0.260773316105866
51.0504828993971,11.0742219017671,0.259276977799594
51.0504828993971,11.0814164203511,0.259199978263454
51.0504828993971,11.088610938935,0.259199978263454
51.0504828993971,11.095805457519,0.259199978263454
51.0550618145303,10.9806931601755,0.259199978263454
51.0550618145303,10.9878876787595,0.259199978263454
51.0550618145303,10.9950821973435,0.259199978263454
51.0550618145303,11.0022767159274,0.259199978263454
51.0550618145303,11.0094712345114,0.259199978263454
51.0550618145303,11.0166657530954,0.259199978263454
51.0550618145303,11.0238602716793,0.259199978263454
51.0550618145303,11.0310547902633,0.259199978263454
51.0550618145303,11.0382493088473,0.345301547967909
51.0550618145303,11.0454438274312,0.314061960226618
51.0550618145303,11.0526383460152,0.259199978263454
51.0550618145303,11.0598328645992,0.259199978263454
51.0550618145303,11.0670273831831,0.262705949387099
51.0550618145303,11.0742219017671,0.260582569087448
51.0550618145303,11.0814164203511,0.259199978263454
51.0550618145303,11.088610938935,0.259199978263454
51.0596407296635,10.9806931601755,0.259199978263454
51.0596407296635,10.9878876787595,0.259199978263454
51.0596407296635,11.0022767159274,0.259199978263454
51.0596407296635,11.0094712345114,0.259199978263454
51.0596407296635,11.0238602716793,0.259199978263454
51.0596407296635,11.0310547902633,0.259199978263454
51.0596407296635,11.0382493088473,0.259199978263454
51.0596407296635,11.0454438274312,0.26691113837866
51.0596407296635,11.0526383460152,0.272406972375572
51.0596407296635,11.0598328645992,0.259199978263454
51.0596407296635,11.0670273831831,0.259199978263454
51.0596407296635,11.0742219017671,0.259199978263454
51.0596407296635,11.0814164203511,0.259199978263454
51.0596407296635,11.088610938935,0.259199978263454
51.0642196447968,10.9806931601755,0.259199978263454
51.0642196447968,10.9878876787595,0.259199978263454
51.0642196447968,11.0238602716793,0.259199978263454
51.0642196447968,11.0310547902633,0.259199978263454
51.0642196447968,11.0382493088473,0.280134431033384
51.0642196447968,11.0454438274312,0.417501876332156
51.0642196447968,11.0526383460152,0.262474793891334
51.0642196447968,11.0598328645992,0.259199978263454
51.0642196447968,11.0670273831831,0.259199978263454
51.0642196447968,11.0742219017671,0.259199978263454
51.0642196447968,11.0814164203511,0.259199978263454
51.0642196447968,11.088610938935,0.259199978263454
51.06879855993,11.0454438274312,0.264797565037766
51.06879855993,11.0526383460152,0.259199978263454
51.06879855993,11.0598328645992,0.259199978263454
51.06879855993,11.0670273831831,0.259199978263454
51.06879855993,11.0742219017671,0.259199978263454
