50.2736708,11.175667206863,0.259199978263454
50.2736708,11.1828617249652,0.259199978263454
50.2736708,11.1900562430675,0.259199978263454
50.2736708,11.2404178697832,0.259199978263454
50.2736708,11.2476123878855,0.259199978263454
50.2736708,11.2548069059877,0.259199978263454
50.2782511695426,11.1828617249652,0.259199978263454
50.2782511695426,11.1900562430675,0.259199978263454
50.2782511695426,11.2260288335787,0.259199978263454
50.2782511695426,11.233223351681,0.259199978263454
50.2782511695426,11.2404178697832,0.259199978263454
50.2782511695426,11.2476123878855,0.259199978263454
50.2782511695426,11.2548069059877,0.259199978263454
50.2828315390852,11.175667206863,0.259199978263454
50.2828315390852,11.1828617249652,0.259199978263454
50.2828315390852,11.1900562430675,0.259199978263454
50.2828315390852,11.2188343154765,0.259199978263454
50.2828315390852,11.2260288335787,0.259199978263454
50.2828315390852,11.233223351681,0.259199978263454
50.2828315390852,11.2404178697832,0.265263382608035
50.2828315390852,11.2476123878855,0.26023363115398
50.2828315390852,11.2548069059877,0.259199978263454
50.2874119086278,11.146889134454,0.259199978263454
50.2874119086278,11.1540836525562,0.258310446195793
50.2874119086278,11.1612781706585,0.259199978263454
50.2874119086278,11.1684726887607,0.259199978263454
50.2874119086278,11.175667206863,0.259199978263454
50.2874119086278,11.1828617249652,0.259199978263454
50.2874119086278,11.1900562430675,0.259199978263454
50.2874119086278,11.2116397973742,0.259199978263454
50.2874119086278,11.2188343154765,0.259199978263454
50.2874119086278,11.2260288335787,0.259199978263454
50.2874119086278,11.233223351681,0.259199978263454
50.2874119086278,11.2404178697832,0.262562712425866
50.2874119086278,11.2476123878855,0.240045172128894
50.2874119086278,11.2548069059877,0.259199978263454
50.2919922781704,11.146889134454,0.257873807063048
50.2919922781704,11.1540836525562,0.270974140128598
50.2919922781704,11.1612781706585,0.259199978263454
50.2919922781704,11.1684726887607,0.259199978263454
50.2919922781704,11.175667206863,0.259199978263454
50.2919922781704,11.1828617249652,0.259199978263454
50.2919922781704,11.1900562430675,0.259199978263454
50.2919922781704,11.1972507611697,0.259199978263454
50.2919922781704,11.204445279272,0.259199978263454
50.2919922781704,11.2116397973742,0.259199978263454
50.2919922781704,11.2188343154765,0.259199978263454
50.2919922781704,11.2260288335787,0.259199978263454
50.2919922781704,11.233223351681,0.259199978263454
50.2919922781704,11.2404178697832,0.259199978263454
50.2919922781704,11.2476123878855,0.259199978263454
50.2919922781704,11.2548069059877,0.259199978263454
50.296572647713,11.1396946163517,0.259199978263454
50.296572647713,11.146889134454,0.255271913509471
50.296572647713,11.1540836525562,0.265739410775686
50.296572647713,11.1612781706585,0.258627226742388
50.296572647713,11.1684726887607,0.259199978263454
50.296572647713,11.175667206863,0.259199978263454
50.296572647713,11.1828617249652,0.259199978263454
50.296572647713,11.1900562430675,0.259199978263454
50.296572647713,11.1972507611697,0.259199978263454
50.296572647713,11.204445279272,0.259199978263454
50.296572647713,11.2116397973742,0.259199978263454
50.296572647713,11.2188343154765,0.259199978263454
50.296572647713,11.2260288335787,0.224903392130789
50.296572647713,11.233223351681,0.23993848834116
50.296572647713,11.2404178697832,0.222076433828452
50.296572647713,11.2476123878855,0.259199978263454
50.3011530172557,11.1396946163517,0.259199978263454
50.3011530172557,11.146889134454,0.259199978263454
50.3011530172557,11.1540836525562,0.259199978263454
50.3011530172557,11.1612781706585,0.259199978263454
50.3011530172557,11.1684726887607,0.25879121853996
50.3011530172557,11.175667206863,0.25228333403084
50.3011530172557,11.1828617249652,0.259199978263454
50.3011530172557,11.1900562430675,0.259199978263454
50.3011530172557,11.1972507611697,0.259199978263454
50.3011530172557,11.204445279272,0.259199978263454
50.3011530172557,11.2116397973742,0.259199978263454
50.3011530172557,11.2188343154765,0.259199978263454
50.3011530172557,11.2260288335787,0.232736709056185
50.3011530172557,11.233223351681,0.259199978263454
50.3011530172557,11.2404178697832,0.252513080384315
50.3011530172557,11.2476123878855,0.259199978263454
50.3011530172557,11.2548069059877,0.259199978263454
50.3057333867983,11.1325000982495,0.259199978263454
50.3057333867983,11.1396946163517,0.259199978263454
50.3057333867983,11.146889134454,0.261170431732167
50.3057333867983,11.1540836525562,0.251271906385413
50.3057333867983,11.1612781706585,0.259199978263454
50.3057333867983,11.1684726887607,0.256800131391935
50.3057333867983,11.175667206863,0.249029102307843
50.3057333867983,11.1828617249652,0.259199978263454
50.3057333867983,11.1900562430675,0.259199978263454
50.3057333867983,11.1972507611697,0.259199978263454
50.3057333867983,11.204445279272,0.259199978263454
50.3057333867983,11.2116397973742,0.259199978263454
50.3057333867983,11.2188343154765,0.259199978263454
50.3057333867983,11.2260288335787,0.259199978263454
50.3057333867983,11.233223351681,0.260715068890407
50.3057333867983,11.2404178697832,0.22451906313699
50.3057333867983,11.2476123878855,0.237086470011473
50.3057333867983,11.2548069059877,0.26120820799582
50.3057333867983,11.26200142409,0.259199978263454
50.3103137563409,11.1396946163517,0.259199978263454
50.3103137563409,11.146889134454,0.258386891959769
50.3103137563409,11.1540836525562,0.285820431263579
50.3103137563409,11.1612781706585,0.259199978263454
50.3103137563409,11.1684726887607,0.259199978263454
50.3103137563409,11.175667206863,0.259199978263454
50.3103137563409,11.1828617249652,0.259199978263454
50.3103137563409,11.1900562430675,0.259199978263454
50.3103137563409,11.1972507611697,0.259199978263454
50.3103137563409,11.204445279272,0.259199978263454
50.3103137563409,11.2116397973742,0.259199978263454
50.3103137563409,11.2188343154765,0.256462854943118
50.3103137563409,11.2260288335787,0.244005603950017
50.3103137563409,11.233223351681,0.258988293730025
50.3103137563409,11.2404178697832,0.350899035913413
50.3103137563409,11.2476123878855,0.324402583198341
50.3103137563409,11.2548069059877,0.29362638814442
50.3103137563409,11.26200142409,0.283419269090674
50.3148941258835,11.1396946163517,0.259199978263454
50.3148941258835,11.146889134454,0.259199978263454
50.3148941258835,11.1540836525562,0.296060692441269
50.3148941258835,11.1612781706585,0.259199978263454
50.3148941258835,11.1684726887607,0.259199978263454
50.3148941258835,11.175667206863,0.24103982682754
50.3148941258835,11.1828617249652,0.25499907209893
50.3148941258835,11.1900562430675,0.259199978263454
50.3148941258835,11.1972507611697,0.259199978263454
50.3148941258835,11.204445279272,0.25039540196926
50.3148941258835,11.2116397973742,0.249115684146239
50.3148941258835,11.2188343154765,0.254800521400043
50.3148941258835,11.2260288335787,0.241007828515148
50.3148941258835,11.233223351681,0.259199978263454
50.3148941258835,11.2404178697832,0.279118540567303
50.3148941258835,11.2476123878855,0.248995148236989
50.3148941258835,11.2548069059877,0.259199978263454
50.3148941258835,11.26200142409,0.259199978263454
50.3194744954261,11.146889134454,0.259199978263454
50.3194744954261,11.1540836525562,0.259199978263454
50.3194744954261,11.1612781706585,0.259199978263454
50.3194744954261,11.1684726887607,0.259199978263454
50.3194744954261,11.175667206863,0.255295734785953
50.3194744954261,11.1828617249652,0.259199978263454
50.3194744954261,11.1900562430675,0.259199978263454
50.3194744954261,11.1972507611697,0.259199978263454
50.3194744954261,11.204445279272,0.259199978263454
50.3194744954261,11.2116397973742,0.259199978263454
50.3194744954261,11.2188343154765,0.259199978263454
50.3194744954261,11.2260288335787,0.259199978263454
50.3194744954261,11.233223351681,0.266999461687785
50.3194744954261,11.2404178697832,0.271909143127981
50.3194744954261,11.2476123878855,0.257127002545721
50.3194744954261,11.2548069059877,0.259199978263454
50.3240548649687,11.1612781706585,0.259199978263454
50.3240548649687,11.1684726887607,0.259199978263454
50.3240548649687,11.175667206863,0.259199978263454
50.3240548649687,11.1828617249652,0.259199978263454
50.3240548649687,11.1900562430675,0.259199978263454
50.3240548649687,11.1972507611697,0.259199978263454
50.3240548649687,11.204445279272,0.259199978263454
50.3240548649687,11.2116397973742,0.259199978263454
50.3240548649687,11.2188343154765,0.235731962796744
50.3240548649687,11.2260288335787,0.258894234852347
50.3240548649687,11.233223351681,0.259199978263454
50.3240548649687,11.2404178697832,0.266069775767709
50.3240548649687,11.2476123878855,0.259199978263454
50.3240548649687,11.2548069059877,0.259199978263454
50.3286352345113,11.1612781706585,0.259199978263454
50.3286352345113,11.1684726887607,0.266389915764437
50.3286352345113,11.175667206863,0.255445395730366
50.3286352345113,11.1828617249652,0.259199978263454
50.3286352345113,11.1900562430675,0.259199978263454
50.3286352345113,11.1972507611697,0.259199978263454
50.3286352345113,11.204445279272,0.259199978263454
50.3286352345113,11.2116397973742,0.259199978263454
50.3286352345113,11.2188343154765,0.249440837835587
50.3286352345113,11.2260288335787,0.259199978263454
50.3286352345113,11.233223351681,0.259199978263454
50.3286352345113,11.2404178697832,0.259199978263454
50.3286352345113,11.2476123878855,0.259199978263454
50.3286352345113,11.2548069059877,0.259199978263454
50.3332156040539,11.1612781706585,0.259199978263454
50.3332156040539,11.1684726887607,0.257834335036967
50.3332156040539,11.175667206863,0.245929190951982
50.3332156040539,11.1828617249652,0.365228769259196
50.3332156040539,11.1900562430675,0.27996677055776
50.3332156040539,11.1972507611697,0.259199978263454
50.3332156040539,11.204445279272,0.259199978263454
50.3332156040539,11.2116397973742,0.259199978263454
50.3332156040539,11.2188343154765,0.259199978263454
50.3332156040539,11.2260288335787,0.259199978263454
50.3332156040539,11.233223351681,0.259199978263454
50.3332156040539,11.2404178697832,0.276917543976246
50.3332156040539,11.2476123878855,0.259199978263454
50.3332156040539,11.2548069059877,0.259199978263454
50.3377959735965,11.1540836525562,0.259199978263454
50.3377959735965,11.1612781706585,0.259199978263454
50.3377959735965,11.1684726887607,0.259199978263454
50.3377959735965,11.175667206863,0.269344597740985
50.3377959735965,11.1828617249652,0.333335434304305
50.3377959735965,11.1900562430675,0.264429631950498
50.3377959735965,11.1972507611697,0.259199978263454
50.3377959735965,11.204445279272,0.259199978263454
50.3377959735965,11.2116397973742,0.259199978263454
50.3377959735965,11.2188343154765,0.259199978263454
50.3377959735965,11.2260288335787,0.259199978263454
50.3377959735965,11.233223351681,0.233010180337365
50.3377959735965,11.2404178697832,0.321080578210005
50.3377959735965,11.2476123878855,0.26187060847557
50.3377959735965,11.2548069059877,0.259199978263454
50.3423763431391,11.146889134454,0.289458111687881
50.3423763431391,11.1540836525562,0.344911796870853
50.3423763431391,11.1612781706585,0.280611215236224
50.3423763431391,11.1684726887607,0.315907263914338
50.3423763431391,11.175667206863,0.349844516194922
50.3423763431391,11.1828617249652,0.359254591864588
50.3423763431391,11.1900562430675,0.25446781844845
50.3423763431391,11.1972507611697,0.259199978263454
50.3423763431391,11.204445279272,0.271022858476827
50.3423763431391,11.2116397973742,0.250367823791399
50.3423763431391,11.2188343154765,0.259199978263454
50.3423763431391,11.2260288335787,0.259638700253909
50.3423763431391,11.233223351681,0.23179362353268
50.3423763431391,11.2404178697832,0.259199978263454
50.3423763431391,11.2476123878855,0.259199978263454
50.3423763431391,11.2548069059877,0.259199978263454
50.3423763431391,11.26200142409,0.259199978263454
50.3469567126817,11.0389713629203,0.259199978263454
50.3469567126817,11.0461658810225,0.259199978263454
50.3469567126817,11.1396946163517,0.259199978263454
50.3469567126817,11.146889134454,0.248872770875686
50.3469567126817,11.1540836525562,0.272950583995319
50.3469567126817,11.1612781706585,0.284306999041657
50.3469567126817,11.1684726887607,0.410715498154044
50.3469567126817,11.175667206863,0.373588085340175
50.3469567126817,11.1828617249652,0.312521705353189
50.3469567126817,11.1900562430675,0.259199978263454
50.3469567126817,11.1972507611697,0.242572911220219
50.3469567126817,11.204445279272,0.265243942211007
50.3469567126817,11.2116397973742,0.199820384801344
50.3469567126817,11.2188343154765,0.259199978263454
50.3469567126817,11.2260288335787,0.259199978263454
50.3469567126817,11.233223351681,0.259199978263454
50.3469567126817,11.2404178697832,0.259199978263454
50.3469567126817,11.2476123878855,0.259199978263454
50.3469567126817,11.2548069059877,0.259199978263454
50.3469567126817,11.26200142409,0.259199978263454
50.3515370822243,10.9886097362045,0.259199978263454
50.3515370822243,10.9958042543067,0.259199978263454
50.3515370822243,11.0389713629203,0.259199978263454
50.3515370822243,11.0461658810225,0.259199978263454
50.3515370822243,11.0533603991247,0.259199978263454
50.3515370822243,11.060554917227,0.259199978263454
50.3515370822243,11.0677494353292,0.259199978263454
50.3515370822243,11.118111062045,0.259199978263454
50.3515370822243,11.1396946163517,0.259199978263454
50.3515370822243,11.146889134454,0.229877433041483
50.3515370822243,11.1540836525562,0.29720211143887
50.3515370822243,11.1612781706585,0.36012509008511
50.3515370822243,11.1684726887607,0.356595512981914
50.3515370822243,11.175667206863,0.326750532240113
50.3515370822243,11.1828617249652,0.299706640633544
50.3515370822243,11.1900562430675,0.271586011778663
50.3515370822243,11.1972507611697,0.258488060093375
50.3515370822243,11.204445279272,0.410969395901203
50.3515370822243,11.2116397973742,0.306603001012869
50.3515370822243,11.2188343154765,0.322944529028806
50.3515370822243,11.2260288335787,0.270330025717743
50.3515370822243,11.233223351681,0.259199978263454
50.3515370822243,11.2404178697832,0.259199978263454
50.3515370822243,11.2476123878855,0.259199978263454
50.3515370822243,11.2548069059877,0.259199978263454
50.3515370822243,11.26200142409,0.259199978263454
50.356117451767,10.9814152181022,0.259199978263454
50.356117451767,10.9886097362045,0.259199978263454
50.356117451767,11.0389713629203,0.259199978263454
50.356117451767,11.0461658810225,0.259199978263454
50.356117451767,11.0533603991247,0.259199978263454
50.356117451767,11.060554917227,0.259199978263454
50.356117451767,11.0677494353292,0.259199978263454
50.356117451767,11.0749439534315,0.259199978263454
50.356117451767,11.0821384715337,0.259199978263454
50.356117451767,11.118111062045,0.259199978263454
50.356117451767,11.1253055801472,0.259199978263454
50.356117451767,11.1325000982495,0.259199978263454
50.356117451767,11.1396946163517,0.259199978263454
50.356117451767,11.146889134454,0.259199978263454
50.356117451767,11.1540836525562,0.331313416443637
50.356117451767,11.1612781706585,0.268037626389997
50.356117451767,11.1684726887607,0.412734463227481
50.356117451767,11.175667206863,0.397483523340827
50.356117451767,11.1828617249652,0.273154409280678
50.356117451767,11.1900562430675,0.314458750261733
50.356117451767,11.1972507611697,0.244408485135888
50.356117451767,11.204445279272,0.569149745021988
50.356117451767,11.2116397973742,0.336654422635692
50.356117451767,11.2188343154765,0.309841225702252
50.356117451767,11.2260288335787,0.259199978263454
50.356117451767,11.233223351681,0.259199978263454
50.356117451767,11.2404178697832,0.259199978263454
50.356117451767,11.2476123878855,0.259199978263454
50.356117451767,11.2548069059877,0.259199978263454
50.356117451767,11.26200142409,0.259199978263454
50.3606978213096,10.9742207,0.259199978263454
50.3606978213096,10.9814152181022,0.259199978263454
50.3606978213096,10.9886097362045,0.259199978263454
50.3606978213096,11.0245823267158,0.259199978263454
50.3606978213096,11.031776844818,0.259199978263454
50.3606978213096,11.0389713629203,0.259199978263454
50.3606978213096,11.0461658810225,0.259199978263454
50.3606978213096,11.0533603991247,0.259199978263454
50.3606978213096,11.060554917227,0.259199978263454
50.3606978213096,11.0677494353292,0.259199978263454
50.3606978213096,11.0749439534315,0.259199978263454
50.3606978213096,11.0821384715337,0.259199978263454
50.3606978213096,11.1253055801472,0.259199978263454
50.3606978213096,11.1325000982495,0.259199978263454
50.3606978213096,11.1396946163517,0.26130033452927
50.3606978213096,11.146889134454,0.259199978263454
50.3606978213096,11.1540836525562,0.393543932066856
50.3606978213096,11.1612781706585,0.334996407374529
50.3606978213096,11.1684726887607,0.528812796890472
50.3606978213096,11.175667206863,0.588428195706201
50.3606978213096,11.1828617249652,0.43304632311595
50.3606978213096,11.1900562430675,0.265174676048223
50.3606978213096,11.1972507611697,0.258762859638096
50.3606978213096,11.204445279272,0.344761516312162
50.3606978213096,11.2116397973742,0.407717823810323
50.3606978213096,11.2188343154765,0.260650965832551
50.3606978213096,11.2260288335787,0.259199978263454
50.3606978213096,11.233223351681,0.259199978263454
50.3606978213096,11.2404178697832,0.259199978263454
50.3606978213096,11.2476123878855,0.259199978263454
50.3606978213096,11.2548069059877,0.259199978263454
50.3606978213096,11.26200142409,0.259199978263454
50.3652781908522,10.9742207,0.259199978263454
50.3652781908522,10.9814152181022,0.259199978263454
50.3652781908522,10.9886097362045,0.259199978263454
50.3652781908522,11.002998772409,0.259199978263454
50.3652781908522,11.0101932905112,0.259199978263454
50.3652781908522,11.0173878086135,0.259199978263454
50.3652781908522,11.0245823267158,0.266818018323693
50.3652781908522,11.031776844818,0.259199978263454
50.3652781908522,11.0389713629203,0.259199978263454
50.3652781908522,11.0461658810225,0.259199978263454
50.3652781908522,11.0533603991247,0.259199978263454
50.3652781908522,11.060554917227,0.259199978263454
50.3652781908522,11.0677494353292,0.259199978263454
50.3652781908522,11.0749439534315,0.259199978263454
50.3652781908522,11.0821384715337,0.259199978263454
50.3652781908522,11.118111062045,0.259199978263454
50.3652781908522,11.1253055801472,0.259199978263454
50.3652781908522,11.1325000982495,0.259199978263454
50.3652781908522,11.1396946163517,0.267054945513793
50.3652781908522,11.146889134454,0.241126028030153
50.3652781908522,11.1540836525562,0.38984484453863
50.3652781908522,11.1612781706585,0.27977788534838
50.3652781908522,11.1684726887607,0.388148032419708
50.3652781908522,11.175667206863,0.495551970072861
50.3652781908522,11.1828617249652,0.303656124046922
50.3652781908522,11.1900562430675,0.379270770888181
50.3652781908522,11.1972507611697,0.259199978263454
50.3652781908522,11.204445279272,0.287608565897881
50.3652781908522,11.2116397973742,0.330187440335784
50.3652781908522,11.2188343154765,0.259199978263454
50.3652781908522,11.2260288335787,0.259199978263454
50.3652781908522,11.233223351681,0.259199978263454
50.3652781908522,11.2404178697832,0.259199978263454
50.3652781908522,11.2476123878855,0.259199978263454
50.3652781908522,11.2548069059877,0.259199978263454
50.3652781908522,11.26200142409,0.259199978263454
50.3698585603948,10.9742207,0.259199978263454
50.3698585603948,10.9814152181022,0.259199978263454
50.3698585603948,10.9886097362045,0.259199978263454
50.3698585603948,10.9958042543067,0.259199978263454
50.3698585603948,11.002998772409,0.261285993566283
50.3698585603948,11.0101932905112,0.248220378154317
50.3698585603948,11.0173878086135,0.259199978263454
50.3698585603948,11.0245823267158,0.300276902170093
50.3698585603948,11.031776844818,0.263288037517386
50.3698585603948,11.0389713629203,0.259199978263454
50.3698585603948,11.0461658810225,0.259199978263454
50.3698585603948,11.0533603991247,0.259199978263454
50.3698585603948,11.060554917227,0.259199978263454
50.3698585603948,11.0677494353292,0.259199978263454
50.3698585603948,11.0749439534315,0.259199978263454
50.3698585603948,11.0821384715337,0.259199978263454
50.3698585603948,11.089332989636,0.259199978263454
50.3698585603948,11.0965275077382,0.259199978263454
50.3698585603948,11.1037220258405,0.259199978263454
50.3698585603948,11.1109165439427,0.259199978263454
50.3698585603948,11.118111062045,0.259199978263454
50.3698585603948,11.1253055801472,0.259199978263454
50.3698585603948,11.1325000982495,0.259199978263454
50.3698585603948,11.1396946163517,0.257776562303123
50.3698585603948,11.146889134454,0.258423549803171
50.3698585603948,11.1540836525562,0.312765932638921
50.3698585603948,11.1612781706585,0.263423762317685
50.3698585603948,11.1684726887607,0.398429303594837
50.3698585603948,11.175667206863,0.36982988116952
50.3698585603948,11.1828617249652,0.265333964656157
50.3698585603948,11.1900562430675,0.297407790797897
50.3698585603948,11.1972507611697,0.259199978263454
50.3698585603948,11.204445279272,0.290026881738293
50.3698585603948,11.2116397973742,0.259199978263454
50.3698585603948,11.2188343154765,0.259199978263454
50.3698585603948,11.2260288335787,0.259199978263454
50.3698585603948,11.233223351681,0.259199978263454
50.3698585603948,11.2404178697832,0.213234424397773
50.3698585603948,11.2476123878855,0.256650228480079
50.3698585603948,11.2548069059877,0.259199978263454
50.3698585603948,11.26200142409,0.259199978263454
50.3744389299374,10.9742207,0.259199978263454
50.3744389299374,10.9814152181022,0.259199978263454
50.3744389299374,10.9886097362045,0.259199978263454
50.3744389299374,10.9958042543067,0.259199978263454
50.3744389299374,11.002998772409,0.259199978263454
50.3744389299374,11.0101932905112,0.255534424928161
50.3744389299374,11.0173878086135,0.259199978263454
50.3744389299374,11.0245823267158,0.259199978263454
50.3744389299374,11.031776844818,0.259199978263454
50.3744389299374,11.0389713629203,0.259199978263454
50.3744389299374,11.0461658810225,0.259199978263454
50.3744389299374,11.0533603991247,0.259199978263454
50.3744389299374,11.060554917227,0.259199978263454
50.3744389299374,11.0677494353292,0.259199978263454
50.3744389299374,11.0749439534315,0.356304578197299
50.3744389299374,11.0821384715337,0.330961820825529
50.3744389299374,11.089332989636,0.259199978263454
50.3744389299374,11.0965275077382,0.259199978263454
50.3744389299374,11.1037220258405,0.259199978263454
50.3744389299374,11.1109165439427,0.259199978263454
50.3744389299374,11.118111062045,0.259199978263454
50.3744389299374,11.1253055801472,0.259199978263454
50.3744389299374,11.1325000982495,0.259199978263454
50.3744389299374,11.1396946163517,0.259199978263454
50.3744389299374,11.146889134454,0.27241073891813
50.3744389299374,11.1540836525562,0.259199978263454
50.3744389299374,11.1612781706585,0.303271822923572
50.3744389299374,11.1684726887607,0.303933932431746
50.3744389299374,11.175667206863,0.25398107202351
50.3744389299374,11.1828617249652,0.236296095549435
50.3744389299374,11.1900562430675,0.246151156069538
50.3744389299374,11.1972507611697,0.260277674012824
50.3744389299374,11.204445279272,0.259199978263454
50.3744389299374,11.2116397973742,0.259199978263454
50.3744389299374,11.2188343154765,0.259199978263454
50.3744389299374,11.2260288335787,0.259199978263454
50.3744389299374,11.233223351681,0.259199978263454
50.3744389299374,11.2404178697832,0.244898637542479
50.3744389299374,11.2476123878855,0.259199978263454
50.3744389299374,11.2548069059877,0.259199978263454
50.3744389299374,11.26200142409,0.259199978263454
50.37901929948,10.9742207,0.259199978263454
50.37901929948,10.9814152181022,0.259199978263454
50.37901929948,10.9886097362045,0.259199978263454
50.37901929948,10.9958042543067,0.259199978263454
50.37901929948,11.002998772409,0.259199978263454
50.37901929948,11.0101932905112,0.259199978263454
50.37901929948,11.0173878086135,0.259199978263454
50.37901929948,11.0245823267158,0.259199978263454
50.37901929948,11.031776844818,0.259199978263454
50.37901929948,11.0389713629203,0.259199978263454
50.37901929948,11.0461658810225,0.259199978263454
50.37901929948,11.0533603991247,0.259199978263454
50.37901929948,11.060554917227,0.247871967950761
50.37901929948,11.0677494353292,0.234619805402773
50.37901929948,11.0749439534315,0.311334578227962
50.37901929948,11.0821384715337,0.273916392276284
50.37901929948,11.089332989636,0.259199978263454
50.37901929948,11.0965275077382,0.259199978263454
50.37901929948,11.1037220258405,0.259199978263454
50.37901929948,11.1109165439427,0.269306468743877
50.37901929948,11.118111062045,0.259199978263454
50.37901929948,11.1253055801472,0.259199978263454
50.37901929948,11.1325000982495,0.259199978263454
50.37901929948,11.1396946163517,0.259199978263454
50.37901929948,11.146889134454,0.259199978263454
50.37901929948,11.1540836525562,0.259199978263454
50.37901929948,11.1612781706585,0.263364196546771
50.37901929948,11.1684726887607,0.259199978263454
50.37901929948,11.175667206863,0.259199978263454
50.37901929948,11.1828617249652,0.258306270018397
50.37901929948,11.1900562430675,0.296730117231893
50.37901929948,11.1972507611697,0.259199978263454
50.37901929948,11.204445279272,0.259199978263454
50.37901929948,11.2116397973742,0.259199978263454
50.37901929948,11.2188343154765,0.259199978263454
50.37901929948,11.2260288335787,0.259199978263454
50.37901929948,11.233223351681,0.259199978263454
50.37901929948,11.2404178697832,0.259199978263454
50.37901929948,11.2476123878855,0.259199978263454
50.37901929948,11.2548069059877,0.259199978263454
50.37901929948,11.26200142409,0.259199978263454
50.3835996690226,10.9742207,0.259199978263454
50.3835996690226,10.9814152181022,0.259199978263454
50.3835996690226,10.9886097362045,0.259199978263454
50.3835996690226,10.9958042543067,0.337352699386214
50.3835996690226,11.002998772409,0.259199978263454
50.3835996690226,11.0101932905112,0.259199978263454
50.3835996690226,11.0173878086135,0.259199978263454
50.3835996690226,11.0245823267158,0.259199978263454
50.3835996690226,11.031776844818,0.259199978263454
50.3835996690226,11.0389713629203,0.259199978263454
50.3835996690226,11.0461658810225,0.259199978263454
50.3835996690226,11.0533603991247,0.279834727287023
50.3835996690226,11.060554917227,0.201721024796225
50.3835996690226,11.0677494353292,0.249018519534069
50.3835996690226,11.0749439534315,0.259199978263454
50.3835996690226,11.0821384715337,0.259199978263454
50.3835996690226,11.089332989636,0.259199978263454
50.3835996690226,11.0965275077382,0.259199978263454
50.3835996690226,11.1037220258405,0.279056801236055
50.3835996690226,11.1109165439427,0.392188337220476
50.3835996690226,11.118111062045,0.29687005998522
50.3835996690226,11.1253055801472,0.280481695971891
50.3835996690226,11.1325000982495,0.259199978263454
50.3835996690226,11.1396946163517,0.259199978263454
50.3835996690226,11.146889134454,0.259199978263454
50.3835996690226,11.1540836525562,0.259199978263454
50.3835996690226,11.1612781706585,0.259199978263454
50.3835996690226,11.1684726887607,0.259199978263454
50.3835996690226,11.175667206863,0.260110882872455
50.3835996690226,11.1828617249652,0.264174645506543
50.3835996690226,11.1900562430675,0.259199978263454
50.3835996690226,11.1972507611697,0.259199978263454
50.3835996690226,11.204445279272,0.259199978263454
50.3835996690226,11.2116397973742,0.259199978263454
50.3835996690226,11.2188343154765,0.259199978263454
50.3835996690226,11.2260288335787,0.259199978263454
50.3835996690226,11.233223351681,0.259199978263454
50.3835996690226,11.2404178697832,0.259199978263454
50.3835996690226,11.2476123878855,0.259199978263454
50.3835996690226,11.2548069059877,0.259199978263454
50.3835996690226,11.26200142409,0.259199978263454
50.3881800385652,10.9742207,0.259199978263454
50.3881800385652,10.9814152181022,0.259199978263454
50.3881800385652,10.9886097362045,0.259199978263454
50.3881800385652,10.9958042543067,0.307859596050059
50.3881800385652,11.002998772409,0.259199978263454
50.3881800385652,11.0101932905112,0.259199978263454
50.3881800385652,11.0173878086135,0.259199978263454
50.3881800385652,11.0245823267158,0.259199978263454
50.3881800385652,11.031776844818,0.259199978263454
50.3881800385652,11.0389713629203,0.259199978263454
50.3881800385652,11.0461658810225,0.259199978263454
50.3881800385652,11.0533603991247,0.214329757181081
50.3881800385652,11.060554917227,0.271164240946211
50.3881800385652,11.0677494353292,0.259199978263454
50.3881800385652,11.0749439534315,0.259199978263454
50.3881800385652,11.0821384715337,0.259199978263454
50.3881800385652,11.089332989636,0.259199978263454
50.3881800385652,11.0965275077382,0.259199978263454
50.3881800385652,11.1037220258405,0.259199978263454
50.3881800385652,11.1109165439427,0.262734138725842
50.3881800385652,11.118111062045,0.276603560512189
50.3881800385652,11.1253055801472,0.310759437953991
50.3881800385652,11.1325000982495,0.298274197262848
50.3881800385652,11.1396946163517,0.259199978263454
50.3881800385652,11.146889134454,0.259199978263454
50.3881800385652,11.1540836525562,0.259199978263454
50.3881800385652,11.1612781706585,0.259199978263454
50.3881800385652,11.1684726887607,0.259199978263454
50.3881800385652,11.175667206863,0.259199978263454
50.3881800385652,11.1828617249652,0.259199978263454
50.3881800385652,11.1900562430675,0.259199978263454
50.3881800385652,11.1972507611697,0.259199978263454
50.3881800385652,11.204445279272,0.259199978263454
50.3881800385652,11.2116397973742,0.27311517596893
50.3881800385652,11.2188343154765,0.264996369053525
50.3881800385652,11.2260288335787,0.259199978263454
50.3881800385652,11.233223351681,0.259199978263454
50.3881800385652,11.2404178697832,0.259199978263454
50.3881800385652,11.2476123878855,0.259199978263454
50.3881800385652,11.2548069059877,0.259199978263454
50.3881800385652,11.26200142409,0.259199978263454
50.3927604081078,10.9742207,0.290768873777176
50.3927604081078,10.9814152181022,0.259199978263454
50.3927604081078,10.9886097362045,0.298924755606081
50.3927604081078,10.9958042543067,0.306981172319287
50.3927604081078,11.002998772409,0.344705116634432
50.3927604081078,11.0101932905112,0.357464469147031
50.3927604081078,11.0173878086135,0.259199978263454
50.3927604081078,11.0245823267158,0.259199978263454
50.3927604081078,11.031776844818,0.259199978263454
50.3927604081078,11.0389713629203,0.227035586723388
50.3927604081078,11.0461658810225,0.254485833668893
50.3927604081078,11.0533603991247,0.259199978263454
50.3927604081078,11.060554917227,0.259199978263454
50.3927604081078,11.0677494353292,0.259199978263454
50.3927604081078,11.0749439534315,0.259199978263454
50.3927604081078,11.0821384715337,0.259199978263454
50.3927604081078,11.089332989636,0.259199978263454
50.3927604081078,11.0965275077382,0.259199978263454
50.3927604081078,11.1037220258405,0.259199978263454
50.3927604081078,11.1109165439427,0.236404139736433
50.3927604081078,11.118111062045,0.242018763945841
50.3927604081078,11.1253055801472,0.296609277766192
50.3927604081078,11.1325000982495,0.271026141265385
50.3927604081078,11.1396946163517,0.259199978263454
50.3927604081078,11.146889134454,0.259199978263454
50.3927604081078,11.1540836525562,0.259199978263454
50.3927604081078,11.1612781706585,0.259199978263454
50.3927604081078,11.1684726887607,0.259199978263454
50.3927604081078,11.175667206863,0.259199978263454
50.3927604081078,11.1828617249652,0.259199978263454
50.3927604081078,11.1900562430675,0.259199978263454
50.3927604081078,11.1972507611697,0.280836037609267
50.3927604081078,11.204445279272,0.272776336637544
50.3927604081078,11.2116397973742,0.307503509227717
50.3927604081078,11.2188343154765,0.294718945270456
50.3927604081078,11.2260288335787,0.259199978263454
50.3927604081078,11.233223351681,0.240244301305762
50.3927604081078,11.2404178697832,0.256930802624007
50.3927604081078,11.2476123878855,0.259199978263454
50.3927604081078,11.2548069059877,0.259199978263454
50.3927604081078,11.26200142409,0.259199978263454
50.3973407776504,10.9742207,0.278557008096946
50.3973407776504,10.9814152181022,0.259199978263454
50.3973407776504,10.9886097362045,0.262691859069296
50.3973407776504,10.9958042543067,0.324483714786751
50.3973407776504,11.002998772409,0.384748451778878
50.3973407776504,11.0101932905112,0.36640450417582
50.3973407776504,11.0173878086135,0.259199978263454
50.3973407776504,11.0245823267158,0.259199978263454
50.3973407776504,11.031776844818,0.259199978263454
50.3973407776504,11.0389713629203,0.328377424510197
50.3973407776504,11.0461658810225,0.275993173035994
50.3973407776504,11.0533603991247,0.259199978263454
50.3973407776504,11.060554917227,0.259199978263454
50.3973407776504,11.0677494353292,0.259199978263454
50.3973407776504,11.0749439534315,0.259199978263454
50.3973407776504,11.0821384715337,0.259199978263454
50.3973407776504,11.089332989636,0.271069875622767
50.3973407776504,11.0965275077382,0.259199978263454
50.3973407776504,11.1037220258405,0.259199978263454
50.3973407776504,11.1109165439427,0.274932160234934
50.3973407776504,11.118111062045,0.36408912771071
50.3973407776504,11.1253055801472,0.285675992421364
50.3973407776504,11.1325000982495,0.259199978263454
50.3973407776504,11.1396946163517,0.259199978263454
50.3973407776504,11.146889134454,0.259199978263454
50.3973407776504,11.1540836525562,0.259199978263454
50.3973407776504,11.1612781706585,0.259199978263454
50.3973407776504,11.1684726887607,0.259199978263454
50.3973407776504,11.175667206863,0.259199978263454
50.3973407776504,11.1828617249652,0.259199978263454
50.3973407776504,11.1900562430675,0.259199978263454
50.3973407776504,11.1972507611697,0.301209782342234
50.3973407776504,11.204445279272,0.285669324889282
50.3973407776504,11.2116397973742,0.251025932080295
50.3973407776504,11.2188343154765,0.26754142361994
50.3973407776504,11.2260288335787,0.341018049550996
50.3973407776504,11.233223351681,0.236816505236362
50.3973407776504,11.2404178697832,0.233818729198412
50.3973407776504,11.2476123878855,0.259199978263454
50.3973407776504,11.2548069059877,0.259199978263454
50.3973407776504,11.26200142409,0.259199978263454
50.401921147193,10.9742207,0.259199978263454
50.401921147193,10.9814152181022,0.259199978263454
50.401921147193,10.9886097362045,0.266865956417679
50.401921147193,10.9958042543067,0.202332753030464
50.401921147193,11.002998772409,0.310104773800039
50.401921147193,11.0101932905112,0.259199978263454
50.401921147193,11.0173878086135,0.259199978263454
50.401921147193,11.0245823267158,0.259199978263454
50.401921147193,11.031776844818,0.259199978263454
50.401921147193,11.0389713629203,0.275919056147583
50.401921147193,11.0461658810225,0.260748056719557
50.401921147193,11.0533603991247,0.259199978263454
50.401921147193,11.060554917227,0.259199978263454
50.401921147193,11.0677494353292,0.259199978263454
50.401921147193,11.0749439534315,0.259199978263454
50.401921147193,11.0821384715337,0.259199978263454
50.401921147193,11.089332989636,0.298183401652975
50.401921147193,11.0965275077382,0.259199978263454
50.401921147193,11.1037220258405,0.259199978263454
50.401921147193,11.1109165439427,0.259652146820407
50.401921147193,11.118111062045,0.291069437369747
50.401921147193,11.1253055801472,0.259199978263454
50.401921147193,11.1325000982495,0.259199978263454
50.401921147193,11.1396946163517,0.259199978263454
50.401921147193,11.146889134454,0.259199978263454
50.401921147193,11.1540836525562,0.259199978263454
50.401921147193,11.1612781706585,0.259199978263454
50.401921147193,11.1684726887607,0.259199978263454
50.401921147193,11.175667206863,0.259199978263454
50.401921147193,11.1828617249652,0.259199978263454
50.401921147193,11.1900562430675,0.259199978263454
50.401921147193,11.1972507611697,0.281177337023513
50.401921147193,11.204445279272,0.269701851440225
50.401921147193,11.2116397973742,0.249182858115055
50.401921147193,11.2188343154765,0.248189033235423
50.401921147193,11.2260288335787,0.260309716769464
50.401921147193,11.233223351681,0.259199978263454
50.401921147193,11.2404178697832,0.259199978263454
50.401921147193,11.2476123878855,0.259199978263454
50.401921147193,11.2548069059877,0.259199978263454
50.4065015167357,10.9742207,0.2703680256978
50.4065015167357,10.9814152181022,0.278623895386284
50.4065015167357,10.9886097362045,0.259199978263454
50.4065015167357,10.9958042543067,0.259199978263454
50.4065015167357,11.002998772409,0.259199978263454
50.4065015167357,11.0101932905112,0.259199978263454
50.4065015167357,11.0173878086135,0.259199978263454
50.4065015167357,11.0245823267158,0.259199978263454
50.4065015167357,11.031776844818,0.259199978263454
50.4065015167357,11.0389713629203,0.254120631519658
50.4065015167357,11.0461658810225,0.259199978263454
50.4065015167357,11.0533603991247,0.259199978263454
50.4065015167357,11.060554917227,0.259199978263454
50.4065015167357,11.0677494353292,0.259199978263454
50.4065015167357,11.0749439534315,0.259113219704513
50.4065015167357,11.0821384715337,0.259199978263454
50.4065015167357,11.089332989636,0.259199978263454
50.4065015167357,11.0965275077382,0.259199978263454
50.4065015167357,11.1037220258405,0.259199978263454
50.4065015167357,11.1109165439427,0.261901513068027
50.4065015167357,11.118111062045,0.309465544286624
50.4065015167357,11.1253055801472,0.259199978263454
50.4065015167357,11.1325000982495,0.259199978263454
50.4065015167357,11.1396946163517,0.259199978263454
50.4065015167357,11.146889134454,0.259199978263454
50.4065015167357,11.1540836525562,0.259199978263454
50.4065015167357,11.1612781706585,0.259199978263454
50.4065015167357,11.1684726887607,0.259199978263454
50.4065015167357,11.175667206863,0.259199978263454
50.4065015167357,11.1828617249652,0.259199978263454
50.4065015167357,11.1900562430675,0.259199978263454
50.4065015167357,11.1972507611697,0.259199978263454
50.4065015167357,11.204445279272,0.259199978263454
50.4065015167357,11.2116397973742,0.259199978263454
50.4065015167357,11.2188343154765,0.259199978263454
50.4065015167357,11.2260288335787,0.259199978263454
50.4065015167357,11.233223351681,0.259199978263454
50.4065015167357,11.2404178697832,0.259199978263454
50.4065015167357,11.2476123878855,0.259199978263454
50.4065015167357,11.2548069059877,0.259199978263454
50.4110818862783,10.9742207,0.287083531608611
50.4110818862783,10.9814152181022,0.296727258531173
50.4110818862783,10.9886097362045,0.259199978263454
50.4110818862783,10.9958042543067,0.259199978263454
50.4110818862783,11.002998772409,0.259199978263454
50.4110818862783,11.0101932905112,0.259199978263454
50.4110818862783,11.0173878086135,0.259199978263454
50.4110818862783,11.0245823267158,0.259199978263454
50.4110818862783,11.031776844818,0.259199978263454
50.4110818862783,11.0389713629203,0.243660223280267
50.4110818862783,11.0461658810225,0.242639774051078
50.4110818862783,11.0533603991247,0.260141542431498
50.4110818862783,11.060554917227,0.262255654733057
50.4110818862783,11.0677494353292,0.258257091801246
50.4110818862783,11.0749439534315,0.257565104259014
50.4110818862783,11.0821384715337,0.259199978263454
50.4110818862783,11.089332989636,0.259199978263454
50.4110818862783,11.0965275077382,0.259199978263454
50.4110818862783,11.1037220258405,0.259199978263454
50.4110818862783,11.1109165439427,0.339628720741416
50.4110818862783,11.118111062045,0.38046921488138
50.4110818862783,11.1253055801472,0.259199978263454
50.4110818862783,11.1325000982495,0.259199978263454
50.4110818862783,11.1396946163517,0.259199978263454
50.4110818862783,11.146889134454,0.259199978263454
50.4110818862783,11.1540836525562,0.259199978263454
50.4110818862783,11.1612781706585,0.259199978263454
50.4110818862783,11.1684726887607,0.259199978263454
50.4110818862783,11.175667206863,0.259199978263454
50.4110818862783,11.1828617249652,0.259199978263454
50.4110818862783,11.1900562430675,0.259199978263454
50.4110818862783,11.1972507611697,0.259199978263454
50.4110818862783,11.204445279272,0.259199978263454
50.4110818862783,11.2116397973742,0.259199978263454
50.4110818862783,11.2188343154765,0.259199978263454
50.4110818862783,11.2260288335787,0.259199978263454
50.4110818862783,11.233223351681,0.259199978263454
50.4110818862783,11.2404178697832,0.259199978263454
50.4110818862783,11.2476123878855,0.259199978263454
50.4110818862783,11.2548069059877,0.259199978263454
50.4110818862783,11.26200142409,0.259199978263454
50.4156622558209,10.9742207,0.259199978263454
50.4156622558209,10.9814152181022,0.259199978263454
50.4156622558209,10.9886097362045,0.259199978263454
50.4156622558209,10.9958042543067,0.259199978263454
50.4156622558209,11.002998772409,0.259199978263454
50.4156622558209,11.0101932905112,0.269609221387993
50.4156622558209,11.0173878086135,0.286924112703197
50.4156622558209,11.0245823267158,0.259199978263454
50.4156622558209,11.031776844818,0.281710143611615
50.4156622558209,11.0389713629203,0.364381481167234
50.4156622558209,11.0461658810225,0.346908095407291
50.4156622558209,11.0533603991247,0.300015144546118
50.4156622558209,11.060554917227,0.262320684771878
50.4156622558209,11.0677494353292,0.259199978263454
50.4156622558209,11.0749439534315,0.259199978263454
50.4156622558209,11.0821384715337,0.259199978263454
50.4156622558209,11.089332989636,0.259199978263454
50.4156622558209,11.0965275077382,0.259199978263454
50.4156622558209,11.1037220258405,0.259199978263454
50.4156622558209,11.1109165439427,0.346652872183327
50.4156622558209,11.118111062045,0.293377568567946
50.4156622558209,11.1253055801472,0.259199978263454
50.4156622558209,11.1325000982495,0.239537799148723
50.4156622558209,11.1396946163517,0.259199978263454
50.4156622558209,11.146889134454,0.259199978263454
50.4156622558209,11.1540836525562,0.259199978263454
50.4156622558209,11.1612781706585,0.259199978263454
50.4156622558209,11.1684726887607,0.259199978263454
50.4156622558209,11.175667206863,0.259199978263454
50.4156622558209,11.1828617249652,0.259199978263454
50.4156622558209,11.1900562430675,0.259199978263454
50.4156622558209,11.1972507611697,0.259199978263454
50.4156622558209,11.204445279272,0.259199978263454
50.4156622558209,11.2116397973742,0.259199978263454
50.4156622558209,11.2188343154765,0.259199978263454
50.4156622558209,11.2260288335787,0.259199978263454
50.4156622558209,11.233223351681,0.259199978263454
50.4156622558209,11.2404178697832,0.259199978263454
50.4156622558209,11.2476123878855,0.259199978263454
50.4156622558209,11.2548069059877,0.259199978263454
50.4156622558209,11.26200142409,0.259199978263454
50.4202426253635,10.9742207,0.259199978263454
50.4202426253635,10.9814152181022,0.259199978263454
50.4202426253635,10.9886097362045,0.259199978263454
50.4202426253635,10.9958042543067,0.259199978263454
50.4202426253635,11.002998772409,0.259199978263454
50.4202426253635,11.0101932905112,0.259199978263454
50.4202426253635,11.0173878086135,0.271100185786437
50.4202426253635,11.0245823267158,0.259199978263454
50.4202426253635,11.031776844818,0.259995574244837
50.4202426253635,11.0389713629203,0.291385019573482
50.4202426253635,11.0461658810225,0.321497963920949
50.4202426253635,11.0533603991247,0.357677256494631
50.4202426253635,11.060554917227,0.259848602527113
50.4202426253635,11.0677494353292,0.259199978263454
50.4202426253635,11.0749439534315,0.259199978263454
50.4202426253635,11.0821384715337,0.259199978263454
50.4202426253635,11.089332989636,0.259199978263454
50.4202426253635,11.0965275077382,0.259199978263454
50.4202426253635,11.1037220258405,0.259199978263454
50.4202426253635,11.1109165439427,0.282254840897429
50.4202426253635,11.118111062045,0.259199978263454
50.4202426253635,11.1253055801472,0.259199978263454
50.4202426253635,11.1325000982495,0.245155694329819
50.4202426253635,11.1396946163517,0.259199978263454
50.4202426253635,11.146889134454,0.259199978263454
50.4202426253635,11.1540836525562,0.259199978263454
50.4202426253635,11.1612781706585,0.249974628669049
50.4202426253635,11.1684726887607,0.227667260784213
50.4202426253635,11.175667206863,0.259199978263454
50.4202426253635,11.1828617249652,0.259199978263454
50.4202426253635,11.1900562430675,0.259199978263454
50.4202426253635,11.1972507611697,0.259199978263454
50.4202426253635,11.204445279272,0.259199978263454
50.4202426253635,11.2116397973742,0.259199978263454
50.4202426253635,11.2188343154765,0.259199978263454
50.4202426253635,11.2260288335787,0.259199978263454
50.4202426253635,11.233223351681,0.259199978263454
50.4202426253635,11.2404178697832,0.259199978263454
50.4202426253635,11.2476123878855,0.259199978263454
50.4202426253635,11.2548069059877,0.259199978263454
50.4202426253635,11.26200142409,0.259199978263454
50.4248229949061,10.9742207,0.259199978263454
50.4248229949061,10.9814152181022,0.259199978263454
50.4248229949061,10.9886097362045,0.259199978263454
50.4248229949061,10.9958042543067,0.259199978263454
50.4248229949061,11.002998772409,0.259199978263454
50.4248229949061,11.0101932905112,0.259199978263454
50.4248229949061,11.0173878086135,0.259199978263454
50.4248229949061,11.0245823267158,0.259199978263454
50.4248229949061,11.031776844818,0.262423684283707
50.4248229949061,11.0389713629203,0.338457900821837
50.4248229949061,11.0461658810225,0.285953178543175
50.4248229949061,11.0533603991247,0.266291857736208
50.4248229949061,11.060554917227,0.259199978263454
50.4248229949061,11.0677494353292,0.259199978263454
50.4248229949061,11.0749439534315,0.259199978263454
50.4248229949061,11.0821384715337,0.259199978263454
50.4248229949061,11.089332989636,0.259199978263454
50.4248229949061,11.0965275077382,0.259199978263454
50.4248229949061,11.1037220258405,0.259199978263454
50.4248229949061,11.1109165439427,0.259199978263454
50.4248229949061,11.118111062045,0.259199978263454
50.4248229949061,11.1253055801472,0.259199978263454
50.4248229949061,11.1325000982495,0.282886193676102
50.4248229949061,11.1396946163517,0.276591941004462
50.4248229949061,11.146889134454,0.259199978263454
50.4248229949061,11.1540836525562,0.259199978263454
50.4248229949061,11.1612781706585,0.224706817501213
50.4248229949061,11.1684726887607,0.218032597208123
50.4248229949061,11.175667206863,0.259199978263454
50.4248229949061,11.1828617249652,0.259199978263454
50.4248229949061,11.1900562430675,0.259199978263454
50.4248229949061,11.1972507611697,0.259199978263454
50.4248229949061,11.204445279272,0.259199978263454
50.4248229949061,11.2116397973742,0.259199978263454
50.4248229949061,11.2188343154765,0.259199978263454
50.4248229949061,11.2260288335787,0.259199978263454
50.4248229949061,11.233223351681,0.259199978263454
50.4248229949061,11.2404178697832,0.259199978263454
50.4248229949061,11.2476123878855,0.259199978263454
50.4248229949061,11.2548069059877,0.259199978263454
50.4248229949061,11.26200142409,0.259199978263454
50.4294033644487,10.9814152181022,0.259199978263454
50.4294033644487,10.9886097362045,0.259199978263454
50.4294033644487,10.9958042543067,0.259199978263454
50.4294033644487,11.002998772409,0.259199978263454
50.4294033644487,11.0101932905112,0.259199978263454
50.4294033644487,11.0173878086135,0.259199978263454
50.4294033644487,11.0245823267158,0.280112200266791
50.4294033644487,11.031776844818,0.259199978263454
50.4294033644487,11.0389713629203,0.302693601890164
50.4294033644487,11.0461658810225,0.259199978263454
50.4294033644487,11.0533603991247,0.259199978263454
50.4294033644487,11.060554917227,0.259199978263454
50.4294033644487,11.0677494353292,0.259199978263454
50.4294033644487,11.0749439534315,0.259199978263454
50.4294033644487,11.0821384715337,0.259199978263454
50.4294033644487,11.089332989636,0.259199978263454
50.4294033644487,11.0965275077382,0.259199978263454
50.4294033644487,11.1037220258405,0.259199978263454
50.4294033644487,11.1109165439427,0.259199978263454
50.4294033644487,11.118111062045,0.259199978263454
50.4294033644487,11.1253055801472,0.259199978263454
50.4294033644487,11.1325000982495,0.26840698125675
50.4294033644487,11.1396946163517,0.264010567650757
50.4294033644487,11.146889134454,0.270550394470754
50.4294033644487,11.1540836525562,0.347660934215149
50.4294033644487,11.1612781706585,0.3395887280372
50.4294033644487,11.1684726887607,0.259199978263454
50.4294033644487,11.175667206863,0.259199978263454
50.4294033644487,11.1828617249652,0.259199978263454
50.4294033644487,11.1900562430675,0.259199978263454
50.4294033644487,11.1972507611697,0.259199978263454
50.4294033644487,11.204445279272,0.259199978263454
50.4294033644487,11.2116397973742,0.259199978263454
50.4294033644487,11.2188343154765,0.259199978263454
50.4294033644487,11.2260288335787,0.259199978263454
50.4294033644487,11.233223351681,0.259199978263454
50.4294033644487,11.2404178697832,0.259199978263454
50.4294033644487,11.2476123878855,0.259199978263454
50.4294033644487,11.2548069059877,0.259199978263454
50.4294033644487,11.26200142409,0.259199978263454
50.4339837339913,10.9958042543067,0.259199978263454
50.4339837339913,11.002998772409,0.259199978263454
50.4339837339913,11.0101932905112,0.259199978263454
50.4339837339913,11.0173878086135,0.259199978263454
50.4339837339913,11.0245823267158,0.332578658799816
50.4339837339913,11.031776844818,0.274487823105512
50.4339837339913,11.0389713629203,0.259199978263454
50.4339837339913,11.0461658810225,0.259199978263454
50.4339837339913,11.0533603991247,0.259199978263454
50.4339837339913,11.060554917227,0.259199978263454
50.4339837339913,11.0677494353292,0.259199978263454
50.4339837339913,11.0749439534315,0.259199978263454
50.4339837339913,11.0821384715337,0.259199978263454
50.4339837339913,11.089332989636,0.259199978263454
50.4339837339913,11.0965275077382,0.259199978263454
50.4339837339913,11.1037220258405,0.259199978263454
50.4339837339913,11.1109165439427,0.259199978263454
50.4339837339913,11.118111062045,0.259199978263454
50.4339837339913,11.1253055801472,0.259199978263454
50.4339837339913,11.1325000982495,0.259199978263454
50.4339837339913,11.1396946163517,0.286706220361656
50.4339837339913,11.146889134454,0.305969136917468
50.4339837339913,11.1540836525562,0.435095612862944
50.4339837339913,11.1612781706585,0.348651359739903
50.4339837339913,11.1684726887607,0.259199978263454
50.4339837339913,11.175667206863,0.259199978263454
50.4339837339913,11.1828617249652,0.259199978263454
50.4339837339913,11.1900562430675,0.259199978263454
50.4339837339913,11.1972507611697,0.259199978263454
50.4339837339913,11.204445279272,0.259199978263454
50.4339837339913,11.2116397973742,0.259199978263454
50.4339837339913,11.2188343154765,0.259199978263454
50.4339837339913,11.2260288335787,0.259199978263454
50.4339837339913,11.233223351681,0.259199978263454
50.4339837339913,11.2404178697832,0.244795852976316
50.4339837339913,11.2476123878855,0.259199978263454
50.4339837339913,11.2548069059877,0.259199978263454
50.4339837339913,11.26200142409,0.259199978263454
50.4385641035339,10.9958042543067,0.259199978263454
50.4385641035339,11.002998772409,0.259199978263454
50.4385641035339,11.0101932905112,0.259199978263454
50.4385641035339,11.0173878086135,0.259199978263454
50.4385641035339,11.0245823267158,0.259199978263454
50.4385641035339,11.031776844818,0.259199978263454
50.4385641035339,11.0389713629203,0.259199978263454
50.4385641035339,11.0461658810225,0.259199978263454
50.4385641035339,11.0533603991247,0.259199978263454
50.4385641035339,11.060554917227,0.259199978263454
50.4385641035339,11.0677494353292,0.259199978263454
50.4385641035339,11.0749439534315,0.259199978263454
50.4385641035339,11.0821384715337,0.259199978263454
50.4385641035339,11.089332989636,0.259199978263454
50.4385641035339,11.0965275077382,0.259199978263454
50.4385641035339,11.1037220258405,0.259199978263454
50.4385641035339,11.1109165439427,0.259199978263454
50.4385641035339,11.118111062045,0.259199978263454
50.4385641035339,11.1253055801472,0.259199978263454
50.4385641035339,11.1325000982495,0.259199978263454
50.4385641035339,11.1396946163517,0.29144280120118
50.4385641035339,11.146889134454,0.269462435173948
50.4385641035339,11.1540836525562,0.318691875215796
50.4385641035339,11.1612781706585,0.239683622544187
50.4385641035339,11.1684726887607,0.246580603065867
50.4385641035339,11.175667206863,0.259199978263454
50.4385641035339,11.1828617249652,0.259199978263454
50.4385641035339,11.1900562430675,0.259199978263454
50.4385641035339,11.1972507611697,0.259199978263454
50.4385641035339,11.204445279272,0.259199978263454
50.4385641035339,11.2116397973742,0.259199978263454
50.4385641035339,11.2188343154765,0.259199978263454
50.4385641035339,11.2260288335787,0.259199978263454
50.4385641035339,11.233223351681,0.266113203960588
50.4385641035339,11.2404178697832,0.259747550952003
50.4385641035339,11.2476123878855,0.259199978263454
50.4385641035339,11.2548069059877,0.259199978263454
50.4385641035339,11.26200142409,0.259199978263454
50.4431444730765,11.002998772409,0.27309842554171
50.4431444730765,11.0101932905112,0.259199978263454
50.4431444730765,11.0173878086135,0.259199978263454
50.4431444730765,11.0245823267158,0.259199978263454
50.4431444730765,11.031776844818,0.259199978263454
50.4431444730765,11.0389713629203,0.259199978263454
50.4431444730765,11.0461658810225,0.259199978263454
50.4431444730765,11.0533603991247,0.259199978263454
50.4431444730765,11.060554917227,0.259199978263454
50.4431444730765,11.0677494353292,0.259199978263454
50.4431444730765,11.0749439534315,0.259199978263454
50.4431444730765,11.0821384715337,0.259199978263454
50.4431444730765,11.089332989636,0.259199978263454
50.4431444730765,11.0965275077382,0.259199978263454
50.4431444730765,11.1037220258405,0.259199978263454
50.4431444730765,11.1109165439427,0.259199978263454
50.4431444730765,11.118111062045,0.259199978263454
50.4431444730765,11.1253055801472,0.259199978263454
50.4431444730765,11.1325000982495,0.259199978263454
50.4431444730765,11.1396946163517,0.259199978263454
50.4431444730765,11.146889134454,0.262475119778156
50.4431444730765,11.1540836525562,0.259492697718866
50.4431444730765,11.1612781706585,0.259199978263454
50.4431444730765,11.1684726887607,0.259199978263454
50.4431444730765,11.175667206863,0.236005259861917
50.4431444730765,11.1828617249652,0.191076396774805
50.4431444730765,11.1900562430675,0.259199978263454
50.4431444730765,11.1972507611697,0.259199978263454
50.4431444730765,11.204445279272,0.259199978263454
50.4431444730765,11.2116397973742,0.259199978263454
50.4431444730765,11.2188343154765,0.259199978263454
50.4431444730765,11.2260288335787,0.259199978263454
50.4431444730765,11.233223351681,0.259199978263454
50.4431444730765,11.2404178697832,0.259199978263454
50.4431444730765,11.2476123878855,0.259199978263454
50.4431444730765,11.2548069059877,0.259199978263454
50.4431444730765,11.26200142409,0.259199978263454
50.4477248426191,11.0101932905112,0.267341112283702
50.4477248426191,11.0173878086135,0.259199978263454
50.4477248426191,11.0245823267158,0.259199978263454
50.4477248426191,11.031776844818,0.259199978263454
50.4477248426191,11.0389713629203,0.259199978263454
50.4477248426191,11.0461658810225,0.259199978263454
50.4477248426191,11.0533603991247,0.259199978263454
50.4477248426191,11.060554917227,0.259199978263454
50.4477248426191,11.0677494353292,0.259199978263454
50.4477248426191,11.0749439534315,0.259199978263454
50.4477248426191,11.0821384715337,0.259199978263454
50.4477248426191,11.089332989636,0.259199978263454
50.4477248426191,11.0965275077382,0.259199978263454
50.4477248426191,11.1037220258405,0.259199978263454
50.4477248426191,11.1109165439427,0.259199978263454
50.4477248426191,11.118111062045,0.259199978263454
50.4477248426191,11.1253055801472,0.259199978263454
50.4477248426191,11.1325000982495,0.259199978263454
50.4477248426191,11.1396946163517,0.259199978263454
50.4477248426191,11.146889134454,0.259199978263454
50.4477248426191,11.1540836525562,0.259199978263454
50.4477248426191,11.1612781706585,0.259199978263454
50.4477248426191,11.1684726887607,0.259199978263454
50.4477248426191,11.175667206863,0.260890061669731
50.4477248426191,11.1828617249652,0.295231091252994
50.4477248426191,11.1900562430675,0.259199978263454
50.4477248426191,11.1972507611697,0.25746271764965
50.4477248426191,11.204445279272,0.259199978263454
50.4477248426191,11.2116397973742,0.259199978263454
50.4477248426191,11.2188343154765,0.259199978263454
50.4477248426191,11.2260288335787,0.259199978263454
50.4477248426191,11.233223351681,0.259199978263454
50.4477248426191,11.2404178697832,0.259199978263454
50.4477248426191,11.2476123878855,0.259199978263454
50.4523052121617,11.0173878086135,0.259199978263454
50.4523052121617,11.0245823267158,0.259199978263454
50.4523052121617,11.031776844818,0.259199978263454
50.4523052121617,11.0389713629203,0.259199978263454
50.4523052121617,11.0461658810225,0.259199978263454
50.4523052121617,11.0533603991247,0.259199978263454
50.4523052121617,11.060554917227,0.259199978263454
50.4523052121617,11.0677494353292,0.259199978263454
50.4523052121617,11.0749439534315,0.259199978263454
50.4523052121617,11.0821384715337,0.259199978263454
50.4523052121617,11.089332989636,0.259199978263454
50.4523052121617,11.0965275077382,0.259199978263454
50.4523052121617,11.1037220258405,0.259199978263454
50.4523052121617,11.1109165439427,0.259199978263454
50.4523052121617,11.118111062045,0.259199978263454
50.4523052121617,11.1253055801472,0.259199978263454
50.4523052121617,11.1325000982495,0.259199978263454
50.4523052121617,11.1396946163517,0.259199978263454
50.4523052121617,11.146889134454,0.259199978263454
50.4523052121617,11.1540836525562,0.259199978263454
50.4523052121617,11.1612781706585,0.268044000293172
50.4523052121617,11.1684726887607,0.291544500433532
50.4523052121617,11.175667206863,0.259199978263454
50.4523052121617,11.1828617249652,0.279420461281414
50.4523052121617,11.1900562430675,0.231462001868083
50.4523052121617,11.1972507611697,0.202994038775743
50.4523052121617,11.204445279272,0.259199978263454
50.4523052121617,11.2116397973742,0.259199978263454
50.4523052121617,11.2188343154765,0.259199978263454
50.4523052121617,11.2260288335787,0.259199978263454
50.4523052121617,11.233223351681,0.259199978263454
50.4523052121617,11.2404178697832,0.259199978263454
50.4523052121617,11.2476123878855,0.259199978263454
50.4568855817043,11.0245823267158,0.259199978263454
50.4568855817043,11.031776844818,0.259199978263454
50.4568855817043,11.0389713629203,0.259199978263454
50.4568855817043,11.0461658810225,0.259199978263454
50.4568855817043,11.0533603991247,0.259199978263454
50.4568855817043,11.060554917227,0.259199978263454
50.4568855817043,11.0677494353292,0.259199978263454
50.4568855817043,11.0749439534315,0.259199978263454
50.4568855817043,11.0821384715337,0.259199978263454
50.4568855817043,11.089332989636,0.273801887223358
50.4568855817043,11.0965275077382,0.317259622809628
50.4568855817043,11.1037220258405,0.259199978263454
50.4568855817043,11.1109165439427,0.259199978263454
50.4568855817043,11.118111062045,0.259199978263454
50.4568855817043,11.1253055801472,0.259199978263454
50.4568855817043,11.1325000982495,0.259199978263454
50.4568855817043,11.1396946163517,0.259199978263454
50.4568855817043,11.146889134454,0.259199978263454
50.4568855817043,11.1540836525562,0.259199978263454
50.4568855817043,11.1612781706585,0.259202181434763
50.4568855817043,11.1684726887607,0.277135944275304
50.4568855817043,11.175667206863,0.259199978263454
50.4568855817043,11.1828617249652,0.259199978263454
50.4568855817043,11.1900562430675,0.259199978263454
50.4568855817043,11.1972507611697,0.25755839296706
50.4568855817043,11.204445279272,0.259199978263454
50.4568855817043,11.2116397973742,0.259199978263454
50.4568855817043,11.2188343154765,0.259199978263454
50.4568855817043,11.2260288335787,0.259199978263454
50.4568855817043,11.233223351681,0.259199978263454
50.4568855817043,11.2404178697832,0.259199978263454
50.4568855817043,11.2476123878855,0.259199978263454
50.461465951247,11.031776844818,0.259199978263454
50.461465951247,11.0389713629203,0.259199978263454
50.461465951247,11.0461658810225,0.259199978263454
50.461465951247,11.0533603991247,0.259199978263454
50.461465951247,11.060554917227,0.267173299618532
50.461465951247,11.0677494353292,0.301785388391185
50.461465951247,11.0749439534315,0.259199978263454
50.461465951247,11.0821384715337,0.274035737932333
50.461465951247,11.089332989636,0.259199978263454
50.461465951247,11.0965275077382,0.261574597591248
50.461465951247,11.1037220258405,0.259199978263454
50.461465951247,11.1109165439427,0.259199978263454
50.461465951247,11.118111062045,0.259199978263454
50.461465951247,11.1253055801472,0.259199978263454
50.461465951247,11.1325000982495,0.259199978263454
50.461465951247,11.1396946163517,0.259199978263454
50.461465951247,11.146889134454,0.259199978263454
50.461465951247,11.1540836525562,0.259199978263454
50.461465951247,11.1612781706585,0.259199978263454
50.461465951247,11.1684726887607,0.259199978263454
50.461465951247,11.175667206863,0.259199978263454
50.461465951247,11.1828617249652,0.259199978263454
50.461465951247,11.1900562430675,0.259199978263454
50.461465951247,11.1972507611697,0.259199978263454
50.461465951247,11.204445279272,0.259199978263454
50.461465951247,11.2116397973742,0.259199978263454
50.461465951247,11.2188343154765,0.259199978263454
50.461465951247,11.2260288335787,0.259199978263454
50.461465951247,11.233223351681,0.259199978263454
50.461465951247,11.2404178697832,0.259199978263454
50.461465951247,11.2476123878855,0.259199978263454
50.4660463207896,11.0461658810225,0.296288729839793
50.4660463207896,11.0533603991247,0.259199978263454
50.4660463207896,11.060554917227,0.259199978263454
50.4660463207896,11.0677494353292,0.25980965101433
50.4660463207896,11.0749439534315,0.293754342731383
50.4660463207896,11.0821384715337,0.38520161156121
50.4660463207896,11.089332989636,0.259930421295335
50.4660463207896,11.0965275077382,0.259199978263454
50.4660463207896,11.1037220258405,0.259199978263454
50.4660463207896,11.1109165439427,0.259199978263454
50.4660463207896,11.118111062045,0.259199978263454
50.4660463207896,11.1253055801472,0.259199978263454
50.4660463207896,11.1325000982495,0.259199978263454
50.4660463207896,11.1396946163517,0.259199978263454
50.4660463207896,11.146889134454,0.259199978263454
50.4660463207896,11.1540836525562,0.255888312391392
50.4660463207896,11.1612781706585,0.241474448740571
50.4660463207896,11.1684726887607,0.259199978263454
50.4660463207896,11.175667206863,0.259199978263454
50.4660463207896,11.1828617249652,0.259199978263454
50.4660463207896,11.1900562430675,0.259199978263454
50.4660463207896,11.1972507611697,0.259199978263454
50.4660463207896,11.204445279272,0.259199978263454
50.4660463207896,11.2116397973742,0.259199978263454
50.4660463207896,11.2188343154765,0.259199978263454
50.4660463207896,11.2260288335787,0.259199978263454
50.4660463207896,11.233223351681,0.259199978263454
50.4660463207896,11.2404178697832,0.259199978263454
50.4660463207896,11.2476123878855,0.259199978263454
50.4706266903322,11.0389713629203,0.276614853430764
50.4706266903322,11.0461658810225,0.298858974673956
50.4706266903322,11.0533603991247,0.263328329653783
50.4706266903322,11.060554917227,0.261051894251641
50.4706266903322,11.0677494353292,0.259199978263454
50.4706266903322,11.0749439534315,0.259199978263454
50.4706266903322,11.0821384715337,0.25976229812226
50.4706266903322,11.089332989636,0.224510696351745
50.4706266903322,11.0965275077382,0.259199978263454
50.4706266903322,11.1037220258405,0.259199978263454
50.4706266903322,11.1109165439427,0.259199978263454
50.4706266903322,11.118111062045,0.259199978263454
50.4706266903322,11.1253055801472,0.259199978263454
50.4706266903322,11.1325000982495,0.259199978263454
50.4706266903322,11.1396946163517,0.259199978263454
50.4706266903322,11.146889134454,0.271838120109891
50.4706266903322,11.1540836525562,0.276511367805324
50.4706266903322,11.1612781706585,0.273519325458135
50.4706266903322,11.1684726887607,0.257923273975505
50.4706266903322,11.175667206863,0.259155672114799
50.4706266903322,11.1828617249652,0.259199978263454
50.4706266903322,11.1900562430675,0.259199978263454
50.4706266903322,11.1972507611697,0.259199978263454
50.4706266903322,11.204445279272,0.259199978263454
50.4706266903322,11.2116397973742,0.259199978263454
50.4706266903322,11.2188343154765,0.259199978263454
50.4706266903322,11.2260288335787,0.295342335736893
50.4706266903322,11.233223351681,0.259199978263454
50.4706266903322,11.2404178697832,0.259199978263454
50.4752070598748,11.0245823267158,0.259199978263454
50.4752070598748,11.031776844818,0.259199978263454
50.4752070598748,11.0389713629203,0.259199978263454
50.4752070598748,11.0461658810225,0.259199978263454
50.4752070598748,11.0533603991247,0.25301683707871
50.4752070598748,11.060554917227,0.259199978263454
50.4752070598748,11.0677494353292,0.322368230891559
50.4752070598748,11.0749439534315,0.285884290623109
50.4752070598748,11.0821384715337,0.262449678504688
50.4752070598748,11.089332989636,0.264710156899488
50.4752070598748,11.0965275077382,0.259199978263454
50.4752070598748,11.1037220258405,0.259199978263454
50.4752070598748,11.1109165439427,0.259199978263454
50.4752070598748,11.118111062045,0.259199978263454
50.4752070598748,11.1253055801472,0.259199978263454
50.4752070598748,11.1325000982495,0.259199978263454
50.4752070598748,11.1396946163517,0.287743171499908
50.4752070598748,11.146889134454,0.350696550752883
50.4752070598748,11.1540836525562,0.271662544073994
50.4752070598748,11.1612781706585,0.313618732087909
50.4752070598748,11.1684726887607,0.257583391491161
50.4752070598748,11.175667206863,0.244526077395511
50.4752070598748,11.1828617249652,0.259199978263454
50.4752070598748,11.1900562430675,0.259199978263454
50.4752070598748,11.1972507611697,0.259199978263454
50.4752070598748,11.204445279272,0.259199978263454
50.4752070598748,11.2116397973742,0.259199978263454
50.4752070598748,11.2188343154765,0.270267899450396
50.4752070598748,11.2260288335787,0.328179666185819
50.4752070598748,11.233223351681,0.259199978263454
50.4752070598748,11.2404178697832,0.259199978263454
50.4797874294174,10.9886097362045,0.259199978263454
50.4797874294174,10.9958042543067,0.259199978263454
50.4797874294174,11.002998772409,0.259199978263454
50.4797874294174,11.0101932905112,0.259199978263454
50.4797874294174,11.0173878086135,0.259199978263454
50.4797874294174,11.0245823267158,0.259199978263454
50.4797874294174,11.031776844818,0.259199978263454
50.4797874294174,11.0389713629203,0.259199978263454
50.4797874294174,11.0461658810225,0.259199978263454
50.4797874294174,11.0533603991247,0.259199978263454
50.4797874294174,11.060554917227,0.259199978263454
50.4797874294174,11.0677494353292,0.269695646504196
50.4797874294174,11.0749439534315,0.259224755287715
50.4797874294174,11.0821384715337,0.259199978263454
50.4797874294174,11.089332989636,0.259199978263454
50.4797874294174,11.0965275077382,0.259199978263454
50.4797874294174,11.1037220258405,0.259199978263454
50.4797874294174,11.1109165439427,0.259199978263454
50.4797874294174,11.118111062045,0.259199978263454
50.4797874294174,11.1253055801472,0.259199978263454
50.4797874294174,11.1325000982495,0.259199978263454
50.4797874294174,11.1396946163517,0.259199978263454
50.4797874294174,11.146889134454,0.259199978263454
50.4797874294174,11.1540836525562,0.2663571268728
50.4797874294174,11.1612781706585,0.453156498982443
50.4797874294174,11.1684726887607,0.323300327734193
50.4797874294174,11.175667206863,0.259199978263454
50.4797874294174,11.1828617249652,0.259199978263454
50.4797874294174,11.1900562430675,0.259199978263454
50.4797874294174,11.1972507611697,0.259199978263454
50.4797874294174,11.204445279272,0.259199978263454
50.4797874294174,11.2116397973742,0.259199978263454
50.4797874294174,11.2188343154765,0.259199978263454
50.4797874294174,11.2260288335787,0.26162557648168
50.4797874294174,11.233223351681,0.259199978263454
50.4797874294174,11.2404178697832,0.259199978263454
50.4797874294174,11.2476123878855,0.259199978263454
50.48436779896,10.9886097362045,0.259199978263454
50.48436779896,10.9958042543067,0.259199978263454
50.48436779896,11.002998772409,0.259199978263454
50.48436779896,11.0101932905112,0.259199978263454
50.48436779896,11.0173878086135,0.259199978263454
50.48436779896,11.0245823267158,0.259199978263454
50.48436779896,11.031776844818,0.259199978263454
50.48436779896,11.0389713629203,0.259199978263454
50.48436779896,11.0461658810225,0.259199978263454
50.48436779896,11.0533603991247,0.259199978263454
50.48436779896,11.060554917227,0.254322397526212
50.48436779896,11.0677494353292,0.260394716105105
50.48436779896,11.0749439534315,0.259199978263454
50.48436779896,11.0821384715337,0.259199978263454
50.48436779896,11.089332989636,0.259199978263454
50.48436779896,11.0965275077382,0.259199978263454
50.48436779896,11.1037220258405,0.259199978263454
50.48436779896,11.1109165439427,0.259199978263454
50.48436779896,11.118111062045,0.259199978263454
50.48436779896,11.1253055801472,0.259199978263454
50.48436779896,11.1325000982495,0.259199978263454
50.48436779896,11.1396946163517,0.259199978263454
50.48436779896,11.146889134454,0.259199978263454
50.48436779896,11.1540836525562,0.261824798039013
50.48436779896,11.1612781706585,0.452993816141384
50.48436779896,11.1684726887607,0.248315975523526
50.48436779896,11.175667206863,0.254647603239287
50.48436779896,11.1828617249652,0.259199978263454
50.48436779896,11.1900562430675,0.259199978263454
50.48436779896,11.1972507611697,0.259199978263454
50.48436779896,11.204445279272,0.259199978263454
50.48436779896,11.2116397973742,0.259199978263454
50.48436779896,11.2188343154765,0.259199978263454
50.48436779896,11.2260288335787,0.259199978263454
50.48436779896,11.233223351681,0.259199978263454
50.48436779896,11.2404178697832,0.259199978263454
50.48436779896,11.2476123878855,0.259199978263454
50.48436779896,11.2548069059877,0.259199978263454
50.48436779896,11.26200142409,0.259199978263454
50.4889481685026,10.9886097362045,0.259199978263454
50.4889481685026,10.9958042543067,0.259199978263454
50.4889481685026,11.002998772409,0.259199978263454
50.4889481685026,11.0101932905112,0.259199978263454
50.4889481685026,11.0173878086135,0.259199978263454
50.4889481685026,11.0245823267158,0.259199978263454
50.4889481685026,11.031776844818,0.259199978263454
50.4889481685026,11.0389713629203,0.259199978263454
50.4889481685026,11.0461658810225,0.259199978263454
50.4889481685026,11.0533603991247,0.270418740163605
50.4889481685026,11.060554917227,0.272639239813031
50.4889481685026,11.0677494353292,0.245196744787518
50.4889481685026,11.0749439534315,0.255939964992867
50.4889481685026,11.0821384715337,0.259199978263454
50.4889481685026,11.089332989636,0.259199978263454
50.4889481685026,11.0965275077382,0.259199978263454
50.4889481685026,11.1037220258405,0.259199978263454
50.4889481685026,11.1109165439427,0.259199978263454
50.4889481685026,11.118111062045,0.259199978263454
50.4889481685026,11.1253055801472,0.259199978263454
50.4889481685026,11.1325000982495,0.259199978263454
50.4889481685026,11.1396946163517,0.259199978263454
50.4889481685026,11.146889134454,0.259199978263454
50.4889481685026,11.1540836525562,0.259199978263454
50.4889481685026,11.1612781706585,0.262636724801353
50.4889481685026,11.1684726887607,0.2536068687195
50.4889481685026,11.175667206863,0.251378114332803
50.4889481685026,11.1828617249652,0.31455448952589
50.4889481685026,11.1900562430675,0.262572823955354
50.4889481685026,11.1972507611697,0.259199978263454
50.4889481685026,11.204445279272,0.259199978263454
50.4889481685026,11.2116397973742,0.259199978263454
50.4889481685026,11.2188343154765,0.259199978263454
50.4889481685026,11.2260288335787,0.259199978263454
50.4889481685026,11.233223351681,0.259199978263454
50.4889481685026,11.2404178697832,0.259199978263454
50.4889481685026,11.2476123878855,0.259199978263454
50.4889481685026,11.2548069059877,0.260240701774384
50.4889481685026,11.26200142409,0.296889653801661
50.4935285380452,10.9886097362045,0.259199978263454
50.4935285380452,10.9958042543067,0.259199978263454
50.4935285380452,11.002998772409,0.259199978263454
50.4935285380452,11.0101932905112,0.259199978263454
50.4935285380452,11.0173878086135,0.259199978263454
50.4935285380452,11.0245823267158,0.259199978263454
50.4935285380452,11.031776844818,0.259199978263454
50.4935285380452,11.0389713629203,0.259199978263454
50.4935285380452,11.0461658810225,0.259199978263454
50.4935285380452,11.0533603991247,0.277080805810886
50.4935285380452,11.060554917227,0.304509489242629
50.4935285380452,11.0677494353292,0.261408881243045
50.4935285380452,11.0749439534315,0.259199978263454
50.4935285380452,11.0821384715337,0.259199978263454
50.4935285380452,11.089332989636,0.259199978263454
50.4935285380452,11.0965275077382,0.259199978263454
50.4935285380452,11.1037220258405,0.259199978263454
50.4935285380452,11.1109165439427,0.259199978263454
50.4935285380452,11.118111062045,0.259199978263454
50.4935285380452,11.1253055801472,0.259199978263454
50.4935285380452,11.1325000982495,0.259199978263454
50.4935285380452,11.1396946163517,0.259199978263454
50.4935285380452,11.146889134454,0.259199978263454
50.4935285380452,11.1540836525562,0.255513682123832
50.4935285380452,11.1612781706585,0.269296305809662
50.4935285380452,11.1684726887607,0.282160185376753
50.4935285380452,11.175667206863,0.363569684375153
50.4935285380452,11.1828617249652,0.30458844502161
50.4935285380452,11.1900562430675,0.259199978263454
50.4935285380452,11.1972507611697,0.259199978263454
50.4935285380452,11.204445279272,0.259199978263454
50.4935285380452,11.2188343154765,0.259199978263454
50.4935285380452,11.2260288335787,0.282501360668469
50.4935285380452,11.233223351681,0.26143217129973
50.4935285380452,11.2404178697832,0.259199978263454
50.4935285380452,11.2476123878855,0.271456904363582
50.4935285380452,11.2548069059877,0.250374452719169
50.4935285380452,11.26200142409,0.297215602827388
50.4981089075878,10.9814152181022,0.259199978263454
50.4981089075878,10.9886097362045,0.259199978263454
50.4981089075878,10.9958042543067,0.259199978263454
50.4981089075878,11.002998772409,0.259199978263454
50.4981089075878,11.0101932905112,0.259199978263454
50.4981089075878,11.0173878086135,0.259199978263454
50.4981089075878,11.0245823267158,0.259199978263454
50.4981089075878,11.031776844818,0.259199978263454
50.4981089075878,11.0389713629203,0.259199978263454
50.4981089075878,11.0461658810225,0.259199978263454
50.4981089075878,11.0533603991247,0.259199978263454
50.4981089075878,11.060554917227,0.259199978263454
50.4981089075878,11.0677494353292,0.259199978263454
50.4981089075878,11.0749439534315,0.259199978263454
50.4981089075878,11.0821384715337,0.259199978263454
50.4981089075878,11.089332989636,0.259199978263454
50.4981089075878,11.0965275077382,0.259199978263454
50.4981089075878,11.1037220258405,0.259199978263454
50.4981089075878,11.1109165439427,0.259199978263454
50.4981089075878,11.118111062045,0.307429943431218
50.4981089075878,11.1253055801472,0.259199978263454
50.4981089075878,11.1325000982495,0.259199978263454
50.4981089075878,11.1396946163517,0.256057746958697
50.4981089075878,11.146889134454,0.27795152384303
50.4981089075878,11.1540836525562,0.3103457880643
50.4981089075878,11.1684726887607,0.246571271176323
50.4981089075878,11.175667206863,0.259199978263454
50.4981089075878,11.1828617249652,0.259199978263454
50.4981089075878,11.1900562430675,0.259199978263454
50.4981089075878,11.1972507611697,0.259199978263454
50.4981089075878,11.204445279272,0.259199978263454
50.4981089075878,11.2260288335787,0.289408724359172
50.4981089075878,11.233223351681,0.265778365097545
50.4981089075878,11.2404178697832,0.259199978263454
50.4981089075878,11.2476123878855,0.259199978263454
50.4981089075878,11.2548069059877,0.264933214110057
50.4981089075878,11.26200142409,0.259199978263454
50.5026892771304,10.9814152181022,0.259199978263454
50.5026892771304,10.9886097362045,0.259199978263454
50.5026892771304,10.9958042543067,0.259199978263454
50.5026892771304,11.002998772409,0.259199978263454
50.5026892771304,11.0101932905112,0.259199978263454
50.5026892771304,11.0173878086135,0.259199978263454
50.5026892771304,11.0245823267158,0.259199978263454
50.5026892771304,11.031776844818,0.259199978263454
50.5026892771304,11.0389713629203,0.259199978263454
50.5026892771304,11.0461658810225,0.259199978263454
50.5026892771304,11.0533603991247,0.259199978263454
50.5026892771304,11.060554917227,0.259199978263454
50.5026892771304,11.0677494353292,0.259199978263454
50.5026892771304,11.0749439534315,0.259199978263454
50.5026892771304,11.0821384715337,0.259199978263454
50.5026892771304,11.089332989636,0.259199978263454
50.5026892771304,11.0965275077382,0.259199978263454
50.5026892771304,11.1037220258405,0.259199978263454
50.5026892771304,11.1109165439427,0.272183399997892
50.5026892771304,11.118111062045,0.39105308329449
50.5026892771304,11.1253055801472,0.263549773905814
50.5026892771304,11.1325000982495,0.270490945163787
50.5026892771304,11.1396946163517,0.23004840234381
50.5026892771304,11.146889134454,0.383606330826368
50.5026892771304,11.1540836525562,0.344089267161479
50.5026892771304,11.175667206863,0.259199978263454
50.5026892771304,11.1828617249652,0.259199978263454
50.5026892771304,11.2260288335787,0.259199978263454
50.5026892771304,11.233223351681,0.259199978263454
50.5026892771304,11.2404178697832,0.259199978263454
50.5026892771304,11.2476123878855,0.259199978263454
50.5026892771304,11.2548069059877,0.259199978263454
50.5026892771304,11.26200142409,0.259199978263454
50.507269646673,10.9886097362045,0.259199978263454
50.507269646673,10.9958042543067,0.259199978263454
50.507269646673,11.002998772409,0.259199978263454
50.507269646673,11.0101932905112,0.259199978263454
50.507269646673,11.0173878086135,0.259199978263454
50.507269646673,11.0245823267158,0.259199978263454
50.507269646673,11.031776844818,0.259199978263454
50.507269646673,11.0389713629203,0.259199978263454
50.507269646673,11.0461658810225,0.259199978263454
50.507269646673,11.0533603991247,0.259199978263454
50.507269646673,11.060554917227,0.259199978263454
50.507269646673,11.0677494353292,0.259199978263454
50.507269646673,11.0749439534315,0.259199978263454
50.507269646673,11.0821384715337,0.259199978263454
50.507269646673,11.089332989636,0.259199978263454
50.507269646673,11.0965275077382,0.259199978263454
50.507269646673,11.1037220258405,0.259199978263454
50.507269646673,11.1109165439427,0.259199978263454
50.507269646673,11.118111062045,0.259199978263454
50.507269646673,11.1253055801472,0.314871102066995
50.507269646673,11.1325000982495,0.42567845623536
50.507269646673,11.1396946163517,0.375631838866387
50.507269646673,11.146889134454,0.482940123279097
50.5118500162157,11.002998772409,0.274288220172612
50.5118500162157,11.0101932905112,0.259199978263454
50.5118500162157,11.0173878086135,0.259199978263454
50.5118500162157,11.0245823267158,0.259199978263454
50.5118500162157,11.031776844818,0.259199978263454
50.5118500162157,11.0389713629203,0.259199978263454
50.5118500162157,11.0461658810225,0.259199978263454
50.5118500162157,11.0533603991247,0.259199978263454
50.5118500162157,11.060554917227,0.259199978263454
50.5118500162157,11.0677494353292,0.259199978263454
50.5118500162157,11.089332989636,0.259199978263454
50.5118500162157,11.0965275077382,0.259199978263454
50.5118500162157,11.1037220258405,0.259199978263454
50.5118500162157,11.1109165439427,0.259199978263454
50.5118500162157,11.118111062045,0.259199978263454
50.5118500162157,11.1253055801472,0.325260534471153
50.5118500162157,11.1325000982495,0.401828671684953
50.5118500162157,11.1396946163517,0.499578927762913
50.5118500162157,11.146889134454,0.400965316502299
50.5164303857583,11.002998772409,0.322544173238675
50.5164303857583,11.0101932905112,0.259199978263454
50.5164303857583,11.0173878086135,0.259199978263454
50.5164303857583,11.0245823267158,0.259199978263454
50.5164303857583,11.031776844818,0.259199978263454
50.5164303857583,11.0389713629203,0.259199978263454
50.5164303857583,11.0461658810225,0.259199978263454
50.5164303857583,11.0533603991247,0.259199978263454
50.5164303857583,11.060554917227,0.259199978263454
50.5164303857583,11.0965275077382,0.259199978263454
50.5164303857583,11.1037220258405,0.259199978263454
50.5164303857583,11.1109165439427,0.259199978263454
50.5164303857583,11.118111062045,0.259199978263454
50.5164303857583,11.1253055801472,0.259199978263454
50.5164303857583,11.1325000982495,0.333079358584073
50.5164303857583,11.1396946163517,0.461398131127644
50.5164303857583,11.146889134454,0.303584811702153
50.5210107553009,10.9958042543067,0.259199978263454
50.5210107553009,11.002998772409,0.320893230031992
50.5210107553009,11.0101932905112,0.298407385991644
50.5210107553009,11.0173878086135,0.259199978263454
50.5210107553009,11.0245823267158,0.259199978263454
50.5210107553009,11.031776844818,0.259199978263454
50.5210107553009,11.0389713629203,0.259199978263454
50.5210107553009,11.0461658810225,0.259199978263454
50.5210107553009,11.0533603991247,0.259199978263454
50.5210107553009,11.060554917227,0.259199978263454
50.5210107553009,11.0677494353292,0.259199978263454
50.5210107553009,11.0965275077382,0.259199978263454
50.5210107553009,11.1037220258405,0.259199978263454
50.5210107553009,11.1109165439427,0.259199978263454
50.5210107553009,11.118111062045,0.249722018302053
50.5210107553009,11.1253055801472,0.234943151696759
50.5210107553009,11.1325000982495,0.259199978263454
50.5210107553009,11.1396946163517,0.286832634465536
50.5210107553009,11.146889134454,0.325265507704113
50.5210107553009,11.1540836525562,0.315437747199994
50.5255911248435,10.9958042543067,0.259199978263454
50.5255911248435,11.002998772409,0.276383611403393
50.5255911248435,11.0101932905112,0.262732826985688
50.5255911248435,11.0173878086135,0.259199978263454
50.5255911248435,11.0245823267158,0.259199978263454
50.5255911248435,11.0389713629203,0.259199978263454
50.5255911248435,11.0965275077382,0.259199978263454
50.5255911248435,11.1037220258405,0.259199978263454
50.5255911248435,11.1109165439427,0.259199978263454
50.5255911248435,11.118111062045,0.259199978263454
50.5255911248435,11.1253055801472,0.259199978263454
50.5255911248435,11.1325000982495,0.259199978263454
50.5255911248435,11.1396946163517,0.284060894891776
50.5255911248435,11.146889134454,0.351581044448772
50.5255911248435,11.1540836525562,0.328289347587538
50.5255911248435,11.1612781706585,0.259199978263454
50.5301714943861,11.0965275077382,0.259199978263454
50.5301714943861,11.1037220258405,0.259199978263454
50.5301714943861,11.1109165439427,0.259199978263454
50.5301714943861,11.118111062045,0.259199978263454
50.5301714943861,11.1253055801472,0.259199978263454
50.5301714943861,11.1325000982495,0.259199978263454
50.5301714943861,11.1396946163517,0.259199978263454
50.5301714943861,11.146889134454,0.259199978263454
50.5301714943861,11.1540836525562,0.259199978263454
50.5301714943861,11.1612781706585,0.259199978263454
50.5347518639287,11.1109165439427,0.259199978263454
50.5347518639287,11.1325000982495,0.259199978263454
50.5347518639287,11.1396946163517,0.259199978263454
50.5347518639287,11.146889134454,0.259199978263454
50.5347518639287,11.1540836525562,0.259199978263454
50.5393322334713,11.1325000982495,0.259199978263454
50.5393322334713,11.1396946163517,0.259199978263454
50.5393322334713,11.146889134454,0.259199978263454
50.5393322334713,11.1540836525562,0.259199978263454
50.5439126030139,11.1540836525562,0.259199978263454
