nan,nan,8.145344005843055402e-02
1.223691940861339589e+01,5.424426788705834213e+01,9.296642407693511689e-02
1.217531916036149831e+01,5.379466984558344222e+01,1.092950284877729772e-01
1.216673905821880908e+01,5.377846147543085920e+01,1.212862631543802361e-01
1.213321517707371378e+01,5.403360273568006278e+01,1.333685777266370442e-01
1.199711156859864758e+01,5.411294655208369164e+01,1.452694283012134768e-01
1.228485605046903295e+01,5.391380826916673641e+01,1.602282847299482116e-01
1.255826324154955742e+01,5.408010538856321858e+01,1.722778662183977738e-01
1.210620893288882449e+01,5.393773894458743712e+01,1.850400108850303038e-01
1.167549220345898497e+01,5.403234264382300722e+01,1.968110814005184506e-01
1.228498828715746960e+01,5.397312969545168926e+01,2.085181099161841911e-01
