nan,nan,2.384084760669358538e-01
7.903628690265856349e+00,4.807170014885269183e+01,2.521501015230596665e-01
7.852721523068218801e+00,4.806638111568275207e+01,2.650537350180620644e-01
7.822274768710801851e+00,4.808734698140008845e+01,2.769946117108017525e-01
7.812145437669914649e+00,4.812794391230955426e+01,2.901518715298213591e-01
7.971554447463595316e+00,4.810751740021803613e+01,3.024511251753162488e-01
8.053570817446594532e+00,4.810176056490772822e+01,3.148265690820466478e-01
7.900166988907786347e+00,4.811611633878548133e+01,3.252475978847452209e-01
7.653778481701259295e+00,4.821279723383912597e+01,3.369545781412631169e-01
7.783152732532903961e+00,4.810400965370695303e+01,3.482150392049008780e-01
7.677463073648756797e+00,4.820180571295162508e+01,3.597151599651772780e-01
