nan,nan,6.602777711031285190e-02
8.694987762487919269e+00,4.940820849576218166e+01,7.649944323070857755e-02
8.760316962571847554e+00,4.941689598424839147e+01,9.469703333039981852e-02
8.690442760613834139e+00,4.942873931106007035e+01,1.094094694970472043e-01
8.678387556844374018e+00,4.941345828752174896e+01,1.227352595307912159e-01
8.664778951631637582e+00,4.937657773001370032e+01,1.376343367761126979e-01
8.703814016306854029e+00,4.937644159999934601e+01,1.520425386469267948e-01
8.742576957885676237e+00,4.941775184971145052e+01,1.646947000829677432e-01
8.640955272967223877e+00,4.939618564423971492e+01,1.790576538545224083e-01
8.682694465646346060e+00,4.936548780548898918e+01,1.922872222664216146e-01
8.715074888153676369e+00,4.941037763733493193e+01,2.005500696334002741e-01
