nan,nan,1.433429494008211375e-02
7.614478338550576986e+00,4.917339973411012011e+01,2.683066708511482740e-02
7.589459242498476144e+00,4.922518182689857724e+01,3.891650086000517095e-02
7.625603429785711818e+00,4.919133676206269001e+01,5.112873290883263033e-02
7.621887110281356570e+00,4.921265954241508211e+01,6.284333791206260511e-02
7.589342904239141596e+00,4.919680149497482802e+01,7.353572018773552044e-02
7.536261021163207730e+00,4.921051682750640310e+01,8.543370306432203354e-02
7.596014193711723372e+00,4.917398505071697201e+01,9.631387022197737680e-02
7.562249024190815128e+00,4.919978659635787466e+01,1.080177433944208010e-01
7.583271946186946444e+00,4.915262655731154240e+01,1.187823878810639056e-01
7.652860925482188215e+00,4.921941462213096941e+01,1.295363784369285565e-01
