nan,nan,1.402720686049212517e-01
7.288400372205511069e+00,5.054826870299013564e+01,1.540327488189621175e-01
7.307566751230193169e+00,5.051658179450875252e+01,1.706268976395929615e-01
7.424178292286931935e+00,5.045379016403524730e+01,1.824788451791002630e-01
7.422985158675333039e+00,5.054124346415117230e+01,1.949513917696941989e-01
7.238969813307288170e+00,5.058193693780216904e+01,2.085461003904847677e-01
7.370854279362153427e+00,5.069765497528910458e+01,2.207672100039420326e-01
7.387546007116579716e+00,5.045076947604476914e+01,2.333028262657383667e-01
7.537589391079755785e+00,5.045626601820464430e+01,2.458160284731265299e-01
7.376771065336195754e+00,5.048612490684656962e+01,2.576726289858194408e-01
7.424753209406628862e+00,5.066412551773041884e+01,2.718210949496145945e-01
