nan,nan,1.174813823364108251e-01
8.995111589003817798e+00,4.980016383659582146e+01,1.348857250530100527e-01
8.921213725007897111e+00,4.974043897008998982e+01,1.469517802030387843e-01
8.953774433074457306e+00,4.973501570579346520e+01,1.585420860486811967e-01
9.090942866729729843e+00,4.978279455555001931e+01,1.702363233685197097e-01
9.019704293279374951e+00,4.982001661456646957e+01,1.827128698755511593e-01
8.902727766195754455e+00,4.972400168052543989e+01,1.944850844241545751e-01
8.953828579895453998e+00,4.970458941754019122e+01,2.057365879786106078e-01
8.996961307948678765e+00,4.971881114579305461e+01,2.170932160656695586e-01
8.901276553424231963e+00,4.963697454085765060e+01,2.282426021544320394e-01
8.935308632536827389e+00,4.978771883772491691e+01,2.399035738350636660e-01
