nan,nan,5.903087455849551080e-02
1.078771161712012194e+01,5.059668401300881868e+01,7.151063940171778488e-02
1.058303194311821294e+01,5.060325295290977721e+01,8.277377699983842763e-02
1.065615631754584491e+01,5.060053110929153064e+01,9.506544672796897466e-02
1.072551164779451760e+01,5.063885494984729263e+01,1.060520923303764768e-01
1.074529783048493137e+01,5.062872491839745948e+01,1.171462234914130429e-01
1.063134416381649316e+01,5.062205885797920502e+01,1.282255418540579617e-01
1.064246928635458467e+01,5.058012006667365767e+01,1.392227073266747439e-01
1.066648071600807413e+01,5.062929213242181703e+01,1.499718918899476672e-01
1.070398594916576940e+01,5.066288061778147522e+01,1.607241891109021381e-01
1.061128236944044545e+01,5.062392373452277639e+01,1.714623687133819130e-01
