nan,nan,2.971849452327317009e-01
6.765577171080334296e+00,5.095782292253837653e+01,3.158329299116019451e-01
6.962523986336165649e+00,5.082834286551707947e+01,3.374352378556656484e-01
6.810195716101905106e+00,5.092105125996257442e+01,3.494693226740757663e-01
6.866825704427440336e+00,5.086858135619370103e+01,3.638528797185965891e-01
6.657614795235047289e+00,5.092631494389014080e+01,3.763149352905437728e-01
6.761431179480546838e+00,5.085167665729389341e+01,3.880871688477177117e-01
6.837074879156537222e+00,5.089280653725906944e+01,4.017345886401391675e-01
6.676176075572386459e+00,5.098078771844112822e+01,4.151480571058741020e-01
6.758418587284721113e+00,5.101944556740256331e+01,4.285993994574232024e-01
6.580339530789021119e+00,5.085603362224124169e+01,4.423249715632628920e-01
