nan,nan,1.771569001542770416e-01
1.012266812464437038e+01,4.964197934611970453e+01,1.891326988304325718e-01
1.023063761556043971e+01,4.980498066861098039e+01,2.037710989292894626e-01
1.016338366629330103e+01,4.965631270756289695e+01,2.159823597725692435e-01
1.039092873067408185e+01,4.981238752219903176e+01,2.286583428112528016e-01
1.019309398781975062e+01,4.972925925757548526e+01,2.430393714976231689e-01
1.012652973034727211e+01,4.970391162180639100e+01,2.549709101739222050e-01
1.034926074699519916e+01,4.965975833906212955e+01,2.667688874884578398e-01
1.030502257137863964e+01,4.974728961440424513e+01,2.782459727889712298e-01
1.028621785750286222e+01,4.964040617673572342e+01,2.914540562375049215e-01
1.029994288072986919e+01,4.968652251591485935e+01,3.031193815706993422e-01
