nan,nan,7.158486819916255739e-02
1.217418248509166112e+01,5.005591556420481680e+01,8.468479346123648777e-02
1.195087882439259808e+01,5.015137617872088072e+01,9.932150236608855431e-02
1.197245663806470972e+01,5.008447949741750449e+01,1.123740381601989052e-01
1.208061379338126429e+01,5.012871307472586579e+01,1.241897575109866952e-01
1.184879489152523924e+01,5.010942005391283516e+01,1.366943812843732509e-01
1.210388150058272139e+01,5.010315503983477470e+01,1.488826333535042679e-01
1.200075577032907859e+01,5.003842043533542494e+01,1.633577098792846627e-01
1.211309475930122836e+01,5.016668533134009778e+01,1.746564558889453223e-01
1.188778290939682769e+01,5.009817294456173187e+01,1.859051705396087273e-01
1.193833815964905654e+01,5.002807805193311452e+01,1.974826091517085658e-01
