nan,nan,1.080191499320699161e-01
1.121124427824854664e+01,5.058556944742278461e+01,1.207464351752818993e-01
1.116684681049895467e+01,5.062690760191627959e+01,1.325248602225015948e-01
1.131990976653936265e+01,5.068765412006499815e+01,1.466214188204257307e-01
1.136118622148699764e+01,5.064873895561674999e+01,1.595788075205469281e-01
1.130344783446543566e+01,5.052506510557364550e+01,1.715897403845352553e-01
1.147006264455585978e+01,5.074123445022008383e+01,1.835514629360667227e-01
1.131621830778832560e+01,5.071025509849181390e+01,1.947668050494870129e-01
1.146992887694418606e+01,5.064574130957311127e+01,2.059330422204861955e-01
1.109637637232808594e+01,5.065809888979769937e+01,2.176075318466270947e-01
1.115121618342612742e+01,5.057641004703706500e+01,2.289038486927176819e-01
