nan,nan,3.416547030536409291e-01
7.170676428953372650e+00,5.074487253082428850e+01,3.539528979493980487e-01
7.197501642414249723e+00,5.073804167812763666e+01,3.666098645143650581e-01
7.095839376241427132e+00,5.069098331946707958e+01,3.792410835571000671e-01
7.192389577493482733e+00,5.065981943436770507e+01,3.916268151340479564e-01
7.125357536904255440e+00,5.076343063358274321e+01,4.030570750068598329e-01
7.173123181932521852e+00,5.067018144770094068e+01,4.150738939613883849e-01
7.035298393905308423e+00,5.065671124171831252e+01,4.258285217104137987e-01
7.082631578429626096e+00,5.070164212768405321e+01,4.373761135145734502e-01
7.189404846925947723e+00,5.071504022053263583e+01,4.481253801543907955e-01
7.061059516575193484e+00,5.063940147457972074e+01,4.588585967347499905e-01
