nan,nan,1.751925834805894977e-01
9.917089891802024937e+00,5.154960480123303768e+01,1.853048779014118408e-01
9.981816565566768773e+00,5.156088497539737148e+01,1.985896039796366530e-01
9.959961933983212390e+00,5.151908754185733841e+01,2.118127069711387422e-01
9.942258824284897045e+00,5.150773429640163670e+01,2.232482607078774550e-01
1.025438693104814547e+01,5.151524660562584756e+01,2.363322082645865907e-01
1.017103773943628298e+01,5.175998343162059001e+01,2.478103641437014171e-01
1.021337511406791521e+01,5.160335428164476923e+01,2.589245851000435694e-01
9.983502087876203746e+00,5.154045509930028857e+01,2.725624993245466254e-01
9.866086340650204178e+00,5.151749837285674971e+01,2.845402513006075607e-01
9.657085038926734200e+00,5.141624735667564039e+01,2.999031994199837792e-01
