nan,nan,2.595976319018939577e-02
7.371311486252530187e+00,5.020391894979776737e+01,3.669919912175574617e-02
7.146828309087435827e+00,5.012985548959672855e+01,4.844984116669891205e-02
7.133158820508461062e+00,5.013646843978960987e+01,6.109108637147539489e-02
7.033204915836927640e+00,5.006950993526405114e+01,7.663515396502032506e-02
7.207987475546459244e+00,5.008566112880600230e+01,8.909093208036701628e-02
7.234805863778071888e+00,5.013216342551633176e+01,1.013384102096468037e-01
7.265154695926558048e+00,5.008682546508159561e+01,1.130487812475210463e-01
7.198556202346561683e+00,5.016412372861040581e+01,1.249111885574726855e-01
7.033440462388616865e+00,5.017410051914214364e+01,1.367204951784035671e-01
7.303452711475137527e+00,5.017357194881093818e+01,1.504034740559936911e-01
