nan,nan,3.154591913474741882e-01
9.880815794870988711e+00,5.221583719680469926e+01,3.270139226404590871e-01
9.741538181511852912e+00,5.213012188755007514e+01,3.390699830622714850e-01
9.958905777180451224e+00,5.210233660626879981e+01,3.509681860822732036e-01
1.000718587908036383e+01,5.202494515926642293e+01,3.636831644769458194e-01
9.820137625420906957e+00,5.211479585109539414e+01,3.753876596933722332e-01
1.002767388919532898e+01,5.209387821213455538e+01,3.871578371241978789e-01
9.859871933007408273e+00,5.216773621151207152e+01,4.006355718777658281e-01
9.768743231705615315e+00,5.214779469209898366e+01,4.124446373071236072e-01
1.009148481545189036e+01,5.200571497317842784e+01,4.237220077804969010e-01
9.954262229506209536e+00,5.197159462697050714e+01,4.357723288714192011e-01
