49.3447858,11.0562578621247,0.36899051613689
49.3447858,11.0634523801386,0.26136745767106
49.3447858,11.0706468981524,0.259199978263454
49.3447858,11.0778414161663,0.243601565710847
49.3447858,11.0850359341802,0.250351219745129
49.3493664377409,11.0490633441109,0.246940797117901
49.3493664377409,11.0562578621247,0.456091055757682
49.3493664377409,11.0634523801386,0.310981382466285
49.3493664377409,11.0706468981524,0.259199978263454
49.3493664377409,11.0778414161663,0.259199978263454
49.3493664377409,11.0850359341802,0.259199978263454
49.3493664377409,11.0994249702079,0.24793710635285
49.3539470754818,11.041868826097,0.259199978263454
49.3539470754818,11.0490633441109,0.320302274701299
49.3539470754818,11.0562578621247,0.461378516084687
49.3539470754818,11.0634523801386,0.269414196430694
49.3539470754818,11.0706468981524,0.259199978263454
49.3539470754818,11.0778414161663,0.259199978263454
49.3539470754818,11.0850359341802,0.259199978263454
49.3539470754818,11.092230452194,0.271153042461156
49.3539470754818,11.0994249702079,0.627313971699047
49.3539470754818,11.1066194882217,0.277732103143405
49.3585277132226,11.0490633441109,0.296342338722253
49.3585277132226,11.0562578621247,0.407677596896872
49.3585277132226,11.0634523801386,0.278975452411526
49.3585277132226,11.0706468981524,0.259199978263454
49.3585277132226,11.0778414161663,0.259199978263454
49.3585277132226,11.0850359341802,0.259199978263454
49.3585277132226,11.092230452194,0.27491092153102
49.3585277132226,11.0994249702079,0.481595690009535
49.3585277132226,11.1066194882217,0.344635106225736
49.3585277132226,11.1138140062356,0.262930567167091
49.3631083509635,11.0490633441109,0.318687124819124
49.3631083509635,11.0562578621247,0.318816469132183
49.3631083509635,11.0634523801386,0.239417601522895
49.3631083509635,11.0706468981524,0.269796595950186
49.3631083509635,11.0778414161663,0.291134002405672
49.3631083509635,11.0850359341802,0.259199978263454
49.3631083509635,11.092230452194,0.259199978263454
49.3631083509635,11.0994249702079,0.256941222337944
49.3631083509635,11.1066194882217,0.269427712574719
49.3631083509635,11.1138140062356,0.259199978263454
49.3676889887044,11.041868826097,0.326886716991569
49.3676889887044,11.0490633441109,0.384161665089871
49.3676889887044,11.0562578621247,0.259199978263454
49.3676889887044,11.0634523801386,0.259199978263454
49.3676889887044,11.0706468981524,0.304518441389649
49.3676889887044,11.0778414161663,0.264771192552369
49.3676889887044,11.0850359341802,0.291604539805428
49.3676889887044,11.092230452194,0.261360749386409
49.3676889887044,11.0994249702079,0.257475141214814
49.3676889887044,11.1066194882217,0.259199978263454
49.3722696264453,11.0130907540416,0.252595833247615
49.3722696264453,11.0202852720554,0.25328761076385
49.3722696264453,11.0274797900693,0.188217411770516
49.3722696264453,11.0346743080831,0.269602893839789
49.3722696264453,11.041868826097,0.342110748769589
49.3722696264453,11.0490633441109,0.289381031952126
49.3722696264453,11.0562578621247,0.259757688012041
49.3722696264453,11.0634523801386,0.360319214415634
49.3722696264453,11.0706468981524,0.292360033552009
49.3722696264453,11.0778414161663,0.392136516137498
49.3722696264453,11.0850359341802,0.366216332549149
49.3722696264453,11.092230452194,0.283865436486196
49.3722696264453,11.0994249702079,0.210694594693824
49.3722696264453,11.1066194882217,0.258761144356469
49.3722696264453,11.1138140062356,0.259199978263454
49.3768502641862,10.9987017180139,0.259199978263454
49.3768502641862,11.0058962360277,0.259199978263454
49.3768502641862,11.0130907540416,0.25254147368909
49.3768502641862,11.0202852720554,0.350802696171861
49.3768502641862,11.0274797900693,0.378675183859801
49.3768502641862,11.0346743080831,0.324438913087994
49.3768502641862,11.041868826097,0.355312865660514
49.3768502641862,11.0490633441109,0.259199978263454
49.3768502641862,11.0562578621247,0.259199978263454
49.3768502641862,11.0634523801386,0.301540650685226
49.3768502641862,11.0706468981524,0.283851390468787
49.3768502641862,11.0778414161663,0.30050903976057
49.3768502641862,11.0850359341802,0.26777847413247
49.3768502641862,11.092230452194,0.258848286923987
49.3768502641862,11.0994249702079,0.253342018075135
49.3768502641862,11.1066194882217,0.259199978263454
49.381430901927,10.9987017180139,0.259199978263454
49.381430901927,11.0058962360277,0.266442203374708
49.381430901927,11.0130907540416,0.326644266719472
49.381430901927,11.0202852720554,0.274445275377448
49.381430901927,11.0274797900693,0.358406621022919
49.381430901927,11.0346743080831,0.358214856030633
49.381430901927,11.041868826097,0.31455974849179
49.381430901927,11.0490633441109,0.259199978263454
49.381430901927,11.0562578621247,0.259199978263454
49.381430901927,11.0634523801386,0.259199978263454
49.381430901927,11.0706468981524,0.259199978263454
49.381430901927,11.0778414161663,0.274933166054093
49.381430901927,11.0850359341802,0.258071948507366
49.381430901927,11.092230452194,0.259199978263454
49.381430901927,11.0994249702079,0.259199978263454
49.3860115396679,10.9987017180139,0.259199978263454
49.3860115396679,11.0058962360277,0.259199978263454
49.3860115396679,11.0130907540416,0.266972364252973
49.3860115396679,11.0202852720554,0.262252788601153
49.3860115396679,11.0274797900693,0.293349598233907
49.3860115396679,11.0346743080831,0.370306754683792
49.3860115396679,11.041868826097,0.261555926024358
49.3860115396679,11.0490633441109,0.259199978263454
49.3860115396679,11.0562578621247,0.254626200337012
49.3860115396679,11.0634523801386,0.259199978263454
49.3860115396679,11.0706468981524,0.259199978263454
49.3860115396679,11.0778414161663,0.259199978263454
49.3860115396679,11.0850359341802,0.279196942589276
49.3860115396679,11.092230452194,0.259199978263454
49.3860115396679,11.0994249702079,0.259199978263454
49.3860115396679,11.1066194882217,0.273940972842548
49.3905921774088,11.0130907540416,0.259199978263454
49.3905921774088,11.0202852720554,0.270482060513864
49.3905921774088,11.0274797900693,0.319275107761574
49.3905921774088,11.0346743080831,0.480699938899515
49.3905921774088,11.041868826097,0.268860633467331
49.3905921774088,11.0490633441109,0.289882586112799
49.3905921774088,11.0562578621247,0.168501206043558
49.3905921774088,11.0634523801386,0.246089031938419
49.3905921774088,11.0706468981524,0.259199978263454
49.3905921774088,11.0778414161663,0.282228540792889
49.3905921774088,11.0850359341802,0.382867869132496
49.3905921774088,11.092230452194,0.259199978263454
49.3905921774088,11.0994249702079,0.259199978263454
49.3905921774088,11.1066194882217,0.353785344602627
49.3905921774088,11.1138140062356,0.327007037821726
49.3905921774088,11.1210085242495,0.259199978263454
49.3905921774088,11.1282030422633,0.319499671141118
49.3905921774088,11.142592078291,0.259199978263454
49.3905921774088,11.1497865963049,0.259199978263454
49.3905921774088,11.1569811143187,0.259199978263454
49.3905921774088,11.1641756323326,0.259199978263454
49.3905921774088,11.1713701503465,0.275543251110922
49.3905921774088,11.1785646683603,0.248481695825376
49.3905921774088,11.1857591863742,0.257595489421648
49.3951728151497,11.0274797900693,0.275799253195661
49.3951728151497,11.0346743080831,0.324423141083324
49.3951728151497,11.041868826097,0.287740842966199
49.3951728151497,11.0490633441109,0.259651432263145
49.3951728151497,11.0562578621247,0.259199978263454
49.3951728151497,11.0634523801386,0.259199978263454
49.3951728151497,11.0706468981524,0.259199978263454
49.3951728151497,11.0778414161663,0.258679796898157
49.3951728151497,11.0850359341802,0.250819113532998
49.3951728151497,11.092230452194,0.259199978263454
49.3951728151497,11.0994249702079,0.259199978263454
49.3951728151497,11.1066194882217,0.259199978263454
49.3951728151497,11.1138140062356,0.300978864131945
49.3951728151497,11.1210085242495,0.28454214693978
49.3951728151497,11.1282030422633,0.479869687323916
49.3951728151497,11.1353975602772,0.513718524717636
49.3951728151497,11.142592078291,0.310108354122601
49.3951728151497,11.1497865963049,0.259199978263454
49.3951728151497,11.1569811143187,0.259199978263454
49.3951728151497,11.1641756323326,0.259199978263454
49.3951728151497,11.1713701503465,0.33692705718531
49.3997534528906,11.0274797900693,0.261930832159198
49.3997534528906,11.0346743080831,0.312592481814984
49.3997534528906,11.041868826097,0.444907697632721
49.3997534528906,11.0490633441109,0.320788663343113
49.3997534528906,11.0562578621247,0.266186350002442
49.3997534528906,11.0634523801386,0.299018362589056
49.3997534528906,11.0706468981524,0.277300266415143
49.3997534528906,11.0778414161663,0.259199978263454
49.3997534528906,11.0850359341802,0.368424761721152
49.3997534528906,11.092230452194,0.366799850920216
49.3997534528906,11.0994249702079,0.298048923802227
49.3997534528906,11.1066194882217,0.281125489565805
49.3997534528906,11.1138140062356,0.306104823345017
49.3997534528906,11.1210085242495,0.295141048189492
49.3997534528906,11.1282030422633,0.403812583874364
49.3997534528906,11.1353975602772,0.50485887408651
49.3997534528906,11.142592078291,0.397651206699164
49.3997534528906,11.1497865963049,0.276952241200675
49.3997534528906,11.1569811143187,0.253603472878298
49.3997534528906,11.1641756323326,0.259199978263454
49.3997534528906,11.1713701503465,0.293389542521197
49.3997534528906,11.1785646683603,0.357581304285572
49.4043340906314,11.0274797900693,0.295859726714064
49.4043340906314,11.0346743080831,0.533887212696941
49.4043340906314,11.041868826097,0.28555295056719
49.4043340906314,11.0490633441109,0.320475897875424
49.4043340906314,11.0562578621247,0.293975284287203
49.4043340906314,11.0634523801386,0.339168882853261
49.4043340906314,11.0706468981524,0.292413703468811
49.4043340906314,11.0778414161663,0.259199978263454
49.4043340906314,11.0850359341802,0.390209281136927
49.4043340906314,11.092230452194,0.557496069688633
49.4043340906314,11.0994249702079,0.392373282146684
49.4043340906314,11.1066194882217,0.338556574772391
49.4043340906314,11.1138140062356,0.2566769679868
49.4043340906314,11.1210085242495,0.348483137510398
49.4043340906314,11.1282030422633,0.362745594995792
49.4043340906314,11.1353975602772,0.488018901562722
49.4043340906314,11.142592078291,0.420774295786501
49.4043340906314,11.1497865963049,0.305280724330991
49.4043340906314,11.1569811143187,0.244407396708253
49.4043340906314,11.1641756323326,0.343962072356122
49.4043340906314,11.1713701503465,0.325109774654195
49.4043340906314,11.1785646683603,0.307050264423992
49.4089147283723,11.0202852720554,0.259199978263454
49.4089147283723,11.0274797900693,0.260389811467485
49.4089147283723,11.0346743080831,0.476858008584841
49.4089147283723,11.041868826097,0.412183413632364
49.4089147283723,11.0490633441109,0.273028006097138
49.4089147283723,11.0562578621247,0.308291491232922
49.4089147283723,11.0634523801386,0.367762523900379
49.4089147283723,11.0706468981524,0.254455487796706
49.4089147283723,11.0778414161663,0.39656458229444
49.4089147283723,11.0850359341802,0.420503983051106
49.4089147283723,11.092230452194,0.3203615999877
49.4089147283723,11.0994249702079,0.335998038662312
49.4089147283723,11.1066194882217,0.375510513431893
49.4089147283723,11.1138140062356,0.350652307589416
49.4089147283723,11.1210085242495,0.574237671618524
49.4089147283723,11.1282030422633,0.318989141684848
49.4089147283723,11.1353975602772,0.401376158307072
49.4089147283723,11.142592078291,0.439602047587722
49.4089147283723,11.1497865963049,0.237023937388948
49.4089147283723,11.1569811143187,0.26260337657029
49.4089147283723,11.1641756323326,0.400325598279165
49.4089147283723,11.1713701503465,0.374809416630766
49.4089147283723,11.1785646683603,0.299896456163137
49.4089147283723,11.1857591863742,0.259199978263454
49.4134953661132,11.0202852720554,0.259199978263454
49.4134953661132,11.0274797900693,0.340672655288397
49.4134953661132,11.0346743080831,0.40661189112066
49.4134953661132,11.041868826097,0.422621509062633
49.4134953661132,11.0490633441109,0.299474950956124
49.4134953661132,11.0562578621247,0.228014619965484
49.4134953661132,11.0634523801386,0.323506324850085
49.4134953661132,11.0706468981524,0.461474267418898
49.4134953661132,11.0778414161663,0.500329616037557
49.4134953661132,11.0850359341802,0.296411824031714
49.4134953661132,11.092230452194,0.259199978263454
49.4134953661132,11.0994249702079,0.328833192163147
49.4134953661132,11.1066194882217,0.459281383255668
49.4134953661132,11.1138140062356,0.365740879446151
49.4134953661132,11.1210085242495,0.440296751556194
49.4134953661132,11.1282030422633,0.51359003307543
49.4134953661132,11.1353975602772,0.3338389770592
49.4134953661132,11.142592078291,0.241884245029958
49.4134953661132,11.1497865963049,0.336370135353328
49.4134953661132,11.1569811143187,0.25597374985703
49.4134953661132,11.1641756323326,0.301960447287073
49.4134953661132,11.1713701503465,0.234900164549036
49.4134953661132,11.1785646683603,0.244252220425918
49.4180760038541,11.0130907540416,0.264716210521412
49.4180760038541,11.0274797900693,0.320628253579839
49.4180760038541,11.0346743080831,0.441175923768012
49.4180760038541,11.041868826097,0.305895019584514
49.4180760038541,11.0490633441109,0.354692885598697
49.4180760038541,11.0562578621247,0.281827598088255
49.4180760038541,11.0634523801386,0.292458771702771
49.4180760038541,11.0706468981524,0.308782880589132
49.4180760038541,11.0778414161663,0.244616683022437
49.4180760038541,11.0850359341802,0.254055600198223
49.4180760038541,11.092230452194,0.259199978263454
49.4180760038541,11.0994249702079,0.273807403420942
49.4180760038541,11.1066194882217,0.191966226702414
49.4180760038541,11.1138140062356,0.268778925627036
49.4180760038541,11.1210085242495,0.282503566724011
49.4180760038541,11.1282030422633,0.32401878131293
49.4180760038541,11.1353975602772,0.332373737907678
49.4180760038541,11.142592078291,0.257243290800681
49.4180760038541,11.1497865963049,0.2843272402827
49.4180760038541,11.1569811143187,0.328581412171717
49.4180760038541,11.1641756323326,0.274739274278281
49.4180760038541,11.1713701503465,0.262057276774016
49.4180760038541,11.1857591863742,0.438352944654205
49.4180760038541,11.192953704388,0.417605404451443
49.4180760038541,11.2001482224019,0.355636468718045
49.4226566415949,11.0058962360277,0.283063871565836
49.4226566415949,11.0130907540416,0.296779303264532
49.4226566415949,11.0202852720554,0.329978080384234
49.4226566415949,11.0274797900693,0.336330712298102
49.4226566415949,11.0346743080831,0.301430569716998
49.4226566415949,11.041868826097,0.276325698335362
49.4226566415949,11.0490633441109,0.307936451817469
49.4226566415949,11.0562578621247,0.432767910020855
49.4226566415949,11.0634523801386,0.482324638545302
49.4226566415949,11.0706468981524,0.308092906384318
49.4226566415949,11.0778414161663,0.291760726344242
49.4226566415949,11.0850359341802,0.36772233058256
49.4226566415949,11.092230452194,0.248701719523309
49.4226566415949,11.0994249702079,0.259199978263454
49.4226566415949,11.1066194882217,0.227086350281532
49.4226566415949,11.1138140062356,0.362724131912037
49.4226566415949,11.1210085242495,0.359195159463723
49.4226566415949,11.1282030422633,0.325526364582501
49.4226566415949,11.1353975602772,0.270762198445645
49.4226566415949,11.142592078291,0.265972140285659
49.4226566415949,11.1497865963049,0.259199978263454
49.4226566415949,11.1569811143187,0.259199978263454
49.4226566415949,11.1785646683603,0.259199978263454
49.4226566415949,11.1857591863742,0.288832515941501
49.4226566415949,11.192953704388,0.397823789452172
49.4226566415949,11.2001482224019,0.279607397241454
49.4272372793358,10.9987017180139,0.273925455761888
49.4272372793358,11.0058962360277,0.456369110236234
49.4272372793358,11.0130907540416,0.387297445083408
49.4272372793358,11.0202852720554,0.384536108009243
49.4272372793358,11.0274797900693,0.35830365388607
49.4272372793358,11.0346743080831,0.288941346654712
49.4272372793358,11.041868826097,0.3721034674972
49.4272372793358,11.0490633441109,0.446984700355043
49.4272372793358,11.0562578621247,0.262684499370878
49.4272372793358,11.0634523801386,0.520093474964338
49.4272372793358,11.0706468981524,0.505190698122887
49.4272372793358,11.0778414161663,0.362453372295872
49.4272372793358,11.0850359341802,0.584039113136218
49.4272372793358,11.092230452194,0.601896919326112
49.4272372793358,11.0994249702079,0.292229918428321
49.4272372793358,11.1066194882217,0.254861926047926
49.4272372793358,11.1138140062356,0.403515856555931
49.4272372793358,11.1210085242495,0.268431043753031
49.4272372793358,11.1282030422633,0.349400498313329
49.4272372793358,11.1353975602772,0.313495309359083
49.4272372793358,11.142592078291,0.390807262126005
49.4272372793358,11.1857591863742,0.259199978263454
49.4272372793358,11.192953704388,0.259199978263454
49.4272372793358,11.2505098484989,0.259199978263454
49.4272372793358,11.2577043665128,0.259199978263454
49.4318179170767,10.9987017180139,0.330686388488928
49.4318179170767,11.0058962360277,0.333257898788629
49.4318179170767,11.0130907540416,0.4091725271324
49.4318179170767,11.0202852720554,0.473637534087609
49.4318179170767,11.0274797900693,0.590755129409512
49.4318179170767,11.0346743080831,0.339644942791662
49.4318179170767,11.041868826097,0.385163862873693
49.4318179170767,11.0490633441109,0.486131061878758
49.4318179170767,11.0562578621247,0.306175831467632
49.4318179170767,11.0634523801386,0.325722801198359
49.4318179170767,11.0706468981524,0.38947361157684
49.4318179170767,11.0778414161663,0.651657356637549
49.4318179170767,11.0850359341802,0.789709644954937
49.4318179170767,11.092230452194,0.602937505873392
49.4318179170767,11.0994249702079,0.539420696708473
49.4318179170767,11.1066194882217,0.339027439089595
49.4318179170767,11.1138140062356,0.381159294909487
49.4318179170767,11.1210085242495,0.280562038239259
49.4318179170767,11.1282030422633,0.4970840457238
49.4318179170767,11.1353975602772,0.361122426412848
49.4318179170767,11.2577043665128,0.248777408098256
49.4363985548176,10.9915072,0.252767996058364
49.4363985548176,10.9987017180139,0.27599984097286
49.4363985548176,11.0058962360277,0.277182634012212
49.4363985548176,11.0130907540416,0.262438983595425
49.4363985548176,11.0202852720554,0.339751565029163
49.4363985548176,11.0274797900693,0.442042715971189
49.4363985548176,11.0346743080831,0.504820877794388
49.4363985548176,11.041868826097,0.448910527916754
49.4363985548176,11.0490633441109,0.501589568503809
49.4363985548176,11.0562578621247,0.354451448243375
49.4363985548176,11.0634523801386,0.366364714608122
49.4363985548176,11.0706468981524,0.559186552338141
49.4363985548176,11.0778414161663,0.684144551998865
49.4363985548176,11.0850359341802,0.729097451646827
49.4363985548176,11.092230452194,0.628857539373235
49.4363985548176,11.0994249702079,0.528594727753305
49.4363985548176,11.1066194882217,0.398415012596946
49.4363985548176,11.1138140062356,0.618215640207246
49.4363985548176,11.1210085242495,0.424989090955033
49.4363985548176,11.1282030422633,0.417006033254148
49.4363985548176,11.1353975602772,0.374850969062404
49.4363985548176,11.2505098484989,0.277725346057592
49.4363985548176,11.2577043665128,0.264004067862832
49.4409791925585,10.9987017180139,0.239889373845937
49.4409791925585,11.0058962360277,0.300624882436708
49.4409791925585,11.0130907540416,0.386240745959413
49.4409791925585,11.0202852720554,0.444751663032337
49.4409791925585,11.0274797900693,0.32927266086657
49.4409791925585,11.0346743080831,0.593382619179807
49.4409791925585,11.041868826097,0.500572961214057
49.4409791925585,11.0490633441109,0.695724015114737
49.4409791925585,11.0562578621247,0.606601189716897
49.4409791925585,11.0634523801386,0.526098081416404
49.4409791925585,11.0706468981524,0.691627558241437
49.4409791925585,11.0778414161663,0.807827453794684
49.4409791925585,11.0850359341802,0.699066265274312
49.4409791925585,11.092230452194,0.624653472334607
49.4409791925585,11.0994249702079,0.644722763872791
49.4409791925585,11.1066194882217,0.5030797754772
49.4409791925585,11.1138140062356,0.427651863056875
49.4409791925585,11.1210085242495,0.529583084692633
49.4409791925585,11.1282030422633,0.497066040238791
49.4455598302993,10.9987017180139,0.269046802437704
49.4455598302993,11.0058962360277,0.388229690936729
49.4455598302993,11.0130907540416,0.323940032610819
49.4455598302993,11.0202852720554,0.384234940287839
49.4455598302993,11.0274797900693,0.340319317893523
49.4455598302993,11.0346743080831,0.407800000465851
49.4455598302993,11.041868826097,0.309929084521324
49.4455598302993,11.0490633441109,0.578638111819991
49.4455598302993,11.0562578621247,0.658370203209268
49.4455598302993,11.0634523801386,0.552514400533962
49.4455598302993,11.0706468981524,0.587057230047433
49.4455598302993,11.0778414161663,0.772935900013335
49.4455598302993,11.0850359341802,0.653356320734606
49.4455598302993,11.092230452194,0.567883827669799
49.4455598302993,11.0994249702079,0.608837019300887
49.4455598302993,11.1066194882217,0.705932175154497
49.4455598302993,11.1138140062356,0.501934175059645
49.4455598302993,11.1210085242495,0.491932701516138
49.4455598302993,11.1282030422633,0.599835187940372
49.4455598302993,11.1353975602772,0.32062114847386
49.4455598302993,11.142592078291,0.348564748887363
49.4455598302993,11.1497865963049,0.320924213587915
49.4501404680402,10.9987017180139,0.356539135041989
49.4501404680402,11.0058962360277,0.416908048654097
49.4501404680402,11.0130907540416,0.444090839482946
49.4501404680402,11.0202852720554,0.273462650060292
49.4501404680402,11.0274797900693,0.47451760570913
49.4501404680402,11.0346743080831,0.35873543833095
49.4501404680402,11.041868826097,0.386459049318
49.4501404680402,11.0490633441109,0.823605378620101
49.4501404680402,11.0562578621247,0.793380028216038
49.4501404680402,11.0634523801386,0.715755682835088
49.4501404680402,11.0706468981524,0.663494359041708
49.4501404680402,11.0778414161663,0.679124739269058
49.4501404680402,11.0850359341802,0.812893949577178
49.4501404680402,11.092230452194,0.438767711910747
49.4501404680402,11.0994249702079,0.513149046060235
49.4501404680402,11.1066194882217,0.459507472022126
49.4501404680402,11.1138140062356,0.404359538615299
49.4501404680402,11.1210085242495,0.36648464140902
49.4501404680402,11.1282030422633,0.441494556478198
49.4501404680402,11.1353975602772,0.36796726268855
49.4501404680402,11.142592078291,0.446929087792105
49.4501404680402,11.1497865963049,0.39095748119129
49.4547211057811,11.0130907540416,0.484629461655032
49.4547211057811,11.0202852720554,0.421856598092929
49.4547211057811,11.0274797900693,0.465373364012796
49.4547211057811,11.0346743080831,0.686478469662
49.4547211057811,11.041868826097,0.596739168399412
49.4547211057811,11.0490633441109,0.700092656011983
49.4547211057811,11.0562578621247,0.479144014992343
49.4547211057811,11.0634523801386,0.467927722429865
49.4547211057811,11.0706468981524,0.646501818354623
49.4547211057811,11.0778414161663,0.774454131269641
49.4547211057811,11.0850359341802,0.711853540735471
49.4547211057811,11.092230452194,0.619602276332448
49.4547211057811,11.0994249702079,0.54241782790934
49.4547211057811,11.1066194882217,0.315981449234654
49.4547211057811,11.1138140062356,0.470978174376644
49.4547211057811,11.1210085242495,0.315871371148252
49.4547211057811,11.1282030422633,0.416581023867372
49.4547211057811,11.1353975602772,0.269167831155602
49.4547211057811,11.142592078291,0.356598744010657
49.459301743522,11.0130907540416,0.376252564476138
49.459301743522,11.0202852720554,0.363696272635345
49.459301743522,11.0274797900693,0.380094730874566
49.459301743522,11.0346743080831,0.592664227536707
49.459301743522,11.041868826097,0.546730544206253
49.459301743522,11.0490633441109,0.463780091785435
49.459301743522,11.0562578621247,0.596712984688169
49.459301743522,11.0634523801386,0.778757151249155
49.459301743522,11.0706468981524,0.715649538406351
49.459301743522,11.0778414161663,0.815961788089278
49.459301743522,11.0850359341802,0.790328753842139
49.459301743522,11.092230452194,0.640877694339341
49.459301743522,11.0994249702079,0.857453882119779
49.459301743522,11.1066194882217,0.648176760649917
49.459301743522,11.1138140062356,0.326390192829406
49.459301743522,11.1210085242495,0.294301221081573
49.459301743522,11.1282030422633,0.422927628531193
49.459301743522,11.1353975602772,0.457063818155543
49.459301743522,11.142592078291,0.365503656698065
49.459301743522,11.1497865963049,0.370646452004399
49.459301743522,11.1569811143187,0.370100183933
49.4638823812629,11.0130907540416,0.316975529279111
49.4638823812629,11.0202852720554,0.411741247195064
49.4638823812629,11.0274797900693,0.325388717522108
49.4638823812629,11.0346743080831,0.376670181061645
49.4638823812629,11.041868826097,0.353110034699383
49.4638823812629,11.0490633441109,0.461360106452989
49.4638823812629,11.0562578621247,0.530106554049661
49.4638823812629,11.0634523801386,0.578678269400092
49.4638823812629,11.0706468981524,0.849913888867154
49.4638823812629,11.0778414161663,0.813327366762627
49.4638823812629,11.0850359341802,0.875523457313265
49.4638823812629,11.092230452194,0.617465155485609
49.4638823812629,11.0994249702079,0.837335124526716
49.4638823812629,11.1066194882217,0.529494933462206
49.4638823812629,11.1138140062356,0.422963750001391
49.4638823812629,11.1210085242495,0.529126625413792
49.4638823812629,11.1282030422633,0.325914366241808
49.4638823812629,11.1353975602772,0.587726117305443
49.4638823812629,11.142592078291,0.466415757954839
49.4638823812629,11.1497865963049,0.609291311082661
49.4638823812629,11.1569811143187,0.372167083531202
49.4638823812629,11.1641756323326,0.478821742724687
49.4638823812629,11.1713701503465,0.485067839872936
49.4684630190037,11.0202852720554,0.509998484918849
49.4684630190037,11.0274797900693,0.594490113238161
49.4684630190037,11.0346743080831,0.38552967473632
49.4684630190037,11.041868826097,0.425976960637785
49.4684630190037,11.0490633441109,0.44269072575016
49.4684630190037,11.0562578621247,0.395443026545033
49.4684630190037,11.0634523801386,0.353559934443992
49.4684630190037,11.0706468981524,0.601891324801116
49.4684630190037,11.0778414161663,0.480845892792996
49.4684630190037,11.0850359341802,0.450502546212953
49.4684630190037,11.092230452194,0.438342571374314
49.4684630190037,11.0994249702079,0.573093952586
49.4684630190037,11.1066194882217,0.50522842602003
49.4684630190037,11.1138140062356,0.493209882089239
49.4684630190037,11.1210085242495,0.307980689644689
49.4684630190037,11.1282030422633,0.315704781232109
49.4684630190037,11.1353975602772,0.319656709248769
49.4684630190037,11.142592078291,0.270311849998629
49.4684630190037,11.1497865963049,0.303809952810715
49.4684630190037,11.1569811143187,0.318164424592202
49.4684630190037,11.1641756323326,0.357997931068579
49.4684630190037,11.1713701503465,0.360997239301154
49.4684630190037,11.1785646683603,0.273578635370689
49.4730436567446,11.0274797900693,0.266915550235817
49.4730436567446,11.0346743080831,0.301823758682807
49.4730436567446,11.041868826097,0.307607604229619
49.4730436567446,11.0490633441109,0.33345359165371
49.4730436567446,11.0562578621247,0.414580235565534
49.4730436567446,11.0634523801386,0.491563212216257
49.4730436567446,11.0706468981524,0.410244329162644
49.4730436567446,11.0778414161663,0.419104473190188
49.4730436567446,11.0850359341802,0.54321167506308
49.4730436567446,11.092230452194,0.33535371078698
49.4730436567446,11.0994249702079,0.657251252915029
49.4730436567446,11.1066194882217,0.61543177181971
49.4730436567446,11.1138140062356,0.499591612107702
49.4730436567446,11.1210085242495,0.408254877829466
49.4730436567446,11.1282030422633,0.353381765413066
49.4730436567446,11.1353975602772,0.44042870628295
49.4730436567446,11.142592078291,0.283858848987004
49.4730436567446,11.1497865963049,0.259199978263454
49.4730436567446,11.1641756323326,0.26463011175546
49.4730436567446,11.1713701503465,0.273442723328163
49.4730436567446,11.1785646683603,0.259199978263454
49.4776242944855,11.0274797900693,0.282285653244497
49.4776242944855,11.0346743080831,0.271467092604553
49.4776242944855,11.041868826097,0.276485573664763
49.4776242944855,11.0490633441109,0.297023887766269
49.4776242944855,11.0562578621247,0.372702626643516
49.4776242944855,11.0634523801386,0.329650963535392
49.4776242944855,11.0706468981524,0.319890581075981
49.4776242944855,11.0778414161663,0.300946903327748
49.4776242944855,11.0850359341802,0.414277408685243
49.4776242944855,11.092230452194,0.404169088002325
49.4776242944855,11.0994249702079,0.362243781560768
49.4776242944855,11.1066194882217,0.430489685882784
49.4776242944855,11.1138140062356,0.520918695487318
49.4776242944855,11.1210085242495,0.467748048229038
49.4776242944855,11.1282030422633,0.33694482629696
49.4776242944855,11.1353975602772,0.350134031083177
49.4776242944855,11.142592078291,0.231230190946047
49.4776242944855,11.1497865963049,0.256910032703038
49.4822049322264,11.0274797900693,0.259199978263454
49.4822049322264,11.0346743080831,0.259199978263454
49.4822049322264,11.041868826097,0.259199978263454
49.4822049322264,11.0490633441109,0.247156664246793
49.4822049322264,11.0562578621247,0.339063732530728
49.4822049322264,11.0634523801386,0.364049002732966
49.4822049322264,11.0706468981524,0.259199978263454
49.4822049322264,11.0778414161663,0.243409336068931
49.4822049322264,11.0850359341802,0.28218718005752
49.4822049322264,11.092230452194,0.316279193045706
49.4822049322264,11.0994249702079,0.318895190830998
49.4822049322264,11.1066194882217,0.458314176091577
49.4822049322264,11.1138140062356,0.288310417409889
49.4822049322264,11.1210085242495,0.41576746337202
49.4822049322264,11.1282030422633,0.373372072761902
49.4822049322264,11.1353975602772,0.410991085083831
49.4822049322264,11.142592078291,0.270142291252258
49.4867855699673,11.0202852720554,0.259199978263454
49.4867855699673,11.0274797900693,0.268545591917285
49.4867855699673,11.0346743080831,0.247186348035213
49.4867855699673,11.041868826097,0.25817524541408
49.4867855699673,11.0490633441109,0.270359638624358
49.4867855699673,11.0562578621247,0.353994465662961
49.4867855699673,11.0634523801386,0.347152103294273
49.4867855699673,11.0706468981524,0.350192985352065
49.4867855699673,11.0778414161663,0.276894523451376
49.4867855699673,11.0850359341802,0.290961227962869
49.4867855699673,11.092230452194,0.414038415178773
49.4867855699673,11.0994249702079,0.370680350202627
49.4867855699673,11.1066194882217,0.372609107716828
49.4867855699673,11.1138140062356,0.325678947017033
49.4867855699673,11.1210085242495,0.357687256528577
49.4867855699673,11.1282030422633,0.465241934054739
49.4867855699673,11.1353975602772,0.291393595578204
49.4867855699673,11.142592078291,0.326453604899786
49.4913662077081,11.0202852720554,0.259199978263454
49.4913662077081,11.0274797900693,0.249875575539977
49.4913662077081,11.0346743080831,0.229369721498454
49.4913662077081,11.041868826097,0.254577234187361
49.4913662077081,11.0490633441109,0.222768201493274
49.4913662077081,11.0562578621247,0.276213218604157
49.4913662077081,11.0634523801386,0.286832093758579
49.4913662077081,11.0706468981524,0.296645368475756
49.4913662077081,11.0778414161663,0.320096494215005
49.4913662077081,11.0850359341802,0.244997653341121
49.4913662077081,11.092230452194,0.298027081074378
49.4913662077081,11.0994249702079,0.278165211394588
49.4913662077081,11.1066194882217,0.312768915568963
49.4913662077081,11.1138140062356,0.271648581958504
49.4913662077081,11.1210085242495,0.297025722380213
49.4913662077081,11.1282030422633,0.318250493373553
49.495946845449,11.0202852720554,0.259199978263454
49.495946845449,11.0274797900693,0.259199978263454
49.495946845449,11.0346743080831,0.259199978263454
49.495946845449,11.041868826097,0.348487471968396
49.495946845449,11.0490633441109,0.278168375863283
49.495946845449,11.0562578621247,0.272824001456407
49.495946845449,11.0634523801386,0.259199978263454
49.495946845449,11.0706468981524,0.255952857635135
49.495946845449,11.0778414161663,0.382322535005491
49.495946845449,11.0850359341802,0.239696089627158
49.495946845449,11.092230452194,0.259199978263454
49.495946845449,11.0994249702079,0.259199978263454
49.495946845449,11.1066194882217,0.272825432913459
49.495946845449,11.1138140062356,0.239050585055454
49.495946845449,11.1210085242495,0.244064764861249
49.5005274831899,11.0274797900693,0.259199978263454
49.5005274831899,11.0346743080831,0.259199978263454
49.5005274831899,11.041868826097,0.288340856359622
49.5005274831899,11.0490633441109,0.262417229011822
49.5005274831899,11.0562578621247,0.265415362495751
49.5005274831899,11.0634523801386,0.259199978263454
49.5005274831899,11.0706468981524,0.259199978263454
49.5005274831899,11.0778414161663,0.259199978263454
49.5005274831899,11.0850359341802,0.259199978263454
49.5005274831899,11.092230452194,0.259199978263454
49.5005274831899,11.0994249702079,0.227348263648152
49.5005274831899,11.1066194882217,0.292970776365033
49.5005274831899,11.1138140062356,0.343125032458812
49.5005274831899,11.1210085242495,0.259199978263454
49.5051081209308,11.0274797900693,0.259199978263454
49.5051081209308,11.0346743080831,0.259199978263454
49.5051081209308,11.041868826097,0.259199978263454
49.5051081209308,11.0490633441109,0.259199978263454
49.5051081209308,11.0562578621247,0.347240391936882
49.5051081209308,11.0706468981524,0.259199978263454
49.5051081209308,11.0994249702079,0.256070145843377
49.5051081209308,11.1066194882217,0.491637652320279
49.5051081209308,11.1138140062356,0.332473385684591
49.5051081209308,11.1210085242495,0.259199978263454
49.5096887586717,11.0130907540416,0.317511027186346
49.5096887586717,11.0202852720554,0.30264157800988
49.5096887586717,11.0274797900693,0.259199978263454
49.5096887586717,11.0346743080831,0.247513853421477
49.5096887586717,11.041868826097,0.258233920907161
49.5096887586717,11.0490633441109,0.341561531135308
49.5096887586717,11.0562578621247,0.299423064294376
49.5096887586717,11.1138140062356,0.259199978263454
49.5142693964125,11.0058962360277,0.294180210497354
49.5142693964125,11.0130907540416,0.239021030638342
49.5142693964125,11.0202852720554,0.292771242581573
49.5142693964125,11.0274797900693,0.303914023836325
49.5142693964125,11.0346743080831,0.309174696407105
49.5142693964125,11.041868826097,0.268120343352573
49.5142693964125,11.0490633441109,0.294782560448667
49.5142693964125,11.0562578621247,0.259199978263454
49.5142693964125,11.0634523801386,0.259199978263454
49.5142693964125,11.1138140062356,0.259199978263454
49.5188500341534,11.0058962360277,0.306570977251207
49.5188500341534,11.0130907540416,0.260802733216012
49.5188500341534,11.0202852720554,0.29706021133225
49.5188500341534,11.0274797900693,0.365502642162445
49.5188500341534,11.0346743080831,0.416409431549924
49.5188500341534,11.041868826097,0.384434107316513
49.5188500341534,11.0490633441109,0.336447168469827
49.5188500341534,11.0562578621247,0.2650402884762
49.5188500341534,11.0634523801386,0.259199978263454
49.5234306718943,11.0058962360277,0.212424738365772
49.5234306718943,11.0130907540416,0.241778660428016
49.5234306718943,11.0202852720554,0.231218696252078
49.5234306718943,11.0274797900693,0.22659990197542
49.5234306718943,11.0346743080831,0.259199978263454
49.5234306718943,11.041868826097,0.327231899420891
49.5234306718943,11.0490633441109,0.276500256312085
49.5234306718943,11.0562578621247,0.252025042132086
49.5234306718943,11.0634523801386,0.259199978263454
49.5280113096352,10.9987017180139,0.259199978263454
49.5280113096352,11.0058962360277,0.247917384741576
49.5280113096352,11.0130907540416,0.362253888096897
49.5280113096352,11.0202852720554,0.279024387964974
49.5280113096352,11.0274797900693,0.259199978263454
49.5280113096352,11.0346743080831,0.259199978263454
49.5280113096352,11.041868826097,0.259199978263454
49.5280113096352,11.0490633441109,0.245124964110917
49.5280113096352,11.0562578621247,0.245909890896942
49.5325919473761,10.9987017180139,0.259199978263454
49.5325919473761,11.0058962360277,0.25695173492976
49.5325919473761,11.0130907540416,0.386076080682996
49.5325919473761,11.0202852720554,0.277744847689651
49.5325919473761,11.0274797900693,0.320384535703276
