nan,nan,9.418543992069032533e-02
1.097400258905298465e+01,5.213755135795308604e+01,1.055722283827255081e-01
1.091054679763628954e+01,5.222679915898922332e+01,1.180088404628504284e-01
1.091803435800415123e+01,5.242632440326215715e+01,1.298836691439216595e-01
1.080426708705454253e+01,5.225005311292675003e+01,1.408623525944011079e-01
1.093761250978231381e+01,5.218716169398663141e+01,1.524681698041271405e-01
1.101034968244378831e+01,5.222563903773876604e+01,1.676604049070703206e-01
1.096359963482849409e+01,5.215807847913954731e+01,1.798573559839002356e-01
1.099162967531250779e+01,5.222912423867431642e+01,1.914430994637067174e-01
1.099562872418205473e+01,5.229274576224871396e+01,2.028231847622597450e-01
1.104037328180336530e+01,5.213595335834574485e+01,2.144410800377513637e-01
