nan,nan,3.131371614392137737e-01
1.046651517600071557e+01,4.766642334442279605e+01,3.243739662790613432e-01
1.027546808853671045e+01,4.763038489555461297e+01,3.376250705858941936e-01
1.013503900061355623e+01,4.768948386790607685e+01,3.491010755533136001e-01
1.045241793723753609e+01,4.764547191214730759e+01,3.621299420225163601e-01
1.005945136220621805e+01,4.747086639190526114e+01,3.741046609507654441e-01
1.016028912572765996e+01,4.743882467960005300e+01,3.854807470045685802e-01
1.018788381171802016e+01,4.756940409278600868e+01,3.979144953308797472e-01
1.014650817169563801e+01,4.755634028195412810e+01,4.099732528841963930e-01
1.024645063811240853e+01,4.740073239901458635e+01,4.224162500409507359e-01
1.031700258514860025e+01,4.778506719838736672e+01,4.336678557770737852e-01
