nan,nan,4.149968584136509708e-01
8.672519046400553933e+00,5.005148368655503077e+01,4.285432656797565909e-01
8.967468501557618765e+00,5.005337114118920994e+01,4.404646276433013541e-01
8.938091573902394060e+00,5.005494493927923116e+01,4.520379583213016139e-01
8.976957207807870986e+00,5.004127650235734137e+01,4.659805406288598517e-01
8.990432957162321159e+00,5.001411005472758120e+01,4.784721091050209707e-01
8.710940253990340665e+00,5.000213633105145306e+01,4.926116631372748911e-01
8.739515943460919090e+00,4.998348710265956640e+01,5.047811761150308163e-01
8.807685077064107304e+00,5.001689540240248277e+01,5.166072686375268175e-01
8.616043967742806231e+00,5.003468722236979005e+01,5.289273719161838860e-01
8.852581345333751628e+00,5.009898356875435610e+01,5.422414599171391236e-01
