nan,nan,5.934277285044263495e-02
1.255821130000526509e+01,4.886826012771554417e+01,7.127307212438890871e-02
1.264465309590561048e+01,4.888516298315587250e+01,8.341154944113625402e-02
1.254214142724473113e+01,4.888266646907866431e+01,9.507223511352440315e-02
1.257701391895823839e+01,4.886029343018088866e+01,1.061028311519634643e-01
1.256094337681175332e+01,4.890607979514390991e+01,1.172193758056822854e-01
1.252890716719102038e+01,4.886013913958054644e+01,1.279764157569354133e-01
1.253290698571986894e+01,4.890506524898423635e+01,1.387324483934820052e-01
1.250268714790903601e+01,4.886561819748549595e+01,1.495358196724874134e-01
1.263127773955078936e+01,4.890280460197967471e+01,1.602717427427149399e-01
1.265164334938403634e+01,4.890367738812048515e+01,1.709815794301533243e-01
