nan,nan,2.384084760669358538e-01
7.664153842780900838e+00,4.820195253910524258e+01,2.501159887130816051e-01
7.807413614087021614e+00,4.812818058471408023e+01,2.633311027611852095e-01
7.906685483882353260e+00,4.806536657085538167e+01,2.759634859364312187e-01
7.795638986687920102e+00,4.815856863376752983e+01,2.874706128067390232e-01
7.775253510976646076e+00,4.810506244632043149e+01,3.004967062942771605e-01
7.835891684684519021e+00,4.808240146389207581e+01,3.126435629312141473e-01
8.094534037181718489e+00,4.815438549032068494e+01,3.245478210775463723e-01
7.851939813421147996e+00,4.806803761875505643e+01,3.364216782329353395e-01
7.816369382772742291e+00,4.819363548756820848e+01,3.480423140896498624e-01
7.606359408239402597e+00,4.812276401683785565e+01,3.593692290062509009e-01
