nan,nan,1.020628903962971651e-01
8.792020883636340045e+00,5.072059268039202351e+01,1.157398457773232137e-01
8.936539773967501432e+00,5.074568814055574251e+01,1.285650992247966973e-01
8.474869235980909465e+00,5.083860073557112003e+01,1.413520113399256428e-01
8.765951708577102153e+00,5.081491036730717781e+01,1.566005800924749891e-01
8.806791243649540135e+00,5.081543678154773147e+01,1.696339197470108917e-01
8.768094061145427887e+00,5.084236748224915914e+01,1.823985727081068042e-01
8.630592490792084348e+00,5.073745595882493120e+01,1.952378368939226283e-01
8.702665938282217795e+00,5.073627904135759792e+01,2.071365474741425905e-01
8.818933975171642459e+00,5.085487624969953657e+01,2.197827943794939676e-01
8.817747695685815401e+00,5.078203153129816627e+01,2.319492263941779764e-01
