nan,nan,2.990733742966038000e-01
9.797784776027937070e+00,4.808533676761806674e+01,3.107586075410113668e-01
1.008127458475573057e+01,4.813481958117569803e+01,3.227730464521478271e-01
9.822194195873699130e+00,4.810997271850230561e+01,3.342384565464425195e-01
9.615527709071459483e+00,4.814416479493924328e+01,3.456714813012652376e-01
9.787161502361852783e+00,4.802417698469751883e+01,3.579877328792142044e-01
9.957497165316745225e+00,4.822388785380325515e+01,3.701178751406528078e-01
9.460442316523071327e+00,4.809978772709193606e+01,3.810903878607641571e-01
9.845613803558567412e+00,4.796822568224951056e+01,3.934432143706357854e-01
9.683288072250869405e+00,4.801491423125006719e+01,4.048399923202360973e-01
9.769401784709090819e+00,4.820064700430195614e+01,4.173511003927839469e-01
