51.4831903,7.0896481966333,0.260491879025287
51.4831903,7.09684273483586,0.259199978263454
51.4831903,7.10403727303843,0.244264649118101
51.4877206391046,7.07525912022818,0.325195620183357
51.4877206391046,7.08245365843074,0.330837904531722
51.4877206391046,7.0896481966333,0.269561916228394
51.4877206391046,7.09684273483586,0.259527423427214
51.4877206391046,7.10403727303843,0.261352052165865
51.4877206391046,7.11123181124099,0.259199978263454
51.4877206391046,7.11842634944355,0.306893494781007
51.4922509782092,7.07525912022818,0.387679810316663
51.4922509782092,7.08245365843074,0.440328822086716
51.4922509782092,7.0896481966333,0.332658532818941
51.4922509782092,7.09684273483586,0.326361716980232
51.4922509782092,7.10403727303843,0.373267338066282
51.4922509782092,7.11123181124099,0.304381016074345
51.4922509782092,7.11842634944355,0.420637394632082
51.4922509782092,7.12562088764611,0.259494912269889
51.4922509782092,7.13281542584867,0.247627148409193
51.4967813173137,7.07525912022818,0.34503999262897
51.4967813173137,7.08245365843074,0.341777807440376
51.4967813173137,7.0896481966333,0.322029657508331
51.4967813173137,7.09684273483586,0.452670610885194
51.4967813173137,7.10403727303843,0.39551156674972
51.4967813173137,7.11123181124099,0.468172097302784
51.4967813173137,7.11842634944355,0.309530134763578
51.4967813173137,7.12562088764611,0.415505650661327
51.4967813173137,7.13281542584867,0.285958385365294
51.5013116564183,7.06087004382306,0.405723283097719
51.5013116564183,7.06806458202562,0.282700162278915
51.5013116564183,7.07525912022818,0.335235726145571
51.5013116564183,7.08245365843074,0.301212438112213
51.5013116564183,7.0896481966333,0.214703498160146
51.5013116564183,7.09684273483586,0.287111817121603
51.5013116564183,7.10403727303843,0.37006986356461
51.5013116564183,7.11123181124099,0.467199881399961
51.5013116564183,7.11842634944355,0.419502310856336
51.5013116564183,7.12562088764611,0.30361673069117
51.5013116564183,7.13281542584867,0.312923478008097
51.5058419955229,7.05367550562049,0.27044985931072
51.5058419955229,7.06087004382306,0.308011218291698
51.5058419955229,7.06806458202562,0.26572067720491
51.5058419955229,7.07525912022818,0.374301448299773
51.5058419955229,7.08245365843074,0.367852475055589
51.5058419955229,7.0896481966333,0.34841445283469
51.5058419955229,7.09684273483586,0.522394327563708
51.5058419955229,7.10403727303843,0.52260374231167
51.5058419955229,7.11123181124099,0.234210367281223
51.5058419955229,7.11842634944355,0.312351912593932
51.5058419955229,7.12562088764611,0.297217176284075
51.5058419955229,7.13281542584867,0.267141564086278
51.5103723346275,7.05367550562049,0.273059494676725
51.5103723346275,7.06087004382306,0.266972087052535
51.5103723346275,7.06806458202562,0.485215312802373
51.5103723346275,7.07525912022818,0.524971621221566
51.5103723346275,7.08245365843074,0.516974980456668
51.5103723346275,7.0896481966333,0.503878081091156
51.5103723346275,7.09684273483586,0.798116173834568
51.5103723346275,7.10403727303843,0.384443043896552
51.5103723346275,7.11123181124099,0.226905738604119
51.5103723346275,7.11842634944355,0.337264193300293
51.5103723346275,7.12562088764611,0.177008021386204
51.5103723346275,7.13281542584867,0.250059572005728
51.5149026737321,7.03928642921537,0.259199978263454
51.5149026737321,7.04648096741793,0.260102413388979
51.5149026737321,7.05367550562049,0.315780772655768
51.5149026737321,7.06087004382306,0.343250968392034
51.5149026737321,7.06806458202562,0.396286301590314
51.5149026737321,7.07525912022818,0.358174562702062
51.5149026737321,7.08245365843074,0.351978977697874
51.5149026737321,7.0896481966333,0.521581331834182
51.5149026737321,7.09684273483586,0.736555195402623
51.5149026737321,7.10403727303843,0.518192665059868
51.5149026737321,7.11123181124099,0.3648712397596
51.5149026737321,7.11842634944355,0.454986406320569
51.5149026737321,7.12562088764611,0.332355227408598
51.5149026737321,7.13281542584867,0.225830132265647
51.5194330128367,7.02489735281025,0.259199978263454
51.5194330128367,7.03209189101281,0.306686733480471
51.5194330128367,7.03928642921537,0.302899141212914
51.5194330128367,7.04648096741793,0.370000709117401
51.5194330128367,7.05367550562049,0.320413871620762
51.5194330128367,7.06087004382306,0.459450216196432
51.5194330128367,7.06806458202562,0.327710558854988
51.5194330128367,7.07525912022818,0.378637683626836
51.5194330128367,7.08245365843074,0.233367848238841
51.5194330128367,7.0896481966333,0.628139450219466
51.5194330128367,7.09684273483586,0.492180231055131
51.5194330128367,7.10403727303843,0.354173131607581
51.5194330128367,7.11123181124099,0.282686042899656
51.5194330128367,7.11842634944355,0.443088030554
51.5194330128367,7.12562088764611,0.302146992682684
51.5194330128367,7.13281542584867,0.328320907536535
51.5239633519412,7.01770281460769,0.329247195063309
51.5239633519412,7.02489735281025,0.313640240985952
51.5239633519412,7.03209189101281,0.376434645523878
51.5239633519412,7.03928642921537,0.454130049265241
51.5239633519412,7.04648096741793,0.345528649993941
51.5239633519412,7.05367550562049,0.285436248073006
51.5239633519412,7.06087004382306,0.394531217773735
51.5239633519412,7.06806458202562,0.221729818103461
51.5239633519412,7.07525912022818,0.362150356334385
51.5239633519412,7.08245365843074,0.286946242391081
51.5239633519412,7.0896481966333,0.451156266012159
51.5239633519412,7.09684273483586,0.354426029086092
51.5239633519412,7.10403727303843,0.434395754570829
51.5239633519412,7.11123181124099,0.366060574343601
51.5239633519412,7.11842634944355,0.365980284851392
51.5239633519412,7.12562088764611,0.310849929647811
51.5239633519412,7.13281542584867,0.290918844789407
51.5284936910458,7.01770281460769,0.352981325633994
51.5284936910458,7.02489735281025,0.458899502240046
51.5284936910458,7.03209189101281,0.346527565391396
51.5284936910458,7.03928642921537,0.398123482030755
51.5284936910458,7.04648096741793,0.295472903440051
51.5284936910458,7.05367550562049,0.237551325770172
51.5284936910458,7.06087004382306,0.283645873090351
51.5284936910458,7.06806458202562,0.25976473344911
51.5284936910458,7.07525912022818,0.271968694517212
51.5284936910458,7.08245365843074,0.317341657560435
51.5284936910458,7.0896481966333,0.280364367341602
51.5284936910458,7.09684273483586,0.299452340776228
51.5284936910458,7.10403727303843,0.400776074341068
51.5284936910458,7.11123181124099,0.453168885797544
51.5284936910458,7.11842634944355,0.421017913341963
51.5284936910458,7.12562088764611,0.38088434427914
51.5284936910458,7.13281542584867,0.280047353336084
51.5330240301504,7.01050827640512,0.245523656612786
51.5330240301504,7.01770281460769,0.359652424567681
51.5330240301504,7.02489735281025,0.445062727541319
51.5330240301504,7.03209189101281,0.349934324512547
51.5330240301504,7.03928642921537,0.300507590140994
51.5330240301504,7.04648096741793,0.259199978263454
51.5330240301504,7.05367550562049,0.259199978263454
51.5330240301504,7.06087004382306,0.307906381694116
51.5330240301504,7.06806458202562,0.288174913844518
51.5330240301504,7.07525912022818,0.262262154564875
51.5330240301504,7.08245365843074,0.275496009859292
51.5330240301504,7.0896481966333,0.259410837012104
51.5330240301504,7.09684273483586,0.353551529719875
51.5330240301504,7.10403727303843,0.3244204288571
51.5330240301504,7.11123181124099,0.36174411059795
51.5330240301504,7.11842634944355,0.366596324530147
51.5330240301504,7.12562088764611,0.29121941684782
51.537554369255,7.01770281460769,0.409566764679203
51.537554369255,7.02489735281025,0.584373050257322
51.537554369255,7.03209189101281,0.308493668856062
51.537554369255,7.03928642921537,0.256444560213187
51.537554369255,7.04648096741793,0.259199978263454
51.537554369255,7.05367550562049,0.259199978263454
51.537554369255,7.06087004382306,0.305695414057076
51.537554369255,7.06806458202562,0.372209770582062
51.537554369255,7.07525912022818,0.36190072336954
51.537554369255,7.08245365843074,0.314415150074368
51.537554369255,7.0896481966333,0.259199978263454
51.537554369255,7.09684273483586,0.260591646247079
51.537554369255,7.10403727303843,0.291894341186416
51.537554369255,7.11123181124099,0.213803332794642
51.537554369255,7.11842634944355,0.254590688490609
51.537554369255,7.12562088764611,0.241372068726988
51.5420847083596,7.02489735281025,0.254884149036726
51.5420847083596,7.03209189101281,0.213871522181367
51.5420847083596,7.03928642921537,0.265886418814561
51.5420847083596,7.04648096741793,0.211374100205141
51.5420847083596,7.05367550562049,0.243866206754082
51.5420847083596,7.06087004382306,0.28992109492994
51.5420847083596,7.06806458202562,0.452875133423141
51.5420847083596,7.07525912022818,0.436807610635996
51.5420847083596,7.08245365843074,0.271485401328366
51.5420847083596,7.0896481966333,0.302244432730328
51.5420847083596,7.09684273483586,0.32826028338539
51.5420847083596,7.10403727303843,0.351471190062772
51.5420847083596,7.11123181124099,0.421863041444705
51.5420847083596,7.11842634944355,0.385095834096826
51.5420847083596,7.12562088764611,0.271053158853038
51.5466150474642,7.03209189101281,0.302149868667254
51.5466150474642,7.03928642921537,0.348377187662526
51.5466150474642,7.04648096741793,0.286779876399629
51.5466150474642,7.05367550562049,0.28238216874114
51.5466150474642,7.06087004382306,0.375749839896874
51.5466150474642,7.06806458202562,0.267391529305146
51.5466150474642,7.07525912022818,0.318043567843653
51.5466150474642,7.08245365843074,0.273963890417324
51.5466150474642,7.0896481966333,0.286377605856899
51.5466150474642,7.09684273483586,0.374752683447251
51.5466150474642,7.10403727303843,0.345435091984967
51.5466150474642,7.11123181124099,0.347186120396876
51.5466150474642,7.11842634944355,0.361007790764991
51.5511453865687,7.03209189101281,0.411575356323096
51.5511453865687,7.03928642921537,0.334566887645176
51.5511453865687,7.04648096741793,0.419325997140858
51.5511453865687,7.05367550562049,0.305458279239426
51.5511453865687,7.06087004382306,0.272314712130953
51.5511453865687,7.06806458202562,0.284251169546616
51.5511453865687,7.07525912022818,0.427850124214737
51.5511453865687,7.08245365843074,0.283198439458236
51.5511453865687,7.0896481966333,0.236130647443798
51.5511453865687,7.09684273483586,0.383468758681065
51.5511453865687,7.10403727303843,0.324938158795897
51.5511453865687,7.11123181124099,0.259199978263454
51.5511453865687,7.11842634944355,0.259199978263454
51.5511453865687,7.12562088764611,0.259199978263454
51.5556757256733,7.02489735281025,0.304599352178565
51.5556757256733,7.03209189101281,0.316533192151075
51.5556757256733,7.03928642921537,0.455340978641647
51.5556757256733,7.04648096741793,0.404773349450241
51.5556757256733,7.05367550562049,0.258007809480868
51.5556757256733,7.06087004382306,0.27258410945283
51.5556757256733,7.06806458202562,0.406681784424579
51.5556757256733,7.07525912022818,0.36226877205025
51.5556757256733,7.08245365843074,0.442417251917547
51.5556757256733,7.0896481966333,0.316476538708293
51.5556757256733,7.09684273483586,0.501268754231802
51.5556757256733,7.10403727303843,0.307448819767157
51.5556757256733,7.11123181124099,0.229945136174624
51.5556757256733,7.11842634944355,0.259199978263454
51.5556757256733,7.12562088764611,0.259199978263454
51.5556757256733,7.13281542584867,0.259199978263454
51.5602060647779,7.02489735281025,0.467262530840992
51.5602060647779,7.03209189101281,0.335152675394552
51.5602060647779,7.03928642921537,0.306585333170093
51.5602060647779,7.04648096741793,0.211590667756176
51.5602060647779,7.05367550562049,0.222865252343045
51.5602060647779,7.06087004382306,0.317002481657278
51.5602060647779,7.06806458202562,0.360195467537954
51.5602060647779,7.07525912022818,0.328478894832977
51.5602060647779,7.08245365843074,0.340674369070371
51.5602060647779,7.0896481966333,0.362701360533967
51.5602060647779,7.09684273483586,0.453311225225532
51.5602060647779,7.10403727303843,0.287138876777906
51.5602060647779,7.11123181124099,0.321150303177996
51.5602060647779,7.11842634944355,0.300817040063445
51.5602060647779,7.12562088764611,0.300283723840195
51.5602060647779,7.13281542584867,0.259199978263454
51.5647364038825,7.01770281460769,0.304069762720327
51.5647364038825,7.02489735281025,0.357226986411493
51.5647364038825,7.03209189101281,0.302548640187879
51.5647364038825,7.03928642921537,0.339544457483339
51.5647364038825,7.04648096741793,0.340975987065664
51.5647364038825,7.05367550562049,0.306080309767104
51.5647364038825,7.06087004382306,0.251656537802438
51.5647364038825,7.06806458202562,0.413582593783999
51.5647364038825,7.07525912022818,0.364309502443784
51.5647364038825,7.08245365843074,0.300581968656131
51.5647364038825,7.0896481966333,0.369144050745291
51.5647364038825,7.09684273483586,0.247222287093526
51.5647364038825,7.10403727303843,0.338785978762201
51.5647364038825,7.11123181124099,0.435930491672994
51.5647364038825,7.11842634944355,0.286430982627065
51.5647364038825,7.12562088764611,0.290983751728422
51.5647364038825,7.13281542584867,0.305740589792932
51.5692667429871,7.01770281460769,0.259199978263454
51.5692667429871,7.02489735281025,0.259199978263454
51.5692667429871,7.03209189101281,0.355959518619701
51.5692667429871,7.03928642921537,0.359868628668214
51.5692667429871,7.04648096741793,0.337326204879119
51.5692667429871,7.05367550562049,0.433671489172915
51.5692667429871,7.06087004382306,0.389339721466265
51.5692667429871,7.06806458202562,0.327800667917732
51.5692667429871,7.07525912022818,0.318167346949495
51.5692667429871,7.08245365843074,0.317309292885011
51.5692667429871,7.0896481966333,0.360984370805518
51.5692667429871,7.09684273483586,0.295750717840122
51.5692667429871,7.10403727303843,0.244175889899248
51.5692667429871,7.11123181124099,0.350636150269306
51.5692667429871,7.11842634944355,0.321601937490358
51.5692667429871,7.12562088764611,0.259199978263454
51.5692667429871,7.13281542584867,0.263075236829201
51.5737970820917,7.01770281460769,0.259199978263454
51.5737970820917,7.02489735281025,0.399769273346508
51.5737970820917,7.03209189101281,0.456783229877315
51.5737970820917,7.03928642921537,0.60312102299399
51.5737970820917,7.04648096741793,0.419573352916935
51.5737970820917,7.05367550562049,0.354414723625099
51.5737970820917,7.06087004382306,0.232505644427641
51.5737970820917,7.06806458202562,0.419604982620076
51.5737970820917,7.07525912022818,0.272125771723997
51.5737970820917,7.08245365843074,0.378797721994639
51.5737970820917,7.0896481966333,0.363947619591788
51.5737970820917,7.09684273483586,0.35600453534538
51.5737970820917,7.10403727303843,0.317615564707155
51.5737970820917,7.11123181124099,0.374292602960701
51.5737970820917,7.11842634944355,0.409974375942898
51.5737970820917,7.12562088764611,0.273414682963844
51.5737970820917,7.13281542584867,0.259199978263454
51.5783274211962,7.01770281460769,0.270463524248748
51.5783274211962,7.02489735281025,0.305218933507407
51.5783274211962,7.03209189101281,0.342324739349466
51.5783274211962,7.03928642921537,0.385595528420225
51.5783274211962,7.04648096741793,0.454590323381815
51.5783274211962,7.05367550562049,0.713814698133676
51.5783274211962,7.06087004382306,0.536793093795507
51.5783274211962,7.06806458202562,0.292512989314656
51.5783274211962,7.07525912022818,0.27581611457772
51.5783274211962,7.08245365843074,0.316017678850928
51.5783274211962,7.0896481966333,0.295829228283824
51.5783274211962,7.09684273483586,0.342971440366404
51.5783274211962,7.10403727303843,0.482283086205233
51.5783274211962,7.11123181124099,0.34604075218896
51.5783274211962,7.11842634944355,0.316009742819653
51.5783274211962,7.12562088764611,0.259199978263454
51.5828577603008,7.01770281460769,0.366828346323767
51.5828577603008,7.02489735281025,0.314004890991752
51.5828577603008,7.03209189101281,0.372630168175219
51.5828577603008,7.03928642921537,0.330416307874659
51.5828577603008,7.04648096741793,0.413944426915368
51.5828577603008,7.05367550562049,0.635623602665743
51.5828577603008,7.06087004382306,0.325244623759363
51.5828577603008,7.06806458202562,0.306470270313543
51.5828577603008,7.07525912022818,0.305419548084374
51.5828577603008,7.08245365843074,0.361422836956684
51.5828577603008,7.0896481966333,0.258275441784575
51.5828577603008,7.09684273483586,0.25992104380304
51.5828577603008,7.10403727303843,0.315482927827641
51.5828577603008,7.11123181124099,0.400098488093577
51.5828577603008,7.11842634944355,0.38770068383472
51.5873880994054,7.01770281460769,0.302835815525446
51.5873880994054,7.02489735281025,0.278480846013877
51.5873880994054,7.03209189101281,0.236322740883285
51.5873880994054,7.03928642921537,0.342472829820505
51.5873880994054,7.04648096741793,0.285966553359001
51.5873880994054,7.05367550562049,0.275192680113803
51.5873880994054,7.06087004382306,0.223909633554132
51.5873880994054,7.06806458202562,0.256806264271552
51.5873880994054,7.07525912022818,0.396157473673223
51.5873880994054,7.08245365843074,0.249453275017534
51.5873880994054,7.0896481966333,0.258010931480218
51.5873880994054,7.09684273483586,0.257998695596531
51.5873880994054,7.10403727303843,0.250108138286433
51.5873880994054,7.11123181124099,0.360125882388845
51.59191843851,7.01050827640512,0.416863832260954
51.59191843851,7.01770281460769,0.430333176759053
51.59191843851,7.02489735281025,0.347196757059482
51.59191843851,7.03209189101281,0.249086742684949
51.59191843851,7.03928642921537,0.248734426659155
51.59191843851,7.04648096741793,0.3087014178601
51.59191843851,7.05367550562049,0.383644859404232
51.59191843851,7.06087004382306,0.30556280153455
51.59191843851,7.06806458202562,0.261633929222006
51.59191843851,7.09684273483586,0.259199978263454
51.59191843851,7.10403727303843,0.334463732115086
51.5964487776146,6.9961192,0.288979632151962
51.5964487776146,7.00331373820256,0.259153345517393
51.5964487776146,7.01050827640512,0.285595122640238
51.5964487776146,7.01770281460769,0.324449604864625
51.5964487776146,7.02489735281025,0.284762343098949
51.5964487776146,7.03209189101281,0.259199978263454
51.5964487776146,7.03928642921537,0.254182070323275
51.5964487776146,7.04648096741793,0.28824864299785
51.5964487776146,7.05367550562049,0.341144988489065
51.5964487776146,7.06087004382306,0.363406756520448
51.5964487776146,7.06806458202562,0.348704703275509
51.5964487776146,7.07525912022818,0.276844830911546
51.6009791167192,7.00331373820256,0.259199978263454
51.6009791167192,7.01050827640512,0.259199978263454
51.6009791167192,7.01770281460769,0.259199978263454
51.6009791167192,7.02489735281025,0.259199978263454
51.6009791167192,7.03209189101281,0.259199978263454
51.6009791167192,7.03928642921537,0.281648549456393
51.6009791167192,7.04648096741793,0.344596142236268
51.6009791167192,7.05367550562049,0.35633507467867
51.6009791167192,7.06087004382306,0.346699505229623
51.6009791167192,7.06806458202562,0.289521248760283
51.6009791167192,7.07525912022818,0.259199978263454
51.6055094558237,7.00331373820256,0.259199978263454
51.6055094558237,7.01050827640512,0.259199978263454
51.6055094558237,7.01770281460769,0.259199978263454
51.6055094558237,7.02489735281025,0.259199978263454
51.6055094558237,7.03209189101281,0.259199978263454
51.6055094558237,7.03928642921537,0.230137584751423
51.6055094558237,7.04648096741793,0.168085052097787
51.6055094558237,7.05367550562049,0.354482446013969
51.6055094558237,7.06087004382306,0.344875988988669
51.6055094558237,7.06806458202562,0.259199978263454
51.6055094558237,7.07525912022818,0.259199978263454
51.6100397949283,6.9961192,0.259199978263454
51.6100397949283,7.00331373820256,0.259199978263454
51.6100397949283,7.01050827640512,0.259199978263454
51.6100397949283,7.01770281460769,0.259199978263454
51.6100397949283,7.02489735281025,0.259199978263454
51.6100397949283,7.03209189101281,0.259199978263454
51.6100397949283,7.03928642921537,0.359639689530587
51.6100397949283,7.04648096741793,0.337722582198959
51.6100397949283,7.05367550562049,0.580306988162434
51.6100397949283,7.06087004382306,0.305794706453624
51.6100397949283,7.06806458202562,0.277634233387057
51.6145701340329,6.9961192,0.259199978263454
51.6145701340329,7.00331373820256,0.251258286087304
51.6145701340329,7.01050827640512,0.259199978263454
51.6145701340329,7.01770281460769,0.259199978263454
51.6145701340329,7.02489735281025,0.259199978263454
51.6145701340329,7.03209189101281,0.259199978263454
51.6145701340329,7.03928642921537,0.27504232272176
51.6145701340329,7.04648096741793,0.259199978263454
51.6145701340329,7.05367550562049,0.26172205312687
51.6145701340329,7.06087004382306,0.270147254844541
51.6191004731375,7.00331373820256,0.242701071466874
51.6191004731375,7.01050827640512,0.272609141681155
51.6191004731375,7.01770281460769,0.285308278413286
51.6191004731375,7.02489735281025,0.259199978263454
51.6191004731375,7.03209189101281,0.260892690410184
51.6191004731375,7.03928642921537,0.368580071908076
51.6191004731375,7.04648096741793,0.263169645763701
51.6236308122421,6.9961192,0.259199978263454
51.6236308122421,7.00331373820256,0.259199978263454
51.6236308122421,7.01050827640512,0.263379813139505
51.6236308122421,7.01770281460769,0.271102616107931
51.6236308122421,7.02489735281025,0.259199978263454
51.6236308122421,7.03209189101281,0.252647236663266
51.6236308122421,7.03928642921537,0.235848791782332
