nan,nan,2.794045976803359865e-01
9.499671822655262332e+00,4.978466182448870114e+01,2.913699946366215543e-01
9.530022426561659543e+00,4.972672505762548667e+01,3.049716797850793304e-01
9.703808665557232871e+00,4.954035658339891057e+01,3.162880648921558846e-01
9.683085485591425012e+00,4.963526835276456950e+01,3.281842717110431407e-01
9.797023415858351569e+00,4.947341965214679504e+01,3.397933866347634946e-01
9.695040962006101992e+00,4.959734579857631331e+01,3.517992982812220837e-01
9.546568756531250699e+00,4.971366402963129616e+01,3.644262501989562475e-01
9.946723513660606031e+00,4.941962226860168528e+01,3.758585686593921560e-01
1.006508170025637483e+01,4.953295895617773681e+01,3.869248496367984069e-01
9.840144340171244508e+00,4.961351186739653230e+01,3.990290086130726666e-01
