<?xml version="1.0" encoding="UTF-8" standalone="no"?>
<!-- Creator: CorelDRAW -->
<svg
   xmlns:dc="http://purl.org/dc/elements/1.1/"
   xmlns:cc="http://creativecommons.org/ns#"
   xmlns:rdf="http://www.w3.org/1999/02/22-rdf-syntax-ns#"
   xmlns:svg="http://www.w3.org/2000/svg"
   xmlns="http://www.w3.org/2000/svg"
   xmlns:sodipodi="http://sodipodi.sourceforge.net/DTD/sodipodi-0.dtd"
   xmlns:inkscape="http://www.inkscape.org/namespaces/inkscape"
   xml:space="preserve"
   width="32"
   height="32"
   style="fill-rule:evenodd"
   viewBox="0 0 148 209.314"
   version="1.0"
   id="svg2"
   sodipodi:version="0.32"
   inkscape:version="0.46"
   sodipodi:docname="module_python.svg"
   inkscape:output_extension="org.inkscape.output.svg.inkscape"><metadata
   id="metadata29"><rdf:RDF><cc:Work
       rdf:about=""><dc:format>image/svg+xml</dc:format><dc:type
         rdf:resource="http://purl.org/dc/dcmitype/StillImage" /></cc:Work></rdf:RDF></metadata><sodipodi:namedview
   inkscape:window-height="713"
   inkscape:window-width="640"
   inkscape:pageshadow="2"
   inkscape:pageopacity="0.0"
   guidetolerance="10.0"
   gridtolerance="10.0"
   objecttolerance="10.0"
   borderopacity="1.0"
   bordercolor="#666666"
   pagecolor="#ffffff"
   id="base"
   showgrid="false"
   inkscape:zoom="5.3285602"
   inkscape:cx="2.4874264"
   inkscape:cy="9.8843896"
   inkscape:window-x="20"
   inkscape:window-y="20"
   inkscape:current-layer="svg2" />
 <defs
   id="defs4"><inkscape:perspective
   sodipodi:type="inkscape:persp3d"
   inkscape:vp_x="0 : 370.83188 : 1"
   inkscape:vp_y="0 : 1000 : 0"
   inkscape:vp_z="524.40942 : 370.83188 : 1"
   inkscape:persp3d-origin="262.20471 : 247.22125 : 1"
   id="perspective31" />
  <style
   type="text/css"
   id="style6">
   
    .fil1 {fill:url(#id0);fill-rule:nonzero}
    .fil0 {fill:url(#id1);fill-rule:nonzero}
   
  </style>
  <linearGradient
   id="id0"
   gradientUnits="userSpaceOnUse"
   x1="54.030102"
   y1="76.828796"
   x2="69.751602"
   y2="92.279099">
   <stop
   offset="0"
   style="stop-color:#F5D643"
   id="stop9" />
   <stop
   offset="1"
   style="stop-color:#F0B42C"
   id="stop11" />
   <stop
   offset="1"
   style="stop-color:#F0B42C"
   id="stop13" />
  </linearGradient>
  <linearGradient
   id="id1"
   gradientUnits="userSpaceOnUse"
   x1="49.119598"
   y1="71.838699"
   x2="64.848396"
   y2="87.281601">
   <stop
   offset="0"
   style="stop-color:#2981B8"
   id="stop16" />
   <stop
   offset="1"
   style="stop-color:#356E99"
   id="stop18" />
   <stop
   offset="1"
   style="stop-color:#356E99"
   id="stop20" />
  </linearGradient>
 </defs>
 <g
   id="Ebene_x0020_1"
   transform="matrix(6.5156406,0,0,9.9058022,-311.56599,-707.16587)">
  <metadata
   id="CorelCorpID_0Corel-Layer" />
  <path
   class="fil0"
   d="M 59.3632,71.8157 C 54.13619,71.8157 54.46257,74.08243 54.46257,74.08243 L 54.46842,76.43077 L 59.45644,76.43077 L 59.45644,77.135884 L 52.48719,77.135884 C 52.48719,77.135884 49.14239,76.756581 49.14239,82.030664 C 49.14239,87.304754 52.0618,87.117774 52.0618,87.117774 L 53.80411,87.117774 L 53.80411,84.670344 C 53.80411,84.670344 53.710165,81.750934 56.67686,81.750934 C 59.64356,81.750934 61.62408,81.750934 61.62408,81.750934 C 61.62408,81.750934 64.40359,81.795898 64.40359,79.064594 C 64.40359,76.333364 64.40359,74.548554 64.40359,74.548554 C 64.40359,74.548554 64.825601,71.815624 59.36313,71.815624 L 59.3632,71.815694 L 59.3632,71.8157 z M 56.6128,73.39486 C 57.109093,73.39486 57.510173,73.79594 57.510173,74.292233 C 57.510173,74.788526 57.109093,75.189606 56.6128,75.189606 C 56.116507,75.189606 55.715427,74.788526 55.715427,74.292233 C 55.715427,73.79594 56.116507,73.39486 56.6128,73.39486 z"
   id="path24"
   style="fill:url(#id1);fill-rule:nonzero" />
  <path
   class="fil1"
   d="M 59.5116,92.2984 C 64.73861,92.2984 64.41223,90.03167 64.41223,90.03167 L 64.40638,87.68333 L 59.41836,87.68333 L 59.41836,86.978216 L 66.38761,86.978216 C 66.38761,86.978216 69.73241,87.357519 69.73241,82.083436 C 69.73241,76.809346 66.813,76.996326 66.813,76.996326 L 65.07069,76.996326 L 65.07069,79.443756 C 65.07069,79.443756 65.164635,82.363166 62.19794,82.363166 C 59.23124,82.363166 57.25072,82.363166 57.25072,82.363166 C 57.25072,82.363166 54.47121,82.318202 54.47121,85.049506 C 54.47121,87.780736 54.47121,89.565546 54.47121,89.565546 C 54.47121,89.565546 54.049199,92.298476 59.51167,92.298476 L 59.5116,92.298406 L 59.5116,92.2984 z M 62.262,90.71924 C 61.765707,90.71924 61.364627,90.31816 61.364627,89.821867 C 61.364627,89.325574 61.765707,88.924494 62.262,88.924494 C 62.758293,88.924494 63.159373,89.325574 63.159373,89.821867 C 63.159373,90.31816 62.758293,90.71924 62.262,90.71924 z"
   id="path26"
   style="fill:url(#id0);fill-rule:nonzero" />
 </g>
</svg>