<?xml version="1.0" encoding="UTF-8" standalone="no"?>
<!-- Created with Sodipodi ("http://www.sodipodi.com/") -->

<svg
   xmlns:dc="http://purl.org/dc/elements/1.1/"
   xmlns:cc="http://creativecommons.org/ns#"
   xmlns:rdf="http://www.w3.org/1999/02/22-rdf-syntax-ns#"
   xmlns:svg="http://www.w3.org/2000/svg"
   xmlns="http://www.w3.org/2000/svg"
   xmlns:xlink="http://www.w3.org/1999/xlink"
   xmlns:sodipodi="http://sodipodi.sourceforge.net/DTD/sodipodi-0.dtd"
   xmlns:inkscape="http://www.inkscape.org/namespaces/inkscape"
   width="48pt"
   height="48pt"
   viewBox="0 0 256 256"
   overflow="visible"
   enable-background="new 0 0 256 256"
   xml:space="preserve"
   id="svg153"
   sodipodi:version="0.32pre"
   sodipodi:docname="newParameterRange.svg"
   version="1.1"
   inkscape:version="0.48.1 r9760"><metadata
   id="metadata25"><rdf:RDF><cc:Work
       rdf:about=""><dc:format>image/svg+xml</dc:format><dc:type
         rdf:resource="http://purl.org/dc/dcmitype/StillImage" /><dc:title /></cc:Work></rdf:RDF></metadata>
  <defs
   id="defs181"><linearGradient
     id="XMLID_2_"
     gradientUnits="userSpaceOnUse"
     x1="121.918"
     y1="185.75"
     x2="249.582"
     y2="185.75"><stop
       offset="0"
       style="stop-color:#FFFF66"
       id="stop173" /><stop
       offset="1"
       style="stop-color:#FFCC66"
       id="stop174" /></linearGradient><linearGradient
     inkscape:collect="always"
     xlink:href="#XMLID_2_"
     id="linearGradient3068"
     gradientUnits="userSpaceOnUse"
     x1="121.918"
     y1="185.75"
     x2="249.582"
     y2="185.75" /><linearGradient
     inkscape:collect="always"
     xlink:href="#XMLID_2_-0"
     id="linearGradient3068-2"
     gradientUnits="userSpaceOnUse"
     x1="121.918"
     y1="185.75"
     x2="249.582"
     y2="185.75" /><linearGradient
     id="XMLID_2_-0"
     gradientUnits="userSpaceOnUse"
     x1="121.918"
     y1="185.75"
     x2="249.582"
     y2="185.75"><stop
       offset="0"
       style="stop-color:#FFFF66"
       id="stop173-1" /><stop
       offset="1"
       style="stop-color:#FFCC66"
       id="stop174-9" /></linearGradient></defs>
  <sodipodi:namedview
   id="base"
   showgrid="false"
   inkscape:zoom="2.7812867"
   inkscape:cx="-16.021865"
   inkscape:cy="30"
   inkscape:window-width="1440"
   inkscape:window-height="857"
   inkscape:window-x="-2"
   inkscape:window-y="22"
   inkscape:window-maximized="1"
   inkscape:current-layer="layer1" />
  <g
   id="Layer_2"
   stroke="#000000">
    <path
   fill="none"
   stroke="none"
   d="M256,256H0V0h256V256z"
   id="path155" />
  </g>
  <g
   id="Layer_1"
   stroke="#000000">
    <path
   opacity="0.2"
   stroke="none"
   d="M50.867,22.925c-8.937,0-16.207,7.27-16.207,16.207v190.661    c0,8.937,7.27,16.207,16.207,16.207h167.783c8.937,0,16.206-7.271,16.206-16.207V39.132c0-8.937-7.27-16.207-16.206-16.207H50.867    z"
   id="path157" />
    <path
   fill="#003366"
   stroke="none"
   d="M43.97,16.206c-8.937,0-16.207,7.27-16.207,16.206v190.663    c0,8.936,7.27,16.206,16.207,16.206h167.783c8.936,0,16.206-7.271,16.206-16.206V32.412c0-8.936-7.271-16.206-16.206-16.206H43.97    z"
   id="path158" />
    <path
   fill="#3399FF"
   stroke="none"
   d="M32.53,223.074c0,6.317,5.122,11.439,11.44,11.439h167.783    c6.316,0,11.439-5.122,11.439-11.439V32.412c0-6.318-5.123-11.44-11.439-11.44H43.97c-6.318,0-11.44,5.122-11.44,11.44V223.074z"
   id="path159" />
    <linearGradient
   id="XMLID_1_"
   gradientUnits="userSpaceOnUse"
   x1="86.395"
   y1="86.2764"
   x2="312.3286"
   y2="312.2099">
      <stop
   offset="0"
   style="stop-color:#FFFFFF"
   id="stop161" />
      <stop
   offset="1"
   style="stop-color:#99CCFF"
   id="stop162" />
    </linearGradient>
    <path
   fill="url(#XMLID_1_)"
   stroke="none"
   d="M43.97,25.739c-3.679,0-6.673,2.994-6.673,6.673v190.663    c0,3.679,2.994,6.673,6.673,6.673h167.783c3.679,0,6.673-2.994,6.673-6.673V32.412c0-3.679-2.994-6.673-6.673-6.673H43.97z"
   id="path166" />
    <path
   opacity="0.4"
   fill="#FFFFFF"
   stroke="none"
   d="M161.228,106.77c17.724-16.617,39.026-24.792,61.965-28.852V32.412    c0-6.318-5.123-11.44-11.439-11.44H43.97c-6.318,0-11.44,5.122-11.44,11.44V168.99C79.797,172.557,124.503,139.668,161.228,106.77    z"
   id="path167" />
    <path
   display="none"
   fill="#CC6633"
   stroke="none"
   d="M199.466,44.37L174.48,31.817l-56.102,111.662c0,0,0.524,0.264,1.084,0.545    c10.732-2.683,21.618,2.015,25.293,11.405c0.204,0.518,0.374,1.041,0.525,1.566c0.544,0.273,1.027,0.517,1.027,0.517    l56.104-111.662L199.466,44.37z"
   id="path168" />
    
  </g><g
   inkscape:groupmode="layer"
   id="layer1"
   inkscape:label="Layer"
   style="display:inline"><g
   style="font-size:85.33333588px;font-style:normal;font-variant:normal;font-weight:normal;font-stretch:normal;text-align:start;line-height:125%;letter-spacing:0px;word-spacing:0px;writing-mode:lr-tb;text-anchor:start;fill:#000000;fill-opacity:1;stroke:none;font-family:Arial;-inkscape-font-specification:Arial"
   id="text3006"><path
     d="m 53.416124,101.32066 0,-61.083332 27.083334,0 c 5.444405,6.1e-5 9.58329,0.555616 12.416667,1.666667 2.833284,1.083392 5.097171,3.013945 6.791667,5.791667 1.694388,2.777829 2.541608,5.84727 2.541668,9.208333 -6e-5,4.333374 -1.40283,7.986148 -4.208335,10.958334 -2.805604,2.972253 -7.138933,4.86114 -13,5.666667 2.138848,1.027805 3.763847,2.041692 4.875,3.041667 2.361066,2.166689 4.597175,4.87502 6.708334,8.125 l 10.625001,16.624997 -10.166668,0 -8.083334,-12.70833 c -2.361151,-3.666651 -4.305593,-6.472203 -5.833333,-8.416667 -1.527813,-1.944422 -2.902812,-3.305531 -4.125,-4.083334 -1.194476,-0.777751 -2.416697,-1.319418 -3.666667,-1.625 -0.916695,-0.194417 -2.416693,-0.291639 -4.5,-0.291666 l -9.375001,0 0,27.124997 -8.083333,0 m 8.083333,-34.124998 17.375001,0 c 3.694409,3.5e-5 6.583295,-0.374965 8.666667,-1.125 2.08329,-0.777741 3.666622,-1.999962 4.75,-3.666666 1.083287,-1.694404 1.624953,-3.527736 1.625,-5.500001 -4.7e-5,-2.888841 -1.055602,-5.263839 -3.166667,-7.125 -2.083375,-1.861058 -5.388927,-2.791612 -9.916667,-2.791667 l -19.333334,0 0,20.208334"
     style=""
     id="path3166" /><path
     d="m 142.87446,95.86233 c -2.77781,2.361114 -5.45836,4.027779 -8.04167,5 -2.55558,0.97222 -5.30557,1.45833 -8.25,1.45833 -4.86112,0 -8.59723,-1.18055 -11.20833,-3.541663 -2.61112,-2.388884 -3.91667,-5.430548 -3.91667,-9.125001 0,-2.166652 0.48611,-4.138873 1.45834,-5.916666 0.99999,-1.805537 2.29166,-3.24998 3.875,-4.333334 1.6111,-1.08331 3.41665,-1.902754 5.41666,-2.458333 1.47221,-0.388864 3.69443,-0.763864 6.66667,-1.125 6.05553,-0.722196 10.51386,-1.583307 13.375,-2.583334 0.0277,-1.027748 0.0416,-1.680526 0.0417,-1.958333 -4e-5,-3.055523 -0.70837,-5.208298 -2.125,-6.458334 -1.9167,-1.694406 -4.76392,-2.541627 -8.54167,-2.541666 -3.5278,3.9e-5 -6.13891,0.625038 -7.83333,1.875 -1.66669,1.222258 -2.90279,3.402811 -3.70834,6.541667 l -7.33333,-1 c 0.66666,-3.138855 1.76388,-5.66663 3.29167,-7.583334 1.52776,-1.944403 3.7361,-3.430513 6.625,-4.458334 2.88887,-1.05551 6.23609,-1.583288 10.04166,-1.583333 3.77775,4.5e-5 6.84719,0.444489 9.20834,1.333333 2.36107,0.888932 4.09718,2.013931 5.20833,3.375001 1.11107,1.333372 1.88885,3.027815 2.33333,5.083333 0.24996,1.277812 0.37496,3.583365 0.375,6.916667 l 0,10 c -4e-5,6.972234 0.15274,11.388897 0.45834,13.250001 0.33329,1.833336 0.97218,3.597224 1.91666,5.291663 l -7.83333,0 c -0.77781,-1.555551 -1.27781,-3.374993 -1.5,-5.45833 m -0.625,-16.750001 c -2.72225,1.111133 -6.80558,2.055576 -12.25,2.833334 -3.08335,0.444463 -5.26391,0.944463 -6.54167,1.5 -1.27779,0.555573 -2.2639,1.375016 -2.95833,2.458333 -0.69446,1.05557 -1.04168,2.236125 -1.04167,3.541667 -1e-5,2.00001 0.74999,3.666675 2.25,5 1.52777,1.333339 3.74999,2.000005 6.66667,2 2.88886,5e-6 5.45831,-0.624994 7.70833,-1.875 2.24997,-1.27777 3.90275,-3.013879 4.95834,-5.208333 0.80552,-1.694431 1.2083,-4.194429 1.20833,-7.5 l 0,-2.750001"
     style=""
     id="path3168" /><path
     d="m 161.49946,101.32066 0,-44.249998 6.75,0 0,6.291667 c 3.24999,-4.861068 7.94443,-7.291622 14.08334,-7.291667 2.66663,4.5e-5 5.11108,0.486156 7.33333,1.458333 2.24996,0.944488 3.93052,2.194487 5.04167,3.750001 1.11107,1.555594 1.88884,3.402814 2.33333,5.541666 0.27774,1.388922 0.41663,3.819476 0.41667,7.291667 l 0,27.208331 -7.5,0 0,-26.916664 c -4e-5,-3.055526 -0.2917,-5.333301 -0.875,-6.833334 -0.58337,-1.527742 -1.62504,-2.736074 -3.125,-3.625 -1.47225,-0.916628 -3.20836,-1.374961 -5.20834,-1.375 -3.19446,3.9e-5 -5.95835,1.013927 -8.29166,3.041667 -2.30557,2.027812 -3.45835,5.87503 -3.45834,11.541667 l 0,24.166664 -7.5,0"
     style=""
     id="path3170" /><path
     d="m 206.0828,82.98733 0,-7.541667 23.04166,0 0,7.541667 -23.04166,0"
     style=""
     id="path3172" /><path
     d="m 50.957791,211.654 7.291666,1.08333 c 0.305544,2.25 1.152766,3.88888 2.541667,4.91667 1.861095,1.38888 4.40276,2.08332 7.625,2.08333 3.472198,-10e-6 6.15275,-0.69445 8.041667,-2.08333 1.888858,-1.3889 3.166634,-3.33334 3.833334,-5.83333 0.388855,-1.52778 0.56941,-4.73611 0.541666,-9.625 -3.277808,3.86111 -7.361138,5.79166 -12.25,5.79166 -6.083349,0 -10.791678,-2.19444 -14.125,-6.58333 -3.333338,-4.38888 -5.000003,-9.65276 -5.000001,-15.79167 -2e-6,-4.22219 0.763886,-8.11108 2.291667,-11.66666 1.527771,-3.5833 3.736103,-6.34719 6.625,-8.29167 2.916653,-1.9444 6.333316,-2.91662 10.250001,-2.91667 5.222195,5e-5 9.527746,2.11116 12.916667,6.33334 l 0,-5.33334 6.916667,0 0,38.25 c -4.2e-5,6.88889 -0.708375,11.76389 -2.125,14.625 -1.388928,2.88888 -3.611148,5.16666 -6.666667,6.83334 -3.027808,1.66665 -6.763916,2.49998 -11.208334,2.5 -5.277794,-2e-5 -9.541679,-1.19446 -12.791667,-3.58334 -3.250006,-2.36112 -4.819449,-5.93056 -4.708333,-10.70833 m 6.208333,-26.58333 c -1e-5,5.80557 1.152766,10.04168 3.458333,12.70833 2.30554,2.66667 5.194426,4.00001 8.666667,4 3.444419,1e-5 6.333305,-1.31944 8.666667,-3.95833 2.3333,-2.66666 3.499966,-6.83332 3.5,-12.5 -3.4e-5,-5.41664 -1.208367,-9.49997 -3.625,-12.25 -2.388917,-2.74997 -5.277803,-4.12497 -8.666667,-4.125 -3.333352,3e-5 -6.166683,1.36114 -8.5,4.08333 -2.333345,2.69448 -3.50001,6.70836 -3.5,12.04167"
     style=""
     id="path3174" /><path
     d="m 130.12446,193.73733 7.75,0.95834 c -1.22227,4.52778 -3.48615,8.04167 -6.79167,10.54166 -3.30559,2.5 -7.52781,3.75 -12.66667,3.75 -6.47224,0 -11.61112,-1.98611 -15.41666,-5.95833 -3.777786,-3.99999 -5.666673,-9.59721 -5.66667,-16.79167 -3e-6,-7.44441 1.916662,-13.22218 5.75,-17.33333 3.83332,-4.11107 8.80554,-6.16662 14.91667,-6.16667 5.91663,5e-5 10.74996,2.01393 14.5,6.04167 3.74996,4.02781 5.62495,9.69447 5.625,17 -5e-5,0.44447 -0.0139,1.11113 -0.0417,2 l -33,0 c 0.27777,4.86113 1.65277,8.58334 4.125,11.16667 2.47221,2.58334 5.55554,3.875 9.25,3.875 2.74997,0 5.09719,-0.72222 7.04167,-2.16667 1.94441,-1.44444 3.48607,-3.74999 4.625,-6.91667 m -24.625,-12.125 24.70833,0 c -0.33337,-3.72219 -1.27781,-6.51385 -2.83333,-8.375 -2.38892,-2.88885 -5.48614,-4.33329 -9.29167,-4.33333 -3.44446,4e-5 -6.34724,1.15281 -8.70833,3.45833 -2.33335,2.30559 -3.62501,5.38892 -3.875,9.25"
     style=""
     id="path3176" /></g>
</g><g
   inkscape:groupmode="layer"
   id="layer2"
   inkscape:label="Layer#1"
   style="display:inline"><g
     transform="translate(-0.45663995,1.0774246)"
     id="g169"><path
       style="opacity:0.2;stroke:none"
       inkscape:connector-curvature="0"
       d="m 175.822,131.428 c 0,0 0,16.447 0,27.528 -7.835,-7.835 -19.465,-19.466 -19.465,-19.466 -4.65,-4.65 -12.217,-4.65 -16.868,0 -2.253,2.253 -3.493,5.248 -3.493,8.435 0,3.186 1.24,6.181 3.493,8.434 0,0 11.63,11.63 19.465,19.465 -11.081,0 -27.526,0 -27.526,0 -6.577,0 -11.928,5.35 -11.928,11.927 0,6.577 5.351,11.927 11.928,11.927 0,0 16.447,0 27.527,0 -7.835,7.835 -19.465,19.467 -19.465,19.467 -2.326,2.325 -3.488,5.379 -3.488,8.433 0,3.055 1.162,6.108 3.488,8.434 2.252,2.253 5.248,3.494 8.434,3.494 3.186,0 6.181,-1.241 8.434,-3.494 0,0 11.63,-11.629 19.465,-19.464 0,11.079 0,27.527 0,27.527 0,6.576 5.352,11.927 11.928,11.927 6.576,0 11.928,-5.351 11.928,-11.927 0,0 0,-16.447 0,-27.527 7.835,7.835 19.465,19.464 19.465,19.464 2.252,2.253 5.248,3.494 8.434,3.494 3.186,0 6.181,-1.241 8.434,-3.494 2.252,-2.252 3.493,-5.247 3.493,-8.434 0,-3.186 -1.241,-6.181 -3.493,-8.434 0,0 -11.631,-11.631 -19.466,-19.466 11.081,0 27.528,0 27.528,0 6.577,0 11.928,-5.35 11.928,-11.927 0,-6.577 -5.351,-11.927 -11.928,-11.927 0,0 -16.446,0 -27.527,0 7.836,-7.835 19.465,-19.465 19.465,-19.465 2.326,-2.325 3.488,-5.38 3.488,-8.434 0,-3.055 -1.162,-6.109 -3.488,-8.435 -4.65,-4.65 -12.217,-4.65 -16.867,0 0,0 -11.63,11.63 -19.465,19.465 0,-11.08 0,-27.527 0,-27.527 0,-6.577 -5.352,-11.928 -11.928,-11.928 -6.576,0 -11.93,5.351 -11.93,11.928 z"
       id="path170" /><path
       style="fill:#e65c00;stroke:none"
       inkscape:connector-curvature="0"
       d="m 173.822,129.428 c 0,0 0,16.447 0,27.528 -7.835,-7.835 -19.465,-19.466 -19.465,-19.466 -4.65,-4.65 -12.217,-4.65 -16.868,0 -2.253,2.253 -3.493,5.248 -3.493,8.435 0,3.186 1.24,6.181 3.493,8.434 0,0 11.63,11.63 19.465,19.465 -11.081,0 -27.526,0 -27.526,0 -6.577,0 -11.928,5.35 -11.928,11.927 0,6.577 5.351,11.927 11.928,11.927 0,0 16.447,0 27.527,0 -7.835,7.835 -19.465,19.467 -19.465,19.467 -2.326,2.325 -3.488,5.379 -3.488,8.433 0,3.055 1.162,6.108 3.488,8.434 2.252,2.253 5.248,3.494 8.434,3.494 3.186,0 6.181,-1.241 8.434,-3.494 0,0 11.63,-11.629 19.465,-19.464 0,11.079 0,27.527 0,27.527 0,6.576 5.352,11.927 11.928,11.927 6.576,0 11.928,-5.351 11.928,-11.927 0,0 0,-16.447 0,-27.527 7.835,7.835 19.465,19.464 19.465,19.464 2.252,2.253 5.248,3.494 8.434,3.494 3.186,0 6.181,-1.241 8.434,-3.494 2.252,-2.252 3.493,-5.247 3.493,-8.434 0,-3.186 -1.241,-6.181 -3.493,-8.434 0,0 -11.631,-11.631 -19.466,-19.466 11.081,0 27.528,0 27.528,0 6.577,0 11.928,-5.35 11.928,-11.927 0,-6.577 -5.351,-11.927 -11.928,-11.927 0,0 -16.446,0 -27.527,0 7.836,-7.835 19.465,-19.465 19.465,-19.465 2.326,-2.325 3.488,-5.38 3.488,-8.434 0,-3.055 -1.162,-6.109 -3.488,-8.435 -4.65,-4.65 -12.217,-4.65 -16.867,0 0,0 -11.63,11.63 -19.465,19.465 0,-11.08 0,-27.527 0,-27.527 0,-6.577 -5.352,-11.928 -11.928,-11.928 -6.576,0 -11.93,5.351 -11.93,11.928 z"
       id="path171" /><linearGradient
       id="linearGradient3032"
       gradientUnits="userSpaceOnUse"
       x1="121.918"
       y1="185.75"
       x2="249.582"
       y2="185.75"><stop
         offset="0"
         style="stop-color:#FFFF66"
         id="stop3034" /><stop
         offset="1"
         style="stop-color:#FFCC66"
         id="stop3036" /></linearGradient><path
       style="fill:url(#linearGradient3068-2);stroke:none"
       inkscape:connector-curvature="0"
       d="m 242.072,178.24 h -38.191 l 27.006,-27.006 c 2.932,-2.933 2.932,-7.688 0,-10.62 -2.934,-2.933 -7.688,-2.933 -10.621,0 L 193.26,167.62 v -38.192 c 0,-4.148 -3.362,-7.51 -7.51,-7.51 -4.148,0 -7.51,3.362 -7.51,7.51 v 38.193 l -27.006,-27.007 c -2.934,-2.933 -7.688,-2.933 -10.621,0 -2.933,2.933 -2.933,7.688 0,10.62 l 27.006,27.006 h -38.191 c -4.148,0 -7.51,3.362 -7.51,7.51 0,4.148 3.361,7.51 7.51,7.51 h 38.193 l -27.008,27.007 c -2.932,2.933 -2.932,7.688 0,10.62 2.934,2.933 7.688,2.933 10.621,0 l 27.006,-27.006 v 38.192 c 0,4.147 3.362,7.509 7.51,7.509 4.148,0 7.51,-3.361 7.51,-7.509 v -38.192 l 27.006,27.006 c 2.933,2.933 7.688,2.933 10.62,0 2.932,-2.933 2.933,-7.688 0,-10.62 L 203.879,193.26 h 38.193 c 4.148,0 7.51,-3.362 7.51,-7.51 0,-4.148 -3.361,-7.51 -7.51,-7.51 z"
       id="path178" /><path
       style="fill:#ffff99;stroke:none"
       inkscape:connector-curvature="0"
       d="m 180.891,129.428 v 44.593 L 149.36,142.489 c -1.895,-1.895 -4.978,-1.895 -6.872,0 -0.917,0.918 -1.423,2.139 -1.423,3.437 0,1.298 0.506,2.518 1.423,3.436 l 31.53,31.53 h -44.59 c -2.68,0 -4.859,2.181 -4.859,4.859 0,2.68 2.18,4.859 4.859,4.859 h 44.592 l -31.531,31.531 c -1.895,1.895 -1.895,4.978 0,6.872 0.918,0.917 2.137,1.423 3.436,1.423 1.298,0 2.518,-0.506 3.436,-1.423 l 31.531,-31.53 v 44.591 c 0,2.68 2.18,4.858 4.859,4.858 2.679,0 4.859,-2.179 4.859,-4.858 v -44.591 l 31.53,31.53 c 0.918,0.917 2.138,1.423 3.437,1.423 1.298,0 2.518,-0.506 3.436,-1.423 0.918,-0.918 1.424,-2.138 1.424,-3.437 0,-1.298 -0.506,-2.518 -1.424,-3.436 l -31.531,-31.531 h 44.592 c 2.68,0 4.859,-2.18 4.859,-4.859 0,-2.679 -2.18,-4.859 -4.859,-4.859 h -44.59 l 31.529,-31.53 c 1.895,-1.895 1.896,-4.978 0,-6.872 -1.895,-1.895 -4.977,-1.895 -6.872,0 l -31.53,31.53 v -44.591 c 0,-2.68 -2.18,-4.86 -4.859,-4.86 -2.679,0 -4.861,2.18 -4.861,4.86 z"
       id="path179" /></g></g>
<text
   xml:space="preserve"
   style="font-size:13.99999989px;font-style:normal;font-variant:normal;font-weight:normal;font-stretch:normal;line-height:125%;letter-spacing:0px;word-spacing:0px;fill:#000000;fill-opacity:1;stroke:none;font-family:Arial;-inkscape-font-specification:Arial"
   x="13.983051"
   y="18.813559"
   id="text3002"
   sodipodi:linespacing="125%"
   transform="scale(4.2666667,4.2666667)"><tspan
     sodipodi:role="line"
     id="tspan3004" /></text>

</svg>