<?xml version="1.0" encoding="UTF-8" standalone="no"?>
<!-- Created with Sodipodi ("http://www.sodipodi.com/") -->

<svg
   xmlns:dc="http://purl.org/dc/elements/1.1/"
   xmlns:cc="http://creativecommons.org/ns#"
   xmlns:rdf="http://www.w3.org/1999/02/22-rdf-syntax-ns#"
   xmlns:svg="http://www.w3.org/2000/svg"
   xmlns="http://www.w3.org/2000/svg"
   xmlns:xlink="http://www.w3.org/1999/xlink"
   xmlns:sodipodi="http://sodipodi.sourceforge.net/DTD/sodipodi-0.dtd"
   xmlns:inkscape="http://www.inkscape.org/namespaces/inkscape"
   width="48pt"
   height="48pt"
   viewBox="0 0 256 256"
   overflow="visible"
   enable-background="new 0 0 256 256"
   xml:space="preserve"
   id="svg153"
   sodipodi:version="0.32pre"
   sodipodi:docname="newOptionDecorator.svg"
   version="1.1"
   inkscape:version="0.48.1 r9760"><metadata
   id="metadata25"><rdf:RDF><cc:Work
       rdf:about=""><dc:format>image/svg+xml</dc:format><dc:type
         rdf:resource="http://purl.org/dc/dcmitype/StillImage" /><dc:title /></cc:Work></rdf:RDF></metadata>
  <defs
   id="defs181"><linearGradient
     id="XMLID_2_"
     gradientUnits="userSpaceOnUse"
     x1="121.918"
     y1="185.75"
     x2="249.582"
     y2="185.75"><stop
       offset="0"
       style="stop-color:#FFFF66"
       id="stop173" /><stop
       offset="1"
       style="stop-color:#FFCC66"
       id="stop174" /></linearGradient><linearGradient
     inkscape:collect="always"
     xlink:href="#XMLID_2_-0"
     id="linearGradient3068-2"
     gradientUnits="userSpaceOnUse"
     x1="121.918"
     y1="185.75"
     x2="249.582"
     y2="185.75" /><linearGradient
     id="XMLID_2_-0"
     gradientUnits="userSpaceOnUse"
     x1="121.918"
     y1="185.75"
     x2="249.582"
     y2="185.75"><stop
       offset="0"
       style="stop-color:#FFFF66"
       id="stop173-1" /><stop
       offset="1"
       style="stop-color:#FFCC66"
       id="stop174-9" /></linearGradient></defs>
  <sodipodi:namedview
   id="base"
   showgrid="false"
   inkscape:zoom="2.7812867"
   inkscape:cx="-16.021865"
   inkscape:cy="30"
   inkscape:window-width="1440"
   inkscape:window-height="857"
   inkscape:window-x="-2"
   inkscape:window-y="22"
   inkscape:window-maximized="1"
   inkscape:current-layer="layer1" />
  <g
   id="Layer_2"
   stroke="#000000">
    <path
   fill="none"
   stroke="none"
   d="M256,256H0V0h256V256z"
   id="path155" />
  </g>
  <g
   id="Layer_1"
   stroke="#000000">
    <path
   opacity="0.2"
   stroke="none"
   d="M50.867,22.925c-8.937,0-16.207,7.27-16.207,16.207v190.661    c0,8.937,7.27,16.207,16.207,16.207h167.783c8.937,0,16.206-7.271,16.206-16.207V39.132c0-8.937-7.27-16.207-16.206-16.207H50.867    z"
   id="path157" />
    <path
   fill="#003366"
   stroke="none"
   d="M43.97,16.206c-8.937,0-16.207,7.27-16.207,16.206v190.663    c0,8.936,7.27,16.206,16.207,16.206h167.783c8.936,0,16.206-7.271,16.206-16.206V32.412c0-8.936-7.271-16.206-16.206-16.206H43.97    z"
   id="path158" />
    <path
   fill="#3399FF"
   stroke="none"
   d="M32.53,223.074c0,6.317,5.122,11.439,11.44,11.439h167.783    c6.316,0,11.439-5.122,11.439-11.439V32.412c0-6.318-5.123-11.44-11.439-11.44H43.97c-6.318,0-11.44,5.122-11.44,11.44V223.074z"
   id="path159" />
    <linearGradient
   id="XMLID_1_"
   gradientUnits="userSpaceOnUse"
   x1="86.395"
   y1="86.2764"
   x2="312.3286"
   y2="312.2099">
      <stop
   offset="0"
   style="stop-color:#FFFFFF"
   id="stop161" />
      <stop
   offset="1"
   style="stop-color:#99CCFF"
   id="stop162" />
    </linearGradient>
    <path
   fill="url(#XMLID_1_)"
   stroke="none"
   d="M43.97,25.739c-3.679,0-6.673,2.994-6.673,6.673v190.663    c0,3.679,2.994,6.673,6.673,6.673h167.783c3.679,0,6.673-2.994,6.673-6.673V32.412c0-3.679-2.994-6.673-6.673-6.673H43.97z"
   id="path166" />
    <path
   opacity="0.4"
   fill="#FFFFFF"
   stroke="none"
   d="M161.228,106.77c17.724-16.617,39.026-24.792,61.965-28.852V32.412    c0-6.318-5.123-11.44-11.439-11.44H43.97c-6.318,0-11.44,5.122-11.44,11.44V168.99C79.797,172.557,124.503,139.668,161.228,106.77    z"
   id="path167" />
    <path
   display="none"
   fill="#CC6633"
   stroke="none"
   d="M199.466,44.37L174.48,31.817l-56.102,111.662c0,0,0.524,0.264,1.084,0.545    c10.732-2.683,21.618,2.015,25.293,11.405c0.204,0.518,0.374,1.041,0.525,1.566c0.544,0.273,1.027,0.517,1.027,0.517    l56.104-111.662L199.466,44.37z"
   id="path168" />
    
  </g><g
   inkscape:groupmode="layer"
   id="layer1"
   inkscape:label="Layer"
   style="display:inline"><g
   style="font-size:85.33333588px;font-style:normal;font-variant:normal;font-weight:normal;font-stretch:normal;text-align:start;line-height:125%;letter-spacing:0px;word-spacing:0px;writing-mode:lr-tb;text-anchor:start;fill:#000000;fill-opacity:1;stroke:none;font-family:Arial;-inkscape-font-specification:Arial"
   id="text3006"><path
     d="m 53.291124,101.32066 0,-61.083332 21.041667,0 c 4.749968,6.1e-5 8.374964,0.291728 10.875001,0.875 3.499958,0.805615 6.486066,2.263947 8.958333,4.375 3.222172,2.722276 5.624947,6.208384 7.208335,10.458334 1.61105,4.222264 2.41661,9.055592 2.41667,14.500001 -6e-5,4.638915 -0.54173,8.750022 -1.625,12.333333 -1.08339,3.583349 -2.47228,6.555568 -4.166671,8.916667 -1.694495,2.333341 -3.555604,4.180561 -5.583334,5.541667 -2.000044,1.333336 -4.430597,2.347224 -7.291667,3.04167 -2.833369,0.69444 -6.097255,1.04166 -9.791667,1.04166 l -22.041667,0 m 8.083333,-7.20833 13.041668,0 c 4.027746,7e-6 7.18052,-0.374993 9.458333,-1.125 2.305516,-0.749991 4.138848,-1.805546 5.5,-3.166667 1.916622,-1.916653 3.402732,-4.486095 4.458334,-7.708333 1.083285,-3.249978 1.624951,-7.18053 1.625,-11.791667 -4.9e-5,-6.388852 -1.055603,-11.291625 -3.166667,-14.708334 -2.083377,-3.444396 -4.625041,-5.749949 -7.625,-6.916667 -2.166703,-0.83328 -5.65281,-1.249946 -10.458334,-1.25 l -12.833334,0 0,46.666668"
     style=""
     id="path3017" /><path
     d="m 144.29113,87.070663 7.75,0.958333 c -1.22227,4.527787 -3.48616,8.041673 -6.79167,10.541667 -3.30559,2.499997 -7.52781,3.749997 -12.66667,3.749997 -6.47224,0 -11.61112,-1.98611 -15.41666,-5.95833 -3.77779,-3.999991 -5.66667,-9.597208 -5.66667,-16.791667 0,-7.444416 1.91666,-13.222188 5.75,-17.333334 3.83332,-4.111068 8.80554,-6.166622 14.91667,-6.166667 5.91663,4.5e-5 10.74996,2.013932 14.5,6.041667 3.74995,4.027813 5.62495,9.694474 5.625,17 -5e-5,0.444467 -0.0139,1.111133 -0.0417,2.000001 l -33,0 c 0.27777,4.861126 1.65276,8.583345 4.125,11.166667 2.4722,2.583339 5.55553,3.875005 9.25,3.875 2.74997,5e-6 5.09719,-0.722217 7.04167,-2.166667 1.94441,-1.444436 3.48607,-3.749989 4.625,-6.916667 m -24.625,-12.125 24.70833,0 c -0.33337,-3.722193 -1.27781,-6.513857 -2.83333,-8.375001 -2.38892,-2.888851 -5.48614,-4.333294 -9.29167,-4.333333 -3.44447,3.9e-5 -6.34724,1.152816 -8.70833,3.458333 -2.33335,2.305589 -3.62502,5.38892 -3.875,9.250001"
     style=""
     id="path3019" /><path
     d="m 190.37446,85.11233 7.375,0.958333 c -0.80559,5.083344 -2.87504,9.069451 -6.20833,11.958334 -3.30559,2.861113 -7.37503,4.291663 -12.20833,4.291663 -6.05558,0 -10.93057,-1.97222 -14.625,-5.916663 -3.66668,-3.972214 -5.50001,-9.652764 -5.5,-17.041668 -1e-5,-4.777751 0.79166,-8.958302 2.375,-12.541667 1.58332,-3.583295 3.9861,-6.263848 7.20833,-8.041666 3.24998,-1.805512 6.77776,-2.708289 10.58333,-2.708334 4.80553,4.5e-5 8.73608,1.222266 11.79167,3.666667 3.05552,2.416706 5.01385,5.861147 5.875,10.333334 l -7.29167,1.125 c -0.69447,-2.97219 -1.93058,-5.208299 -3.70833,-6.708334 -1.75003,-1.499962 -3.87503,-2.249961 -6.375,-2.25 -3.7778,3.9e-5 -6.84724,1.361149 -9.20833,4.083333 -2.36113,2.694477 -3.54168,6.972251 -3.54167,12.833334 -1e-5,5.944461 1.13888,10.263901 3.41667,12.958334 2.27776,2.694451 5.24998,4.041672 8.91666,4.041667 2.94442,5e-6 5.40275,-0.902772 7.375,-2.708334 1.97219,-1.805546 3.22219,-4.583321 3.75,-8.333333"
     style=""
     id="path3021" /><path
     d="m 201.24947,82.98733 0,-7.541667 23.04166,0 0,7.541667 -23.04166,0"
     style=""
     id="path3023" /><path
     d="m 49.541124,185.86233 c -3e-6,-8.19441 2.277773,-14.26385 6.833333,-18.20833 3.805543,-3.27774 8.444427,-4.91662 13.916667,-4.91667 6.083304,5e-5 11.055522,2.00005 14.916668,6 3.861068,3.97226 5.791622,9.47225 5.791666,16.5 -4.4e-5,5.69446 -0.861154,10.18057 -2.583333,13.45834 -1.694485,3.25 -4.180593,5.77778 -7.458334,7.58333 -3.250031,1.80556 -6.805583,2.70833 -10.666667,2.70833 -6.194462,0 -11.208346,-1.98611 -15.041667,-5.95833 -3.80556,-3.97221 -5.708336,-9.69443 -5.708333,-17.16667 m 7.708333,0 c -10e-6,5.66669 1.2361,9.91668 3.708334,12.75 2.472205,2.80557 5.583313,4.20834 9.333333,4.20834 3.722195,0 6.819415,-1.41666 9.291667,-4.25 2.472187,-2.83332 3.708297,-7.15277 3.708334,-12.95834 -3.7e-5,-5.47219 -1.250036,-9.61108 -3.75,-12.41666 -2.472253,-2.8333 -5.555583,-4.24997 -9.250001,-4.25 -3.75002,3e-5 -6.861128,1.40281 -9.333333,4.20833 -2.472234,2.80559 -3.708344,7.04169 -3.708334,12.70833"
     style=""
     id="path3025" /><path
     d="m 99.749457,207.98733 0,-44.25 6.750003,0 0,6.70834 c 1.72221,-3.13885 3.30554,-5.2083 4.75,-6.20834 1.4722,-0.99995 3.08331,-1.49995 4.83333,-1.5 2.52775,5e-5 5.0972,0.8056 7.70833,2.41667 l -2.58333,6.95833 c -1.83336,-1.08329 -3.66669,-1.62496 -5.5,-1.625 -1.63891,4e-5 -3.11113,0.50004 -4.41667,1.5 -1.30557,0.97226 -2.23612,2.33337 -2.79166,4.08334 -0.83335,2.66669 -1.25002,5.58336 -1.25,8.75 l 0,23.16666 -7.500003,0"
     style=""
     id="path3027" /><path
     d="m 157.20779,202.529 c -2.77781,2.36111 -5.45836,4.02778 -8.04167,5 -2.55558,0.97222 -5.30557,1.45833 -8.25,1.45833 -4.86112,0 -8.59723,-1.18055 -11.20833,-3.54166 -2.61111,-2.38889 -3.91667,-5.43055 -3.91667,-9.125 0,-2.16666 0.48611,-4.13888 1.45834,-5.91667 0.99999,-1.80554 2.29166,-3.24998 3.875,-4.33333 1.6111,-1.08331 3.41665,-1.90276 5.41666,-2.45834 1.47221,-0.38886 3.69443,-0.76386 6.66667,-1.125 6.05553,-0.72219 10.51386,-1.5833 13.375,-2.58333 0.0277,-1.02775 0.0416,-1.68053 0.0417,-1.95833 -4e-5,-3.05553 -0.70837,-5.2083 -2.125,-6.45834 -1.9167,-1.6944 -4.76392,-2.54163 -8.54167,-2.54166 -3.5278,3e-5 -6.13891,0.62503 -7.83333,1.875 -1.66668,1.22225 -2.90279,3.40281 -3.70834,6.54166 l -7.33333,-1 c 0.66666,-3.13885 1.76388,-5.66663 3.29167,-7.58333 1.52777,-1.9444 3.7361,-3.43051 6.625,-4.45833 2.88887,-1.05552 6.23609,-1.58329 10.04166,-1.58334 3.77775,5e-5 6.8472,0.44449 9.20834,1.33334 2.36107,0.88893 4.09718,2.01393 5.20833,3.375 1.11107,1.33337 1.88885,3.02781 2.33333,5.08333 0.24996,1.27781 0.37496,3.58336 0.375,6.91667 l 0,10 c -4e-5,6.97223 0.15274,11.38889 0.45834,13.25 0.33329,1.83333 0.97218,3.59722 1.91667,5.29166 l -7.83334,0 c -0.77781,-1.55555 -1.27781,-3.37499 -1.5,-5.45833 m -0.625,-16.75 c -2.72225,1.11113 -6.80558,2.05558 -12.25,2.83333 -3.08335,0.44447 -5.2639,0.94447 -6.54167,1.5 -1.27779,0.55558 -2.2639,1.37502 -2.95833,2.45834 -0.69446,1.05557 -1.04168,2.23612 -1.04167,3.54166 -1e-5,2.00001 0.74999,3.66668 2.25,5 1.52777,1.33334 3.74999,2.00001 6.66667,2 2.88887,1e-5 5.45831,-0.62499 7.70833,-1.875 2.24997,-1.27777 3.90275,-3.01388 4.95834,-5.20833 0.80552,-1.69443 1.2083,-4.19443 1.20833,-7.5 l 0,-2.75"
     style=""
     id="path3029" /></g>
</g><g
   inkscape:groupmode="layer"
   id="layer2"
   inkscape:label="Layer#1"
   style="display:inline"><g
     transform="translate(-0.45663995,1.0774246)"
     id="g169"><path
       style="opacity:0.2;stroke:none"
       inkscape:connector-curvature="0"
       d="m 175.822,131.428 c 0,0 0,16.447 0,27.528 -7.835,-7.835 -19.465,-19.466 -19.465,-19.466 -4.65,-4.65 -12.217,-4.65 -16.868,0 -2.253,2.253 -3.493,5.248 -3.493,8.435 0,3.186 1.24,6.181 3.493,8.434 0,0 11.63,11.63 19.465,19.465 -11.081,0 -27.526,0 -27.526,0 -6.577,0 -11.928,5.35 -11.928,11.927 0,6.577 5.351,11.927 11.928,11.927 0,0 16.447,0 27.527,0 -7.835,7.835 -19.465,19.467 -19.465,19.467 -2.326,2.325 -3.488,5.379 -3.488,8.433 0,3.055 1.162,6.108 3.488,8.434 2.252,2.253 5.248,3.494 8.434,3.494 3.186,0 6.181,-1.241 8.434,-3.494 0,0 11.63,-11.629 19.465,-19.464 0,11.079 0,27.527 0,27.527 0,6.576 5.352,11.927 11.928,11.927 6.576,0 11.928,-5.351 11.928,-11.927 0,0 0,-16.447 0,-27.527 7.835,7.835 19.465,19.464 19.465,19.464 2.252,2.253 5.248,3.494 8.434,3.494 3.186,0 6.181,-1.241 8.434,-3.494 2.252,-2.252 3.493,-5.247 3.493,-8.434 0,-3.186 -1.241,-6.181 -3.493,-8.434 0,0 -11.631,-11.631 -19.466,-19.466 11.081,0 27.528,0 27.528,0 6.577,0 11.928,-5.35 11.928,-11.927 0,-6.577 -5.351,-11.927 -11.928,-11.927 0,0 -16.446,0 -27.527,0 7.836,-7.835 19.465,-19.465 19.465,-19.465 2.326,-2.325 3.488,-5.38 3.488,-8.434 0,-3.055 -1.162,-6.109 -3.488,-8.435 -4.65,-4.65 -12.217,-4.65 -16.867,0 0,0 -11.63,11.63 -19.465,19.465 0,-11.08 0,-27.527 0,-27.527 0,-6.577 -5.352,-11.928 -11.928,-11.928 -6.576,0 -11.93,5.351 -11.93,11.928 z"
       id="path170" /><path
       style="fill:#e65c00;stroke:none"
       inkscape:connector-curvature="0"
       d="m 173.822,129.428 c 0,0 0,16.447 0,27.528 -7.835,-7.835 -19.465,-19.466 -19.465,-19.466 -4.65,-4.65 -12.217,-4.65 -16.868,0 -2.253,2.253 -3.493,5.248 -3.493,8.435 0,3.186 1.24,6.181 3.493,8.434 0,0 11.63,11.63 19.465,19.465 -11.081,0 -27.526,0 -27.526,0 -6.577,0 -11.928,5.35 -11.928,11.927 0,6.577 5.351,11.927 11.928,11.927 0,0 16.447,0 27.527,0 -7.835,7.835 -19.465,19.467 -19.465,19.467 -2.326,2.325 -3.488,5.379 -3.488,8.433 0,3.055 1.162,6.108 3.488,8.434 2.252,2.253 5.248,3.494 8.434,3.494 3.186,0 6.181,-1.241 8.434,-3.494 0,0 11.63,-11.629 19.465,-19.464 0,11.079 0,27.527 0,27.527 0,6.576 5.352,11.927 11.928,11.927 6.576,0 11.928,-5.351 11.928,-11.927 0,0 0,-16.447 0,-27.527 7.835,7.835 19.465,19.464 19.465,19.464 2.252,2.253 5.248,3.494 8.434,3.494 3.186,0 6.181,-1.241 8.434,-3.494 2.252,-2.252 3.493,-5.247 3.493,-8.434 0,-3.186 -1.241,-6.181 -3.493,-8.434 0,0 -11.631,-11.631 -19.466,-19.466 11.081,0 27.528,0 27.528,0 6.577,0 11.928,-5.35 11.928,-11.927 0,-6.577 -5.351,-11.927 -11.928,-11.927 0,0 -16.446,0 -27.527,0 7.836,-7.835 19.465,-19.465 19.465,-19.465 2.326,-2.325 3.488,-5.38 3.488,-8.434 0,-3.055 -1.162,-6.109 -3.488,-8.435 -4.65,-4.65 -12.217,-4.65 -16.867,0 0,0 -11.63,11.63 -19.465,19.465 0,-11.08 0,-27.527 0,-27.527 0,-6.577 -5.352,-11.928 -11.928,-11.928 -6.576,0 -11.93,5.351 -11.93,11.928 z"
       id="path171" /><linearGradient
       id="linearGradient3032"
       gradientUnits="userSpaceOnUse"
       x1="121.918"
       y1="185.75"
       x2="249.582"
       y2="185.75"><stop
         offset="0"
         style="stop-color:#FFFF66"
         id="stop3034" /><stop
         offset="1"
         style="stop-color:#FFCC66"
         id="stop3036" /></linearGradient><path
       style="fill:url(#linearGradient3068-2);stroke:none"
       inkscape:connector-curvature="0"
       d="m 242.072,178.24 h -38.191 l 27.006,-27.006 c 2.932,-2.933 2.932,-7.688 0,-10.62 -2.934,-2.933 -7.688,-2.933 -10.621,0 L 193.26,167.62 v -38.192 c 0,-4.148 -3.362,-7.51 -7.51,-7.51 -4.148,0 -7.51,3.362 -7.51,7.51 v 38.193 l -27.006,-27.007 c -2.934,-2.933 -7.688,-2.933 -10.621,0 -2.933,2.933 -2.933,7.688 0,10.62 l 27.006,27.006 h -38.191 c -4.148,0 -7.51,3.362 -7.51,7.51 0,4.148 3.361,7.51 7.51,7.51 h 38.193 l -27.008,27.007 c -2.932,2.933 -2.932,7.688 0,10.62 2.934,2.933 7.688,2.933 10.621,0 l 27.006,-27.006 v 38.192 c 0,4.147 3.362,7.509 7.51,7.509 4.148,0 7.51,-3.361 7.51,-7.509 v -38.192 l 27.006,27.006 c 2.933,2.933 7.688,2.933 10.62,0 2.932,-2.933 2.933,-7.688 0,-10.62 L 203.879,193.26 h 38.193 c 4.148,0 7.51,-3.362 7.51,-7.51 0,-4.148 -3.361,-7.51 -7.51,-7.51 z"
       id="path178" /><path
       style="fill:#ffff99;stroke:none"
       inkscape:connector-curvature="0"
       d="m 180.891,129.428 v 44.593 L 149.36,142.489 c -1.895,-1.895 -4.978,-1.895 -6.872,0 -0.917,0.918 -1.423,2.139 -1.423,3.437 0,1.298 0.506,2.518 1.423,3.436 l 31.53,31.53 h -44.59 c -2.68,0 -4.859,2.181 -4.859,4.859 0,2.68 2.18,4.859 4.859,4.859 h 44.592 l -31.531,31.531 c -1.895,1.895 -1.895,4.978 0,6.872 0.918,0.917 2.137,1.423 3.436,1.423 1.298,0 2.518,-0.506 3.436,-1.423 l 31.531,-31.53 v 44.591 c 0,2.68 2.18,4.858 4.859,4.858 2.679,0 4.859,-2.179 4.859,-4.858 v -44.591 l 31.53,31.53 c 0.918,0.917 2.138,1.423 3.437,1.423 1.298,0 2.518,-0.506 3.436,-1.423 0.918,-0.918 1.424,-2.138 1.424,-3.437 0,-1.298 -0.506,-2.518 -1.424,-3.436 l -31.531,-31.531 h 44.592 c 2.68,0 4.859,-2.18 4.859,-4.859 0,-2.679 -2.18,-4.859 -4.859,-4.859 h -44.59 l 31.529,-31.53 c 1.895,-1.895 1.896,-4.978 0,-6.872 -1.895,-1.895 -4.977,-1.895 -6.872,0 l -31.53,31.53 v -44.591 c 0,-2.68 -2.18,-4.86 -4.859,-4.86 -2.679,0 -4.861,2.18 -4.861,4.86 z"
       id="path179" /></g></g>
<text
   xml:space="preserve"
   style="font-size:13.99999989px;font-style:normal;font-variant:normal;font-weight:normal;font-stretch:normal;line-height:125%;letter-spacing:0px;word-spacing:0px;fill:#000000;fill-opacity:1;stroke:none;font-family:Arial;-inkscape-font-specification:Arial"
   x="13.983051"
   y="18.813559"
   id="text3002"
   sodipodi:linespacing="125%"
   transform="scale(4.2666667,4.2666667)"><tspan
     sodipodi:role="line"
     id="tspan3004" /></text>

</svg>