qqHH_CV_1_C2V_1_kl_0_2B2Tau=qqHH_CV_1_C2V_1_kl_0_hbbhtt
qqHH_CV_1_C2V_1_kl_1_2B2Tau=qqHH_CV_1_C2V_1_kl_1_hbbhtt
qqHH_CV_1_C2V_1_kl_2_2B2Tau=qqHH_CV_1_C2V_1_kl_2_hbbhtt
qqHH_CV_1_C2V_2_kl_1_2B2Tau=qqHH_CV_1_C2V_2_kl_1_hbbhtt
qqHH_CV_1_5_C2V_1_kl_1_2B2Tau=qqHH_CV_1p5_C2V_1_kl_1_hbbhtt
qqHH_CV_0_5_C2V_1_kl_1_2B2Tau=qqHH_CV_0p5_C2V_1_kl_1_hbbhtt
qqHH_CV_1_C2V_0_kl_1_2B2Tau=qqHH_CV_1_C2V_0_kl_1_hbbhtt
ggHH_kl_0_kt_1_2B2Tau=ggHH_kl_0_kt_1_hbbhtt
ggHH_kl_1_kt_1_2B2Tau=ggHH_kl_1_kt_1_hbbhtt
ggHH_kl_2p45_kt_1_2B2Tau=ggHH_kl_2p45_kt_1_hbbhtt
ggHH_kl_5_kt_1_2B2Tau=ggHH_kl_5_kt_1_hbbhtt
qqHH_CV_1_C2V_1_kl_0_2B2V=qqHH_CV_1_C2V_1_kl_0_hbbhww
qqHH_CV_1_C2V_1_kl_1_2B2V=qqHH_CV_1_C2V_1_kl_1_hbbhww
qqHH_CV_1_C2V_1_kl_2_2B2V=qqHH_CV_1_C2V_1_kl_2_hbbhww
qqHH_CV_1_C2V_2_kl_1_2B2V=qqHH_CV_1_C2V_2_kl_1_hbbhww
qqHH_CV_1_5_C2V_1_kl_1_2B2V=qqHH_CV_1p5_C2V_1_kl_1_hbbhww
qqHH_CV_0_5_C2V_1_kl_1_2B2V=qqHH_CV_0p5_C2V_1_kl_1_hbbhww
qqHH_CV_1_C2V_0_kl_1_2B2V=qqHH_CV_1_C2V_0_kl_1_hbbhww
ggHH_kl_0_kt_1_2B2V=ggHH_kl_0_kt_1_hbbhww
ggHH_kl_1_kt_1_2B2V=ggHH_kl_1_kt_1_hbbhww
ggHH_kl_2p45_kt_1_2B2V=ggHH_kl_2p45_kt_1_hbbhww
ggHH_kl_5_kt_1_2B2V=ggHH_kl_5_kt_1_hbbhww
GluGluHToTauTau_M125=ggH_htt
GluGluHToBB_M125=ggH_hbb
GluGluHToWWToLNuQQ_M125_NNPDF31=ggH_hww
VBFHToTauTau_M125=qqH_htt
VBFHToBB_M_125=qqH_hbb
VBFHToWWToLNuQQ_M125_NNPDF31=qqH_hww
WH=WH_hbb
dc_ZHbb=ZH_hbb
dc_ggHbb=ggH_hbb
dc_qqHbb=qqH_hbb
ZHToTauTau_M125=ZH_htt
ttH=ttH_hbb
THQ_ctcvcp_4f_Hincl=tHq_hbb
THW_ctcvcp_5f_Hincl=tHW_hbb
DYest=DY
st=ST
tt=TT
vv=VV
vvv=VVV
dc_others=Other_bbWW
fakes=Fakes
dc_ttVX=TTVX